All pastes #589310 Raw Edit

src.log

public text v1 · immutable
#589310 ·published 2007-06-25 22:17 UTC
rendered paste body
src:
     [echo] 
     [echo]       ******************************************************************
     [echo]       *                       DELETING FOLDERS                         *
     [echo]       ******************************************************************
     [echo]     
     [echo] 
     [echo]       ******************************************************************
     [echo]       *               UNCOMPRESSING NEW VERSION FILES                  *
     [echo]       ******************************************************************
     [echo]     
    [unzip] Expanding: D:\Files\SharedApps\OpenBravo\AppsOpenbravo\backup\DOWNLOAD\AppsOpenbravo (Version 2.22).zip into D:\Files\SharedApps\OpenBravo\AppsOpenbravo
     [exec] Unable to locate tools.jar. Expected to find it in C:\Program Files\Java\jre1.6.0_01\lib\tools.jar
     [exec] Buildfile: build.xml
     [exec] 
     [exec] setup.compile:
     [exec] 
     [exec] compile:
     [exec]     [javac] Compiling 1 source file to D:\Files\SharedApps\OpenBravo\AppsOpenbravo\setup\setup
     [exec] 
     [exec] BUILD FAILED
     [exec] D:\Files\SharedApps\OpenBravo\AppsOpenbravo\build.xml:149: The following error occurred while executing this line:
     [exec] D:\Files\SharedApps\OpenBravo\AppsOpenbravo\setup\build.xml:39: Unable to find a javac compiler;
     [exec] com.sun.tools.javac.Main is not on the classpath.
     [exec] Perhaps JAVA_HOME does not point to the JDK.
     [exec] It is currently set to "C:\Program Files\Java\jre1.6.0_01"
     [exec] 
     [exec] Total time: 1 second

directSetup:
     [java] java.lang.NoClassDefFoundError: Setup
     [java] Exception in thread "main" 
     [java] Java Result: 1
     [exec] Unable to locate tools.jar. Expected to find it in C:\Program Files\Java\jre1.6.0_01\lib\tools.jar
     [exec] Buildfile: build.xml
     [exec] 
     [exec] core.lib:
     [exec] 
     [exec] clean:
     [exec] 
     [exec] init:
     [exec]     [mkdir] Created dir: D:\Files\SharedApps\OpenBravo\AppsOpenbravo\build\classes\core
     [exec]     [mkdir] Created dir: D:\Files\SharedApps\OpenBravo\AppsOpenbravo\docs\api\core
     [exec] 
     [exec] compile:
     [exec]     [javac] Compiling 95 source files to D:\Files\SharedApps\OpenBravo\AppsOpenbravo\build\classes\core
     [exec] 
     [exec] BUILD FAILED
     [exec] D:\Files\SharedApps\OpenBravo\AppsOpenbravo\build.xml:109: The following error occurred while executing this line:
     [exec] D:\Files\SharedApps\OpenBravo\AppsOpenbravo\src-core\build.xml:33: Unable to find a javac compiler;
     [exec] com.sun.tools.javac.Main is not on the classpath.
     [exec] Perhaps JAVA_HOME does not point to the JDK.
     [exec] It is currently set to "C:\Program Files\Java\jre1.6.0_01"
     [exec] 
     [exec] Total time: 1 second
     [exec] Unable to locate tools.jar. Expected to find it in C:\Program Files\Java\jre1.6.0_01\lib\tools.jar
     [exec] Buildfile: build.xml
     [exec] 
     [exec] wad.lib:
     [exec] 
     [exec] clean:
     [exec] 
     [exec] init:
     [exec]     [mkdir] Created dir: D:\Files\SharedApps\OpenBravo\AppsOpenbravo\build\classes\wad
     [exec]     [mkdir] Created dir: D:\Files\SharedApps\OpenBravo\AppsOpenbravo\docs\api\wad
     [exec]     [mkdir] Created dir: D:\Files\SharedApps\OpenBravo\AppsOpenbravo\build\javasqlc\wad
     [exec] 
     [exec] sqlc:
     [exec]      [java] java.lang.NoClassDefFoundError: org/openbravo/data/Sqlc
     [exec]      [java] Exception in thread "main" 
     [exec]      [java] Java Result: 1
     [exec] 
     [exec] compileSqlc:
     [exec] 
     [exec] compile:
     [exec]     [javac] Compiling 7 source files to D:\Files\SharedApps\OpenBravo\AppsOpenbravo\build\classes\wad
     [exec] 
     [exec] BUILD FAILED
     [exec] D:\Files\SharedApps\OpenBravo\AppsOpenbravo\build.xml:113: The following error occurred while executing this line:
     [exec] D:\Files\SharedApps\OpenBravo\AppsOpenbravo\src-wad\build.xml:50: Unable to find a javac compiler;
     [exec] com.sun.tools.javac.Main is not on the classpath.
     [exec] Perhaps JAVA_HOME does not point to the JDK.
     [exec] It is currently set to "C:\Program Files\Java\jre1.6.0_01"
     [exec] 
     [exec] Total time: 2 seconds
     [exec] Unable to locate tools.jar. Expected to find it in C:\Program Files\Java\jre1.6.0_01\lib\tools.jar
     [exec] Buildfile: build.xml
     [exec] 
     [exec] trl.lib:
     [exec] 
     [exec] clean:
     [exec] 
     [exec] init:
     [exec]     [mkdir] Created dir: D:\Files\SharedApps\OpenBravo\AppsOpenbravo\build\classes\trl
     [exec]     [mkdir] Created dir: D:\Files\SharedApps\OpenBravo\AppsOpenbravo\build\javasqlc\trl
     [exec]     [mkdir] Created dir: D:\Files\SharedApps\OpenBravo\AppsOpenbravo\docs\api\trl
     [exec] 
     [exec] sqlc:
     [exec]      [java] java.lang.NoClassDefFoundError: org/openbravo/data/Sqlc
     [exec]      [java] Exception in thread "main" 
     [exec]      [java] Java Result: 1
     [exec] 
     [exec] compileSqlc:
     [exec] 
     [exec] compile:
     [exec]     [javac] Compiling 3 source files to D:\Files\SharedApps\OpenBravo\AppsOpenbravo\build\classes\trl
     [exec] 
     [exec] BUILD FAILED
     [exec] D:\Files\SharedApps\OpenBravo\AppsOpenbravo\build.xml:117: The following error occurred while executing this line:
     [exec] D:\Files\SharedApps\OpenBravo\AppsOpenbravo\src-trl\build.xml:48: Unable to find a javac compiler;
     [exec] com.sun.tools.javac.Main is not on the classpath.
     [exec] Perhaps JAVA_HOME does not point to the JDK.
     [exec] It is currently set to "C:\Program Files\Java\jre1.6.0_01"
     [exec] 
     [exec] Total time: 1 second
     [exec] Unable to locate tools.jar. Expected to find it in C:\Program Files\Java\jre1.6.0_01\lib\tools.jar
     [exec] Buildfile: build.xml
     [exec] 
     [exec] compile.complete:
     [exec] 
     [exec] clean:
     [exec] 
     [exec] init:
     [exec]     [mkdir] Created dir: D:\Files\SharedApps\OpenBravo\AppsOpenbravo\build\classes\src
     [exec]     [mkdir] Created dir: D:\Files\SharedApps\OpenBravo\AppsOpenbravo\src-loc\design
     [exec]     [mkdir] Created dir: D:\Files\SharedApps\OpenBravo\AppsOpenbravo\build\javasqlc\src
     [exec]     [mkdir] Created dir: D:\Files\SharedApps\OpenBravo\AppsOpenbravo\srcAD
     [exec]     [mkdir] Created dir: D:\Files\SharedApps\OpenBravo\AppsOpenbravo\srcAD\org\openbravo\erpWindows
     [exec]     [mkdir] Created dir: D:\Files\SharedApps\OpenBravo\AppsOpenbravo\srcAD\org\openbravo\erpCommon\ad_actionButton
     [exec]     [mkdir] Created dir: D:\Files\SharedApps\OpenBravo\AppsOpenbravo\srcAD\org\openbravo\erpCommon\ad_callouts
     [exec]     [mkdir] Created dir: D:\Files\SharedApps\OpenBravo\AppsOpenbravo\srcAD\org\openbravo\erpCommon\reference
     [exec]     [mkdir] Created dir: D:\Files\SharedApps\OpenBravo\AppsOpenbravo\docs\api\src
     [exec] 
     [exec] wad:
     [exec]      [java] java.lang.NoClassDefFoundError: org/openbravo/wad/Wad
     [exec]      [java] Exception in thread "main" 
     [exec]      [java] Java Result: 1
     [exec] 
     [exec] postwad:
     [exec] 
     [exec] copy.srcClient:
     [exec]     [mkdir] Created dir: D:\Files\SharedApps\OpenBravo\AppsOpenbravo\srcClient
     [exec] 
     [exec] sqlc:
     [exec]      [java] java.lang.NoClassDefFoundError: org/openbravo/data/Sqlc
     [exec]      [java] Exception in thread "main" 
     [exec]      [java] Java Result: 1
     [exec]      [copy] Copying 1 file to D:\Files\SharedApps\OpenBravo\AppsOpenbravo\srcAD
     [exec]      [copy] Copying 1 file to D:\Files\SharedApps\OpenBravo\AppsOpenbravo\srcAD
     [exec] 
     [exec] buildAD:
     [exec]      [java] java.lang.NoClassDefFoundError: org/openbravo/data/Sqlc
     [exec]      [java] Exception in thread "main" 
     [exec]      [java] Java Result: 1
     [exec] 
     [exec] compileSqlc:
     [exec] 
     [exec] BUILD FAILED
     [exec] D:\Files\SharedApps\OpenBravo\AppsOpenbravo\build.xml:85: The following error occurred while executing this line:
     [exec] D:\Files\SharedApps\OpenBravo\AppsOpenbravo\src\build.xml:76: srcdir "D:\Files\SharedApps\OpenBravo\AppsOpenbravo\build\javasqlc\srcAD\org\openbravo\erpCommon\reference" does not exist!
     [exec] 
     [exec] Total time: 48 seconds
     [exec] Unable to locate tools.jar. Expected to find it in C:\Program Files\Java\jre1.6.0_01\lib\tools.jar
     [exec] Buildfile: build.xml
     [exec] 
     [exec] war:
     [exec] 
     [exec] build.war:
     [exec] 
     [exec] BUILD FAILED
     [exec] D:\Files\SharedApps\OpenBravo\AppsOpenbravo\build.xml:105: The following error occurred while executing this line:
     [exec] D:\Files\SharedApps\OpenBravo\AppsOpenbravo\src\build.xml:235: Deployment descriptor: D:\Files\SharedApps\OpenBravo\AppsOpenbravo\build\javasqlc\src\web.xml does not exist.
     [exec] 
     [exec] Total time: 1 second

BUILD SUCCESSFUL
Total time: 7 minutes 9 seconds