All pastes #589215 Raw Edit

Untitled

public text v1 · immutable
#589215 ·published 2007-06-25 21:26 UTC
rendered paste body
tom@linux:~/Desktop/mythplugins> make
cd mythweather && /usr/bin/qmake mythweather.pro -unix -o Makefile
cd mythweather && make -f Makefile
make[1]: Entering directory `/home/tom/Desktop/mythplugins/mythweather'
cd mythweather && /usr/bin/qmake mythweather.pro -unix -o Makefile
cd mythweather && make -f Makefile
make[2]: Entering directory `/home/tom/Desktop/mythplugins/mythweather/mythweather'
g++ -c -pipe -march=athlon -I/opt/kde3/include/artsc -pthread -I/opt/gnome/include/glib-2.0 -I/opt/gnome/lib/glib-2.0/include -g -D_REENTRANT -Wall -W -DPIC -fPIC  -D_GNU_SOURCE -DPREFIX="/usr" -DMMX -Di386 -DUSING_FREEBOX -D_FILE_OFFSET_BITS=64 -DQT_PLUGIN -DQT_GUI_LIB -DQT_CORE_LIB -DQT_SHARED -I/usr/share/qt4/mkspecs/default -I. -I/usr/include/QtCore -I/usr/include/QtCore -I/usr/include/QtGui -I/usr/include/QtGui -I/usr/include -I/usr/include -I/usr/kde/3.3/include -I/usr/include -I/usr/include -I/usr/X11R6/include -I. -I. -o main.o main.cpp
In file included from main.cpp:18:
weather.h:21:22: error: qnetwork.h: No such file or directory
In file included from weather.h:24,
                 from main.cpp:18:
/usr/include/mythtv/uitypes.h:12:26: error: qvaluevector.h: No such file or directory
/usr/include/mythtv/uitypes.h:16:22: error: qptrlist.h: No such file or directory
In file included from /usr/include/mythtv/uitypes.h:18,
                 from weather.h:24,
                 from main.cpp:18:
/usr/include/mythtv/mythwidgets.h:4:21: error: qbutton.h: No such file or directory
/usr/include/mythtv/mythwidgets.h:14:21: error: qheader.h: No such file or directory
/usr/include/mythtv/mythwidgets.h:15:20: error: qtable.h: No such file or directory
/usr/include/mythtv/mythwidgets.h:17:22: error: qlistbox.h: No such file or directory
In file included from /usr/include/mythtv/virtualkeyboard.h:7,
                 from /usr/include/mythtv/mythwidgets.h:28,
                 from /usr/include/mythtv/uitypes.h:18,
                 from weather.h:24,
                 from main.cpp:18:
/usr/include/mythtv/mythdialogs.h:7:18: error: qdom.h: No such file or directory
/usr/include/mythtv/mythdialogs.h:14:25: error: qscrollview.h: No such file or directory
In file included from /usr/include/mythtv/libmythui/mythmainwindow.h:12,
                 from /usr/include/mythtv/mythdialogs.h:48,
                 from /usr/include/mythtv/virtualkeyboard.h:7,
                 from /usr/include/mythtv/mythwidgets.h:28,
                 from /usr/include/mythtv/uitypes.h:18,
                 from weather.h:24,
                 from main.cpp:18:
/usr/include/mythtv/libmythui/mythuitype.h:6:25: error: qobjectlist.h: No such file or directory
In file included from /usr/include/mythtv/uitypes.h:21,
                 from weather.h:24,
                 from main.cpp:18:
/usr/include/mythtv/generictree.h:6:24: error: qvaluelist.h: No such file or directory
In file included from /usr/include/mythtv/mythobservable.h:5,
                 from /usr/include/mythtv/mythcontext.h:21,
                 from /usr/include/mythtv/xmlparse.h:5,
                 from weather.h:25,
                 from main.cpp:18:
/usr/include/mythtv/mythevent.h:7:23: error: qdeepcopy.h: No such file or directory
In file included from /usr/include/mythtv/mythcontext.h:22,
                 from /usr/include/mythtv/xmlparse.h:5,
                 from weather.h:25,
                 from main.cpp:18:
/usr/include/mythtv/mythsocket.h:4:27: error: qsocketdevice.h: No such file or directory
In file included from main.cpp:23:
/usr/include/mythtv/lcddevice.h:10:21: error: qsocket.h: No such file or directory
In file included from main.cpp:26:
/usr/include/mythtv/mythplugin.h:5:19: error: qdict.h: No such file or directory
/usr/include/mythtv/libmythui/xmlparsebase.h:15: error: ‘QDomElement’ has not been declared
/usr/include/mythtv/libmythui/xmlparsebase.h:17: error: ‘QDomElement’ has not been declared
/usr/include/mythtv/libmythui/xmlparsebase.h:19: error: ‘QDomElement’ has not been declared
/usr/include/mythtv/libmythui/xmlparsebase.h:21: error: ‘QDomElement’ has not been declared
/usr/include/mythtv/libmythui/xmlparsebase.h:23: error: ‘QDomElement’ has not been declared
/usr/include/mythtv/libmythui/xmlparsebase.h:29: error: expected ‘;’ before ‘(’ token
/usr/include/mythtv/libmythui/xmlparsebase.h:32: error: expected ‘;’ before ‘(’ token
/usr/include/mythtv/libmythui/mythuitype.h:33: error: expected &#8216;;&#8217; before &#8216;<&#8217; token
/usr/include/mythtv/libmythui/mythuitype.h:81: error: &#8216;QCustomEvent&#8217; has not been declared
/usr/include/mythtv/libmythui/mythuitype.h:106: error: &#8216;QPtrList&#8217; has not been declared
/usr/include/mythtv/libmythui/mythuitype.h:106: error: expected &#8216;,&#8217; or &#8216;...&#8217; before &#8216;<&#8217; token
/usr/include/mythtv/libmythui/mythuitype.h:119: error: &#8216;QDomElement&#8217; has not been declared
/usr/include/mythtv/libmythui/mythuitype.h:124: error: expected &#8216;;&#8217; before &#8216;<&#8217; token
/usr/include/mythtv/libmythui/mythscreenstack.h:22: error: &#8216;QValueVector&#8217; has not been declared
/usr/include/mythtv/libmythui/mythscreenstack.h:22: error: expected &#8216;,&#8217; or &#8216;...&#8217; before &#8216;<&#8217; token
/usr/include/mythtv/libmythui/mythscreenstack.h:33: error: expected &#8216;;&#8217; before &#8216;<&#8217; token
/usr/include/mythtv/libmythui/mythscreenstack.h:34: error: expected &#8216;;&#8217; before &#8216;<&#8217; token
/usr/include/mythtv/libmythui/mythscreenstack.h:42: error: expected &#8216;;&#8217; before &#8216;<&#8217; token
/usr/include/mythtv/libmythui/mythmainwindow.h:21: error: expected class-name before &#8216;{&#8217; token
/usr/include/mythtv/libmythui/mythmainwindow.h: In constructor &#8216;ExternalKeycodeEvent::ExternalKeycodeEvent(int)&#8217;:
/usr/include/mythtv/libmythui/mythmainwindow.h:24: error: class &#8216;ExternalKeycodeEvent&#8217; does not have any field named &#8216;QCustomEvent&#8217;
/usr/include/mythtv/libmythui/mythmainwindow.h: At global scope:
/usr/include/mythtv/libmythui/mythmainwindow.h:33: error: expected class-name before &#8216;{&#8217; token
/usr/include/mythtv/libmythui/mythmainwindow.h: In constructor &#8216;ExitToMainMenuEvent::ExitToMainMenuEvent()&#8217;:
/usr/include/mythtv/libmythui/mythmainwindow.h:35: error: class &#8216;ExitToMainMenuEvent&#8217; does not have any field named &#8216;QCustomEvent&#8217;
/usr/include/mythtv/libmythui/mythmainwindow.h: At global scope:
/usr/include/mythtv/libmythui/mythmainwindow.h:129: error: &#8216;QCustomEvent&#8217; has not been declared
/usr/include/mythtv/mythdialogs.h:115: error: expected &#8216;;&#8217; before &#8216;*&#8217; token
/usr/include/mythtv/mythdialogs.h:204: error: expected &#8216;;&#8217; before &#8216;<&#8217; token
/usr/include/mythtv/mythdialogs.h:264: error: &#8216;QDomElement&#8217; has not been declared
/usr/include/mythtv/mythdialogs.h:265: error: &#8216;QDomElement&#8217; has not been declared
/usr/include/mythtv/mythdialogs.h:266: error: &#8216;QDomElement&#8217; has not been declared
/usr/include/mythtv/mythdialogs.h:267: error: &#8216;QDomElement&#8217; has not been declared
/usr/include/mythtv/mythdialogs.h:313: error: expected &#8216;;&#8217; before &#8216;&&#8217; token
/usr/include/mythtv/mythdialogs.h:315: error: expected `;' before &#8216;QPixmap&#8217;
/usr/include/mythtv/mythdialogs.h:323: error: &#8216;QDomElement&#8217; does not name a type
/usr/include/mythtv/mythdialogs.h:326: error: expected &#8216;;&#8217; before &#8216;<&#8217; token
/usr/include/mythtv/mythdialogs.h:327: error: expected &#8216;;&#8217; before &#8216;<&#8217; token
/usr/include/mythtv/mythdialogs.h:394: error: expected &#8216;;&#8217; before &#8216;*&#8217; token
/usr/include/mythtv/mythdialogs.h:395: error: expected &#8216;;&#8217; before &#8216;*&#8217; token
/usr/include/mythtv/mythdialogs.h:409: error: expected &#8216;;&#8217; before &#8216;<&#8217; token
/usr/include/mythtv/mythdialogs.h:422: error: &#8216;IntVector&#8217; has not been declared
/usr/include/mythtv/mythdialogs.h:423: error: &#8216;IntVector&#8217; has not been declared
/usr/include/mythtv/mythdialogs.h:446: error: expected class-name before &#8216;{&#8217; token
/usr/include/mythtv/mythwidgets.h: In constructor &#8216;MythComboBox::MythComboBox(bool, QWidget*, const char*)&#8217;:
/usr/include/mythtv/mythwidgets.h:44: error: no matching function for call to &#8216;QComboBox::QComboBox(bool&, QWidget*&, const char*&)&#8217;
/usr/include/QtGui/qcombobox.h:281: note: candidates are: QComboBox::QComboBox(const QComboBox&)
/usr/include/QtGui/qcombobox.h:277: note:                 QComboBox::QComboBox(QComboBoxPrivate&, QWidget*)
/usr/include/QtGui/qcombobox.h:70: note:                 QComboBox::QComboBox(QWidget*)
/usr/include/mythtv/mythwidgets.h: In member function &#8216;void MythComboBox::insertItem(const QString&)&#8217;:
/usr/include/mythtv/mythwidgets.h:57: error: no matching function for call to &#8216;MythComboBox::insertItem(const QString&)&#8217;
/usr/include/QtGui/qcombobox.h:303: note: candidates are: void QComboBox::insertItem(int, const QString&, const QVariant&)
/usr/include/QtGui/qcombobox.h:180: note:                 void QComboBox::insertItem(int, const QIcon&, const QString&, const QVariant&)
/usr/include/mythtv/mythwidgets.h: In constructor &#8216;MythSpinBox::MythSpinBox(QWidget*, const char*, bool)&#8217;:
/usr/include/mythtv/mythwidgets.h:78: error: no matching function for call to &#8216;QSpinBox::QSpinBox(QWidget*&, const char*&)&#8217;
/usr/include/QtGui/qspinbox.h:101: note: candidates are: QSpinBox::QSpinBox(const QSpinBox&)
/usr/include/QtGui/qspinbox.h:49: note:                 QSpinBox::QSpinBox(QWidget*)
/usr/include/mythtv/mythwidgets.h:78: error: &#8216;setLineStep&#8217; was not declared in this scope
/usr/include/mythtv/mythwidgets.h: In constructor &#8216;MythSlider::MythSlider(QWidget*, const char*)&#8217;:
/usr/include/mythtv/mythwidgets.h:103: error: no matching function for call to &#8216;QSlider::QSlider(QWidget*&, const char*&)&#8217;
/usr/include/QtGui/qslider.h:103: note: candidates are: QSlider::QSlider(const QSlider&)
/usr/include/QtGui/qslider.h:65: note:                 QSlider::QSlider(Qt::Orientation, QWidget*)
/usr/include/QtGui/qslider.h:64: note:                 QSlider::QSlider(QWidget*)
/usr/include/mythtv/mythwidgets.h: In constructor &#8216;MythLineEdit::MythLineEdit(QWidget*, const char*)&#8217;:
/usr/include/mythtv/mythwidgets.h:125: error: no matching function for call to &#8216;QLineEdit::QLineEdit(QWidget*&, const char*&)&#8217;
/usr/include/QtGui/qlineedit.h:235: note: candidates are: QLineEdit::QLineEdit(const QLineEdit&)
/usr/include/QtGui/qlineedit.h:65: note:                 QLineEdit::QLineEdit(const QString&, QWidget*)
/usr/include/QtGui/qlineedit.h:64: note:                 QLineEdit::QLineEdit(QWidget*)
/usr/include/mythtv/mythwidgets.h: In constructor &#8216;MythLineEdit::MythLineEdit(const QString&, QWidget*, const char*)&#8217;:
/usr/include/mythtv/mythwidgets.h:130: error: no matching function for call to &#8216;QLineEdit::QLineEdit(const QString&, QWidget*&, const char*&)&#8217;
/usr/include/QtGui/qlineedit.h:235: note: candidates are: QLineEdit::QLineEdit(const QLineEdit&)
/usr/include/QtGui/qlineedit.h:65: note:                 QLineEdit::QLineEdit(const QString&, QWidget*)
/usr/include/QtGui/qlineedit.h:64: note:                 QLineEdit::QLineEdit(QWidget*)
/usr/include/mythtv/mythwidgets.h: At global scope:
/usr/include/mythtv/mythwidgets.h:247: error: expected class-name before &#8216;{&#8217; token
/usr/include/mythtv/mythwidgets.h: In constructor &#8216;MythTable::MythTable(QWidget*)&#8217;:
/usr/include/mythtv/mythwidgets.h:249: error: class &#8216;MythTable&#8217; does not have any field named &#8216;QTable&#8217;
/usr/include/mythtv/mythwidgets.h: In constructor &#8216;MythPushButton::MythPushButton(QWidget*, const char*, bool)&#8217;:
/usr/include/mythtv/mythwidgets.h:267: error: no matching function for call to &#8216;QPushButton::QPushButton(QWidget*&, const char*&)&#8217;
/usr/include/QtGui/qpushbutton.h:89: note: candidates are: QPushButton::QPushButton(const QPushButton&)
/usr/include/QtGui/qpushbutton.h:47: note:                 QPushButton::QPushButton(const QIcon&, const QString&, QWidget*)
/usr/include/QtGui/qpushbutton.h:46: note:                 QPushButton::QPushButton(const QString&, QWidget*)
/usr/include/QtGui/qpushbutton.h:45: note:                 QPushButton::QPushButton(QWidget*)
/usr/include/mythtv/mythwidgets.h:268: error: &#8216;WindowOrigin&#8217; was not declared in this scope
/usr/include/mythtv/mythwidgets.h:268: error: &#8216;setBackgroundOrigin&#8217; was not declared in this scope
/usr/include/mythtv/mythwidgets.h: In constructor &#8216;MythPushButton::MythPushButton(const QString&, QWidget*, bool)&#8217;:
/usr/include/mythtv/mythwidgets.h:272: error: &#8216;WindowOrigin&#8217; was not declared in this scope
/usr/include/mythtv/mythwidgets.h:272: error: &#8216;setBackgroundOrigin&#8217; was not declared in this scope
/usr/include/mythtv/mythwidgets.h: In constructor &#8216;MythCheckBox::MythCheckBox(QWidget*, const char*)&#8217;:
/usr/include/mythtv/mythwidgets.h:299: error: no matching function for call to &#8216;QCheckBox::QCheckBox(QWidget*&, const char*&)&#8217;
/usr/include/QtGui/qcheckbox.h:84: note: candidates are: QCheckBox::QCheckBox(const QCheckBox&)
/usr/include/QtGui/qcheckbox.h:43: note:                 QCheckBox::QCheckBox(const QString&, QWidget*)
/usr/include/QtGui/qcheckbox.h:42: note:                 QCheckBox::QCheckBox(QWidget*)
/usr/include/mythtv/mythwidgets.h: In constructor &#8216;MythRadioButton::MythRadioButton(QWidget*, const char*)&#8217;:
/usr/include/mythtv/mythwidgets.h:319: error: no matching function for call to &#8216;QRadioButton::QRadioButton(QWidget*&, const char*&)&#8217;
/usr/include/QtGui/qradiobutton.h:59: note: candidates are: QRadioButton::QRadioButton(const QRadioButton&)
/usr/include/QtGui/qradiobutton.h:41: note:                 QRadioButton::QRadioButton(const QString&, QWidget*)
/usr/include/QtGui/qradiobutton.h:40: note:                 QRadioButton::QRadioButton(QWidget*)
/usr/include/mythtv/mythwidgets.h: At global scope:
/usr/include/mythtv/mythwidgets.h:340: error: expected &#8216;,&#8217; or &#8216;...&#8217; before &#8216;*&#8217; token
/usr/include/mythtv/mythwidgets.h:347: error: expected class-name before &#8216;{&#8217; token
/usr/include/mythtv/mythwidgets.h: In member function &#8216;void MythListBox::setCurrentItem(int)&#8217;:
/usr/include/mythtv/mythwidgets.h:364: error: &#8216;QListBox&#8217; has not been declared
/usr/include/mythtv/generictree.h: At global scope:
/usr/include/mythtv/generictree.h:15: error: expected &#8216;;&#8217; before &#8216;<&#8217; token
/usr/include/mythtv/generictree.h:30: error: expected &#8216;;&#8217; before &#8216;(&#8217; token
/usr/include/mythtv/generictree.h:31: error: expected &#8216;;&#8217; before &#8216;(&#8217; token
/usr/include/mythtv/generictree.h:32: error: &#8216;QValueList&#8217; has not been declared
/usr/include/mythtv/generictree.h:32: error: expected &#8216;,&#8217; or &#8216;...&#8217; before &#8216;<&#8217; token
/usr/include/mythtv/generictree.h:37: error: expected &#8216;;&#8217; before &#8216;<&#8217; token
/usr/include/mythtv/generictree.h:44: error: expected &#8216;;&#8217; before &#8216;<&#8217; token
/usr/include/mythtv/generictree.h:69: error: expected &#8216;;&#8217; before &#8216;*&#8217; token
/usr/include/mythtv/generictree.h:71: error: expected `;' before &#8216;void&#8217;
/usr/include/mythtv/generictree.h:79: error: &#8216;QPtrList&#8217; has not been declared
/usr/include/mythtv/generictree.h:79: error: expected &#8216;,&#8217; or &#8216;...&#8217; before &#8216;<&#8217; token
/usr/include/mythtv/generictree.h:104: error: expected &#8216;;&#8217; before &#8216;*&#8217; token
/usr/include/mythtv/uitypes.h: In member function &#8216;void UIBarType::ResetImage(int)&#8217;:
/usr/include/mythtv/uitypes.h:178: error: &#8216;class QPixmap&#8217; has no member named &#8216;resize&#8217;
/usr/include/mythtv/uitypes.h: At global scope:
/usr/include/mythtv/uitypes.h:221: error: expected &#8216;;&#8217; before &#8216;<&#8217; token
/usr/include/mythtv/uitypes.h:306: error: expected &#8216;;&#8217; before &#8216;<&#8217; token
/usr/include/mythtv/uitypes.h: In constructor &#8216;UIGuideType::UIGTCon::UIGTCon(const QRect&, const QString&, const QString&, int, int, int)&#8217;:
/usr/include/mythtv/uitypes.h:274: error: &#8216;const class QString&#8217; has no member named &#8216;stripWhiteSpace&#8217;
/usr/include/mythtv/uitypes.h: At global scope:
/usr/include/mythtv/uitypes.h:872: error: expected &#8216;;&#8217; before &#8216;<&#8217; token
/usr/include/mythtv/uitypes.h:887: error: &#8216;QValueList&#8217; has not been declared
/usr/include/mythtv/uitypes.h:887: error: expected &#8216;,&#8217; or &#8216;...&#8217; before &#8216;<&#8217; token
/usr/include/mythtv/uitypes.h:888: error: &#8216;QValueList&#8217; has not been declared
/usr/include/mythtv/uitypes.h:888: error: expected &#8216;,&#8217; or &#8216;...&#8217; before &#8216;<&#8217; token
/usr/include/mythtv/uitypes.h:889: error: expected &#8216;;&#8217; before &#8216;<&#8217; token
/usr/include/mythtv/uitypes.h:891: error: &#8216;QValueList&#8217; has not been declared
/usr/include/mythtv/uitypes.h:891: error: expected &#8216;,&#8217; or &#8216;...&#8217; before &#8216;<&#8217; token
/usr/include/mythtv/uitypes.h:943: error: &#8216;IntVector&#8217; has not been declared
/usr/include/mythtv/uitypes.h:944: error: &#8216;IntVector&#8217; has not been declared
/usr/include/mythtv/uitypes.h:973: error: expected &#8216;;&#8217; before &#8216;<&#8217; token
/usr/include/mythtv/uitypes.h:975: error: expected &#8216;;&#8217; before &#8216;<&#8217; token
/usr/include/mythtv/uitypes.h:1166: error: expected &#8216;;&#8217; before &#8216;<&#8217; token
/usr/include/mythtv/uitypes.h: In member function &#8216;void UISelectorType::cleanOut()&#8217;:
/usr/include/mythtv/uitypes.h:1154: error: &#8216;my_data&#8217; was not declared in this scope
/usr/include/mythtv/uitypes.h: At global scope:
/usr/include/mythtv/uitypes.h:1291: error: expected &#8216;;&#8217; before &#8216;<&#8217; token
/usr/include/mythtv/uitypes.h:1299: error: &#8216;KeyList&#8217; does not name a type
/usr/include/mythtv/uitypes.h:1348: error: &#8216;KeyList&#8217; does not name a type
/usr/include/mythtv/mythevent.h:16: error: expected class-name before &#8216;{&#8217; token
/usr/include/mythtv/mythevent.h:18: error: &#8216;User&#8217; was not declared in this scope
/usr/include/mythtv/mythevent.h: In constructor &#8216;MythEvent::MythEvent(int)&#8217;:
/usr/include/mythtv/mythevent.h:20: error: class &#8216;MythEvent&#8217; does not have any field named &#8216;QCustomEvent&#8217;
/usr/include/mythtv/mythevent.h: In constructor &#8216;MythEvent::MythEvent(QString)&#8217;:
/usr/include/mythtv/mythevent.h:23: error: class &#8216;MythEvent&#8217; does not have any field named &#8216;QCustomEvent&#8217;
/usr/include/mythtv/mythevent.h:25: error: &#8216;QDeepCopy&#8217; was not declared in this scope
/usr/include/mythtv/mythevent.h:25: error: expected primary-expression before &#8216;>&#8217; token
/usr/include/mythtv/mythevent.h:26: error: no match for &#8216;operator=&#8217; in &#8216;((MythEvent*)this)->MythEvent::extradata = "empty"&#8217;
/usr/include/QtCore/qstringlist.h:47: note: candidates are: QStringList& QStringList::operator=(const QStringList&)
/usr/include/mythtv/mythevent.h: In constructor &#8216;MythEvent::MythEvent(QString, const QStringList&)&#8217;:
/usr/include/mythtv/mythevent.h:30: error: class &#8216;MythEvent&#8217; does not have any field named &#8216;QCustomEvent&#8217;
/usr/include/mythtv/mythevent.h:32: error: &#8216;QDeepCopy&#8217; was not declared in this scope
/usr/include/mythtv/mythevent.h:32: error: expected primary-expression before &#8216;>&#8217; token
/usr/include/mythtv/mythobservable.h: At global scope:
/usr/include/mythtv/mythobservable.h:112: error: expected &#8216;;&#8217; before &#8216;<&#8217; token
/usr/include/mythtv/mythobservable.h:136: error: expected &#8216;;&#8217; before &#8216;<&#8217; token
/usr/include/mythtv/mythsocket.h:24: error: expected class-name before &#8216;{&#8217; token
/usr/include/mythtv/mythsocket.h:46: error: expected &#8216;,&#8217; or &#8216;...&#8217; before &#8216;error&#8217;
/usr/include/mythtv/mythsocket.h:48: error: &#8216;Type&#8217; has not been declared
/usr/include/mythtv/mythsocket.h:51: error: &#8216;Q_LONG&#8217; does not name a type
/usr/include/mythtv/mythsocket.h:52: error: &#8216;Q_LONG&#8217; does not name a type
/usr/include/mythtv/mythsocket.h:56: error: &#8216;Q_ULONG&#8217; has not been declared
/usr/include/mythtv/mythsocket.h:58: error: &#8216;Q_UINT16&#8217; has not been declared
/usr/include/mythtv/mythsocket.h:59: error: &#8216;Q_UINT16&#8217; has not been declared
/usr/include/mythtv/mythsocket.h:71: error: field &#8216;m_addr&#8217; has incomplete type
/usr/include/mythtv/mythsocket.h:72: error: &#8216;Q_UINT16&#8217; does not name a type
/usr/include/mythtv/mythsocket.h:85: error: expected &#8216;;&#8217; before &#8216;<&#8217; token
/usr/include/mythtv/mythsocket.h:86: error: expected &#8216;;&#8217; before &#8216;<&#8217; token
/usr/include/mythtv/mythsocket.h:87: error: expected &#8216;;&#8217; before &#8216;<&#8217; token
/usr/include/mythtv/mythsocket.h:98: error: &#8216;QPtrList&#8217; is not a template
/usr/include/mythtv/mythsocket.h:48: error: &#8216;QSocketDevice&#8217; has not been declared
/usr/include/mythtv/mythsocket.h: In member function &#8216;QString MythSocket::errorToString()&#8217;:
/usr/include/mythtv/mythsocket.h:45: error: &#8216;error&#8217; was not declared in this scope
/usr/include/mythtv/mythcontext.h: At global scope:
/usr/include/mythtv/mythcontext.h:303: error: expected &#8216;;&#8217; before &#8216;<&#8217; token
/usr/include/mythtv/mythcontext.h:439: error: expected &#8216;;&#8217; before &#8216;<&#8217; token
/usr/include/mythtv/xmlparse.h:24: error: &#8216;QDomElement&#8217; has not been declared
/usr/include/mythtv/xmlparse.h:25: error: &#8216;QDomElement&#8217; has not been declared
/usr/include/mythtv/xmlparse.h:26: error: &#8216;QDomElement&#8217; has not been declared
/usr/include/mythtv/xmlparse.h:30: error: &#8216;QDomElement&#8217; has not been declared
/usr/include/mythtv/xmlparse.h:31: error: &#8216;QDomElement&#8217; has not been declared
/usr/include/mythtv/xmlparse.h:32: error: &#8216;QDomElement&#8217; has not been declared
/usr/include/mythtv/xmlparse.h:33: error: &#8216;QDomElement&#8217; has not been declared
/usr/include/mythtv/xmlparse.h:35: error: &#8216;QDomElement&#8217; has not been declared
/usr/include/mythtv/xmlparse.h:36: error: &#8216;QDomElement&#8217; has not been declared
/usr/include/mythtv/xmlparse.h:37: error: &#8216;QDomElement&#8217; has not been declared
/usr/include/mythtv/xmlparse.h:38: error: &#8216;QDomElement&#8217; has not been declared
/usr/include/mythtv/xmlparse.h:39: error: &#8216;QDomElement&#8217; has not been declared
/usr/include/mythtv/xmlparse.h:40: error: &#8216;QDomElement&#8217; has not been declared
/usr/include/mythtv/xmlparse.h:41: error: &#8216;QDomElement&#8217; has not been declared
/usr/include/mythtv/xmlparse.h:42: error: &#8216;QDomElement&#8217; has not been declared
/usr/include/mythtv/xmlparse.h:43: error: &#8216;QDomElement&#8217; has not been declared
/usr/include/mythtv/xmlparse.h:44: error: &#8216;QDomElement&#8217; has not been declared
/usr/include/mythtv/xmlparse.h:45: error: &#8216;QDomElement&#8217; has not been declared
/usr/include/mythtv/xmlparse.h:46: error: &#8216;QDomElement&#8217; has not been declared
/usr/include/mythtv/xmlparse.h:47: error: &#8216;QDomElement&#8217; has not been declared
/usr/include/mythtv/xmlparse.h:48: error: &#8216;QDomElement&#8217; has not been declared
/usr/include/mythtv/xmlparse.h:49: error: &#8216;QDomElement&#8217; has not been declared
/usr/include/mythtv/xmlparse.h:50: error: &#8216;QDomElement&#8217; has not been declared
/usr/include/mythtv/xmlparse.h:51: error: &#8216;QDomElement&#8217; has not been declared
/usr/include/mythtv/xmlparse.h:52: error: &#8216;QDomElement&#8217; has not been declared
/usr/include/mythtv/xmlparse.h:53: error: &#8216;QDomElement&#8217; has not been declared
/usr/include/mythtv/xmlparse.h:56: error: &#8216;QDomElement&#8217; has not been declared
weatherSource.h: In member function &#8216;bool WeatherSource::isRunning()&#8217;:
weatherSource.h:56: error: &#8216;class QProcess&#8217; has no member named &#8216;isRunning&#8217;
sourceManager.h: At global scope:
sourceManager.h:25: error: &#8216;QPtrList&#8217; has not been declared
sourceManager.h:25: error: expected &#8216;,&#8217; or &#8216;...&#8217; before &#8216;<&#8217; token
sourceManager.h:37: error: ISO C++ forbids declaration of &#8216;QPtrList&#8217; with no type
sourceManager.h:37: error: expected &#8216;;&#8217; before &#8216;<&#8217; token
sourceManager.h:38: error: ISO C++ forbids declaration of &#8216;QPtrList&#8217; with no type
sourceManager.h:38: error: expected &#8216;;&#8217; before &#8216;<&#8217; token
sourceManager.h:39: error: ISO C++ forbids declaration of &#8216;QIntDict&#8217; with no type
sourceManager.h:39: error: expected &#8216;;&#8217; before &#8216;<&#8217; token
weather.h:77: error: &#8216;QDomElement&#8217; has not been declared
weather.h:84: error: &#8216;QDomElement&#8217; has not been declared
weather.h:86: error: &#8216;QDomElement&#8217; does not name a type
weather.h:126: error: ISO C++ forbids declaration of &#8216;QPtrList&#8217; with no type
weather.h:126: error: expected &#8216;;&#8217; before &#8216;<&#8217; token
/usr/include/mythtv/mythwizard.h:47: error: invalid function declaration
/usr/include/mythtv/mythwizard.h:119: error: invalid function declaration
/usr/include/mythtv/uilistbtntype.h:140: error: expected &#8216;;&#8217; before &#8216;<&#8217; token
/usr/include/mythtv/uilistbtntype.h:195: error: expected &#8216;;&#8217; before &#8216;<&#8217; token
/usr/include/mythtv/uilistbtntype.h:276: error: expected &#8216;;&#8217; before &#8216;<&#8217; token
/usr/include/mythtv/uilistbtntype.h:277: error: expected &#8216;;&#8217; before &#8216;<&#8217; token
/usr/include/mythtv/uilistbtntype.h:283: error: expected &#8216;;&#8217; before &#8216;<&#8217; token
weatherSetup.h:28: error: ISO C++ forbids declaration of &#8216;QDict&#8217; with no type
weatherSetup.h:28: error: expected &#8216;;&#8217; before &#8216;<&#8217; token
weatherSetup.h: In member function &#8216;virtual bool WeatherSpinBox::eventFilter(QObject*, QEvent*)&#8217;:
weatherSetup.h:61: warning: comparison between signed and unsigned integer expressions
weatherSetup.h: At global scope:
weatherSetup.h:182: error: ISO C++ forbids declaration of &#8216;QDict&#8217; with no type
weatherSetup.h:182: error: expected &#8216;;&#8217; before &#8216;<&#8217; token
/usr/include/mythtv/lcddevice.h:164: error: &#8216;QPtrList&#8217; has not been declared
/usr/include/mythtv/lcddevice.h:164: error: expected &#8216;,&#8217; or &#8216;...&#8217; before &#8216;<&#8217; token
/usr/include/mythtv/lcddevice.h:170: error: &#8216;QPtrList&#8217; has not been declared
/usr/include/mythtv/lcddevice.h:170: error: expected &#8216;,&#8217; or &#8216;...&#8217; before &#8216;<&#8217; token
/usr/include/mythtv/mythplugin.h:79: error: expected &#8216;;&#8217; before &#8216;<&#8217; token
/usr/include/mythtv/mythplugin.h:83: error: expected &#8216;;&#8217; before &#8216;<&#8217; token
/usr/include/mythtv/libmythui/mythscreentype.h:49: error: expected &#8216;;&#8217; before &#8216;<&#8217; token
main.cpp: In function &#8216;int mythplugin_config()&#8217;:
main.cpp:141: error: &#8216;class QString&#8217; has no member named &#8216;ascii&#8217;
make[2]: *** [main.o] Error 1
make[2]: Leaving directory `/home/tom/Desktop/mythplugins/mythweather/mythweather'
make[1]: *** [sub-mythweather-make_default] Error 2
make[1]: Leaving directory `/home/tom/Desktop/mythplugins/mythweather'
make: *** [sub-mythweather-make_default] Error 2