g++-4.1 -c -DAPI_DEBUG -g -D_LINUX -D_XBMC_DEBUG -D_FILE_DEFINED -D_REENTRANT -D_LARGEFILE64_SOURCE -D_FILE_OFFSET_BITS=64 -I. -I../../ -I../../linux -I../../../guilib -I../../../xbmc DllLoader.cpp -o DllLoader.o
DllLoader.cpp:144: error: expected `)' before '*' token
DllLoader.cpp: In member function 'virtual bool DllLoader::Load()':
DllLoader.cpp:761: error: 'EntryFunc' was not declared in this scope
DllLoader.cpp:761: error: expected `;' before 'initdll'
DllLoader.cpp:768: error: 'initdll' was not declared in this scope
DllLoader.cpp: In member function 'virtual void DllLoader::Unload()':
DllLoader.cpp:814: error: 'EntryFunc' was not declared in this scope
DllLoader.cpp:814: error: expected `;' before 'initdll'
DllLoader.cpp:815: error: 'initdll' was not declared in this scope
make[1]: *** [DllLoader.o] Error 1
make[1]: Leaving directory `/home/nelson11/code/XBMC/xbmc/cores/DllLoader'
make: *** [dllloader] Error 2