All pastes #586999 Raw Edit

Stuff

public text v1 · immutable
#586999 ·published 2007-06-24 05:46 UTC
rendered paste body
Last login: Sun Jun 24 00:57:59 on ttyp1
Welcome to Darwin!
jarrod-youngs-computer:~ jyoung27$ cd /Users/jyoung27/Desktop/VisualBoyAdvance-1.7.2/ 
jarrod-youngs-computer:~/Desktop/VisualBoyAdvance-1.7.2 jyoung27$ ./configre
-bash: ./configre: No such file or directory
jarrod-youngs-computer:~/Desktop/VisualBoyAdvance-1.7.2 jyoung27$ ./configure
checking build system type... i386-apple-darwin8.10.1
checking host system type... i386-apple-darwin8.10.1
checking target system type... i386-apple-darwin8.10.1
checking for a BSD-compatible install... /usr/bin/install -c
checking whether build environment is sane... yes
checking for gawk... no
checking for mawk... no
checking for nawk... no
checking for awk... awk
checking whether make sets $(MAKE)... yes
checking for gcc... gcc
checking for C compiler default output file name... a.out
checking whether the C compiler works... yes
checking whether we are cross compiling... no
checking for suffix of executables... 
checking for suffix of object files... o
checking whether we are using the GNU C compiler... yes
checking whether gcc accepts -g... yes
checking for gcc option to accept ANSI C... none needed
checking for style of include used by make... GNU
checking dependency style of gcc... gcc3
checking for bison... bison -y
checking for flex... flex
checking for yywrap in -lfl... yes
checking lex output file root... lex.yy
checking whether yytext is a pointer... yes
checking for g++... g++
checking whether we are using the GNU C++ compiler... yes
checking whether g++ accepts -g... yes
checking dependency style of g++... gcc3
checking for ranlib... ranlib
checking for nasm... /usr/bin/nasm
checking for gzopen in -lz... yes
checking for png_create_write_struct in -lpng... yes
checking for pthread_yield in -lpthread... no
checking how to run the C preprocessor... gcc -E
checking for X... libraries /usr/X11R6/lib, headers 
checking for egrep... grep -E
checking for ANSI C header files... yes
checking for sys/types.h... yes
checking for sys/stat.h... yes
checking for stdlib.h... yes
checking for string.h... yes
checking for memory.h... yes
checking for strings.h... yes
checking for inttypes.h... yes
checking for stdint.h... yes
checking for unistd.h... yes
checking malloc.h usability... no
checking malloc.h presence... no
checking for malloc.h... no
checking for strings.h... (cached) yes
checking for unistd.h... (cached) yes
checking arpa/inet.h usability... yes
checking arpa/inet.h presence... yes
checking for arpa/inet.h... yes
checking netinet/in.h usability... yes
checking netinet/in.h presence... yes
checking for netinet/in.h... yes
checking zutil.h usability... no
checking zutil.h presence... no
checking for zutil.h... no
checking for an ANSI C-conforming const... yes
checking for inline... inline
checking for size_t... yes
checking whether struct tm is in sys/time.h or time.h... time.h
checking for socklen_t... yes
checking whether byte ordering is bigendian... no
checking for sdl-config... no
checking for SDL - version >= 1.2.2... no
*** The sdl-config script installed by SDL could not be found
*** If SDL was installed in PREFIX, make sure PREFIX/bin is in
*** your path, or set the SDL_CONFIG environment variable to the
*** full path to sdl-config.
configure: error: *** Couldn't find SDL library (version >= 1.2.2).
jarrod-youngs-computer:~/Desktop/VisualBoyAdvance-1.7.2 jyoung27$ sudo port libsdl
Password:
Unrecognized action "libsdl"
jarrod-youngs-computer:~/Desktop/VisualBoyAdvance-1.7.2 jyoung27$ sudo port install libsdl
--->  Fetching libsdl
--->  Attempting to fetch SDL-1.2.11.tar.gz from http://www.libsdl.org/release/
--->  Verifying checksum(s) for libsdl
--->  Extracting libsdl
--->  Applying patches to libsdl
--->  Configuring libsdl
--->  Building libsdl with target all
--->  Staging libsdl into destroot
--->  Installing libsdl 1.2.11_0+darwin_8
--->  Activating libsdl 1.2.11_0+darwin_8
--->  Cleaning libsdl
jarrod-youngs-computer:~/Desktop/VisualBoyAdvance-1.7.2 jyoung27$ ./configurechecking build system type... i386-apple-darwin8.10.1
checking host system type... i386-apple-darwin8.10.1
checking target system type... i386-apple-darwin8.10.1
checking for a BSD-compatible install... /usr/bin/install -c
checking whether build environment is sane... yes
checking for gawk... no
checking for mawk... no
checking for nawk... no
checking for awk... awk
checking whether make sets $(MAKE)... yes
checking for gcc... gcc
checking for C compiler default output file name... a.out
checking whether the C compiler works... yes
checking whether we are cross compiling... no
checking for suffix of executables... 
checking for suffix of object files... o
checking whether we are using the GNU C compiler... yes
checking whether gcc accepts -g... yes
checking for gcc option to accept ANSI C... none needed
checking for style of include used by make... GNU
checking dependency style of gcc... gcc3
checking for bison... bison -y
checking for flex... flex
checking for yywrap in -lfl... yes
checking lex output file root... lex.yy
checking whether yytext is a pointer... yes
checking for g++... g++
checking whether we are using the GNU C++ compiler... yes
checking whether g++ accepts -g... yes
checking dependency style of g++... gcc3
checking for ranlib... ranlib
checking for nasm... /usr/bin/nasm
checking for gzopen in -lz... yes
checking for png_create_write_struct in -lpng... yes
checking for pthread_yield in -lpthread... no
checking how to run the C preprocessor... gcc -E
checking for X... libraries /usr/X11R6/lib, headers 
checking for egrep... grep -E
checking for ANSI C header files... yes
checking for sys/types.h... yes
checking for sys/stat.h... yes
checking for stdlib.h... yes
checking for string.h... yes
checking for memory.h... yes
checking for strings.h... yes
checking for inttypes.h... yes
checking for stdint.h... yes
checking for unistd.h... yes
checking malloc.h usability... no
checking malloc.h presence... no
checking for malloc.h... no
checking for strings.h... (cached) yes
checking for unistd.h... (cached) yes
checking arpa/inet.h usability... yes
checking arpa/inet.h presence... yes
checking for arpa/inet.h... yes
checking netinet/in.h usability... yes
checking netinet/in.h presence... yes
checking for netinet/in.h... yes
checking zutil.h usability... no
checking zutil.h presence... no
checking for zutil.h... no
checking for an ANSI C-conforming const... yes
checking for inline... inline
checking for size_t... yes
checking whether struct tm is in sys/time.h or time.h... time.h
checking for socklen_t... yes
checking whether byte ordering is bigendian... no
checking for sdl-config... /opt/local/bin/sdl-config
checking for SDL - version >= 1.2.2... yes
configure: creating ./config.status
config.status: creating Makefile
config.status: creating m4/Makefile
config.status: creating po/Makefile.in
config.status: creating src/Makefile
config.status: creating src/gb/Makefile
config.status: creating src/gtk/Makefile
config.status: creating src/gtk/images/Makefile
config.status: creating src/i386/Makefile
config.status: creating src/prof/Makefile
config.status: creating src/sdl/Makefile
config.status: creating win32/Makefile
config.status: executing depfiles commands
jarrod-youngs-computer:~/Desktop/VisualBoyAdvance-1.7.2 jyoung27$ make
Making all in m4
make[1]: Nothing to be done for `all'.
Making all in src
Making all in gb
if g++ -DPACKAGE_NAME=\"\" -DPACKAGE_TARNAME=\"\" -DPACKAGE_VERSION=\"\" -DPACKAGE_STRING=\"\" -DPACKAGE_BUGREPORT=\"\" -DPACKAGE=\"VisualBoyAdvance\" -DVERSION=\"1.7.2\" -DYYTEXT_POINTER=1 -DHAVE_LIBZ=1 -DHAVE_LIBPNG=1 -DSTDC_HEADERS=1 -DHAVE_SYS_TYPES_H=1 -DHAVE_SYS_STAT_H=1 -DHAVE_STDLIB_H=1 -DHAVE_STRING_H=1 -DHAVE_MEMORY_H=1 -DHAVE_STRINGS_H=1 -DHAVE_INTTYPES_H=1 -DHAVE_STDINT_H=1 -DHAVE_UNISTD_H=1 -DHAVE_STRINGS_H=1 -DHAVE_UNISTD_H=1 -DHAVE_ARPA_INET_H=1 -DHAVE_NETINET_IN_H=1  -I. -I.     -g -O2 -DPROFILING -DMMX -DDEV_VERSION -MT gbCheats.o -MD -MP -MF ".deps/gbCheats.Tpo" \
  -c -o gbCheats.o `test -f 'gbCheats.cpp' || echo './'`gbCheats.cpp; \
then mv -f ".deps/gbCheats.Tpo" ".deps/gbCheats.Po"; \
else rm -f ".deps/gbCheats.Tpo"; exit 1; \
fi
if g++ -DPACKAGE_NAME=\"\" -DPACKAGE_TARNAME=\"\" -DPACKAGE_VERSION=\"\" -DPACKAGE_STRING=\"\" -DPACKAGE_BUGREPORT=\"\" -DPACKAGE=\"VisualBoyAdvance\" -DVERSION=\"1.7.2\" -DYYTEXT_POINTER=1 -DHAVE_LIBZ=1 -DHAVE_LIBPNG=1 -DSTDC_HEADERS=1 -DHAVE_SYS_TYPES_H=1 -DHAVE_SYS_STAT_H=1 -DHAVE_STDLIB_H=1 -DHAVE_STRING_H=1 -DHAVE_MEMORY_H=1 -DHAVE_STRINGS_H=1 -DHAVE_INTTYPES_H=1 -DHAVE_STDINT_H=1 -DHAVE_UNISTD_H=1 -DHAVE_STRINGS_H=1 -DHAVE_UNISTD_H=1 -DHAVE_ARPA_INET_H=1 -DHAVE_NETINET_IN_H=1  -I. -I.     -g -O2 -DPROFILING -DMMX -DDEV_VERSION -MT GB.o -MD -MP -MF ".deps/GB.Tpo" \
  -c -o GB.o `test -f 'GB.cpp' || echo './'`GB.cpp; \
then mv -f ".deps/GB.Tpo" ".deps/GB.Po"; \
else rm -f ".deps/GB.Tpo"; exit 1; \
fi
if g++ -DPACKAGE_NAME=\"\" -DPACKAGE_TARNAME=\"\" -DPACKAGE_VERSION=\"\" -DPACKAGE_STRING=\"\" -DPACKAGE_BUGREPORT=\"\" -DPACKAGE=\"VisualBoyAdvance\" -DVERSION=\"1.7.2\" -DYYTEXT_POINTER=1 -DHAVE_LIBZ=1 -DHAVE_LIBPNG=1 -DSTDC_HEADERS=1 -DHAVE_SYS_TYPES_H=1 -DHAVE_SYS_STAT_H=1 -DHAVE_STDLIB_H=1 -DHAVE_STRING_H=1 -DHAVE_MEMORY_H=1 -DHAVE_STRINGS_H=1 -DHAVE_INTTYPES_H=1 -DHAVE_STDINT_H=1 -DHAVE_UNISTD_H=1 -DHAVE_STRINGS_H=1 -DHAVE_UNISTD_H=1 -DHAVE_ARPA_INET_H=1 -DHAVE_NETINET_IN_H=1  -I. -I.     -g -O2 -DPROFILING -DMMX -DDEV_VERSION -MT gbDis.o -MD -MP -MF ".deps/gbDis.Tpo" \
  -c -o gbDis.o `test -f 'gbDis.cpp' || echo './'`gbDis.cpp; \
then mv -f ".deps/gbDis.Tpo" ".deps/gbDis.Po"; \
else rm -f ".deps/gbDis.Tpo"; exit 1; \
fi
if g++ -DPACKAGE_NAME=\"\" -DPACKAGE_TARNAME=\"\" -DPACKAGE_VERSION=\"\" -DPACKAGE_STRING=\"\" -DPACKAGE_BUGREPORT=\"\" -DPACKAGE=\"VisualBoyAdvance\" -DVERSION=\"1.7.2\" -DYYTEXT_POINTER=1 -DHAVE_LIBZ=1 -DHAVE_LIBPNG=1 -DSTDC_HEADERS=1 -DHAVE_SYS_TYPES_H=1 -DHAVE_SYS_STAT_H=1 -DHAVE_STDLIB_H=1 -DHAVE_STRING_H=1 -DHAVE_MEMORY_H=1 -DHAVE_STRINGS_H=1 -DHAVE_INTTYPES_H=1 -DHAVE_STDINT_H=1 -DHAVE_UNISTD_H=1 -DHAVE_STRINGS_H=1 -DHAVE_UNISTD_H=1 -DHAVE_ARPA_INET_H=1 -DHAVE_NETINET_IN_H=1  -I. -I.     -g -O2 -DPROFILING -DMMX -DDEV_VERSION -MT gbGfx.o -MD -MP -MF ".deps/gbGfx.Tpo" \
  -c -o gbGfx.o `test -f 'gbGfx.cpp' || echo './'`gbGfx.cpp; \
then mv -f ".deps/gbGfx.Tpo" ".deps/gbGfx.Po"; \
else rm -f ".deps/gbGfx.Tpo"; exit 1; \
fi
if g++ -DPACKAGE_NAME=\"\" -DPACKAGE_TARNAME=\"\" -DPACKAGE_VERSION=\"\" -DPACKAGE_STRING=\"\" -DPACKAGE_BUGREPORT=\"\" -DPACKAGE=\"VisualBoyAdvance\" -DVERSION=\"1.7.2\" -DYYTEXT_POINTER=1 -DHAVE_LIBZ=1 -DHAVE_LIBPNG=1 -DSTDC_HEADERS=1 -DHAVE_SYS_TYPES_H=1 -DHAVE_SYS_STAT_H=1 -DHAVE_STDLIB_H=1 -DHAVE_STRING_H=1 -DHAVE_MEMORY_H=1 -DHAVE_STRINGS_H=1 -DHAVE_INTTYPES_H=1 -DHAVE_STDINT_H=1 -DHAVE_UNISTD_H=1 -DHAVE_STRINGS_H=1 -DHAVE_UNISTD_H=1 -DHAVE_ARPA_INET_H=1 -DHAVE_NETINET_IN_H=1  -I. -I.     -g -O2 -DPROFILING -DMMX -DDEV_VERSION -MT gbGlobals.o -MD -MP -MF ".deps/gbGlobals.Tpo" \
  -c -o gbGlobals.o `test -f 'gbGlobals.cpp' || echo './'`gbGlobals.cpp; \
then mv -f ".deps/gbGlobals.Tpo" ".deps/gbGlobals.Po"; \
else rm -f ".deps/gbGlobals.Tpo"; exit 1; \
fi
if g++ -DPACKAGE_NAME=\"\" -DPACKAGE_TARNAME=\"\" -DPACKAGE_VERSION=\"\" -DPACKAGE_STRING=\"\" -DPACKAGE_BUGREPORT=\"\" -DPACKAGE=\"VisualBoyAdvance\" -DVERSION=\"1.7.2\" -DYYTEXT_POINTER=1 -DHAVE_LIBZ=1 -DHAVE_LIBPNG=1 -DSTDC_HEADERS=1 -DHAVE_SYS_TYPES_H=1 -DHAVE_SYS_STAT_H=1 -DHAVE_STDLIB_H=1 -DHAVE_STRING_H=1 -DHAVE_MEMORY_H=1 -DHAVE_STRINGS_H=1 -DHAVE_INTTYPES_H=1 -DHAVE_STDINT_H=1 -DHAVE_UNISTD_H=1 -DHAVE_STRINGS_H=1 -DHAVE_UNISTD_H=1 -DHAVE_ARPA_INET_H=1 -DHAVE_NETINET_IN_H=1  -I. -I.     -g -O2 -DPROFILING -DMMX -DDEV_VERSION -MT gbMemory.o -MD -MP -MF ".deps/gbMemory.Tpo" \
  -c -o gbMemory.o `test -f 'gbMemory.cpp' || echo './'`gbMemory.cpp; \
then mv -f ".deps/gbMemory.Tpo" ".deps/gbMemory.Po"; \
else rm -f ".deps/gbMemory.Tpo"; exit 1; \
fi
if g++ -DPACKAGE_NAME=\"\" -DPACKAGE_TARNAME=\"\" -DPACKAGE_VERSION=\"\" -DPACKAGE_STRING=\"\" -DPACKAGE_BUGREPORT=\"\" -DPACKAGE=\"VisualBoyAdvance\" -DVERSION=\"1.7.2\" -DYYTEXT_POINTER=1 -DHAVE_LIBZ=1 -DHAVE_LIBPNG=1 -DSTDC_HEADERS=1 -DHAVE_SYS_TYPES_H=1 -DHAVE_SYS_STAT_H=1 -DHAVE_STDLIB_H=1 -DHAVE_STRING_H=1 -DHAVE_MEMORY_H=1 -DHAVE_STRINGS_H=1 -DHAVE_INTTYPES_H=1 -DHAVE_STDINT_H=1 -DHAVE_UNISTD_H=1 -DHAVE_STRINGS_H=1 -DHAVE_UNISTD_H=1 -DHAVE_ARPA_INET_H=1 -DHAVE_NETINET_IN_H=1  -I. -I.     -g -O2 -DPROFILING -DMMX -DDEV_VERSION -MT gbPrinter.o -MD -MP -MF ".deps/gbPrinter.Tpo" \
  -c -o gbPrinter.o `test -f 'gbPrinter.cpp' || echo './'`gbPrinter.cpp; \
then mv -f ".deps/gbPrinter.Tpo" ".deps/gbPrinter.Po"; \
else rm -f ".deps/gbPrinter.Tpo"; exit 1; \
fi
if g++ -DPACKAGE_NAME=\"\" -DPACKAGE_TARNAME=\"\" -DPACKAGE_VERSION=\"\" -DPACKAGE_STRING=\"\" -DPACKAGE_BUGREPORT=\"\" -DPACKAGE=\"VisualBoyAdvance\" -DVERSION=\"1.7.2\" -DYYTEXT_POINTER=1 -DHAVE_LIBZ=1 -DHAVE_LIBPNG=1 -DSTDC_HEADERS=1 -DHAVE_SYS_TYPES_H=1 -DHAVE_SYS_STAT_H=1 -DHAVE_STDLIB_H=1 -DHAVE_STRING_H=1 -DHAVE_MEMORY_H=1 -DHAVE_STRINGS_H=1 -DHAVE_INTTYPES_H=1 -DHAVE_STDINT_H=1 -DHAVE_UNISTD_H=1 -DHAVE_STRINGS_H=1 -DHAVE_UNISTD_H=1 -DHAVE_ARPA_INET_H=1 -DHAVE_NETINET_IN_H=1  -I. -I.     -g -O2 -DPROFILING -DMMX -DDEV_VERSION -MT gbSGB.o -MD -MP -MF ".deps/gbSGB.Tpo" \
  -c -o gbSGB.o `test -f 'gbSGB.cpp' || echo './'`gbSGB.cpp; \
then mv -f ".deps/gbSGB.Tpo" ".deps/gbSGB.Po"; \
else rm -f ".deps/gbSGB.Tpo"; exit 1; \
fi
if g++ -DPACKAGE_NAME=\"\" -DPACKAGE_TARNAME=\"\" -DPACKAGE_VERSION=\"\" -DPACKAGE_STRING=\"\" -DPACKAGE_BUGREPORT=\"\" -DPACKAGE=\"VisualBoyAdvance\" -DVERSION=\"1.7.2\" -DYYTEXT_POINTER=1 -DHAVE_LIBZ=1 -DHAVE_LIBPNG=1 -DSTDC_HEADERS=1 -DHAVE_SYS_TYPES_H=1 -DHAVE_SYS_STAT_H=1 -DHAVE_STDLIB_H=1 -DHAVE_STRING_H=1 -DHAVE_MEMORY_H=1 -DHAVE_STRINGS_H=1 -DHAVE_INTTYPES_H=1 -DHAVE_STDINT_H=1 -DHAVE_UNISTD_H=1 -DHAVE_STRINGS_H=1 -DHAVE_UNISTD_H=1 -DHAVE_ARPA_INET_H=1 -DHAVE_NETINET_IN_H=1  -I. -I.     -g -O2 -DPROFILING -DMMX -DDEV_VERSION -MT gbSound.o -MD -MP -MF ".deps/gbSound.Tpo" \
  -c -o gbSound.o `test -f 'gbSound.cpp' || echo './'`gbSound.cpp; \
then mv -f ".deps/gbSound.Tpo" ".deps/gbSound.Po"; \
else rm -f ".deps/gbSound.Tpo"; exit 1; \
fi
rm -f libgb.a
ar cru libgb.a gbCheats.o GB.o gbDis.o gbGfx.o gbGlobals.o gbMemory.o gbPrinter.o gbSGB.o gbSound.o 
ranlib libgb.a
Making all in prof
if g++ -DPACKAGE_NAME=\"\" -DPACKAGE_TARNAME=\"\" -DPACKAGE_VERSION=\"\" -DPACKAGE_STRING=\"\" -DPACKAGE_BUGREPORT=\"\" -DPACKAGE=\"VisualBoyAdvance\" -DVERSION=\"1.7.2\" -DYYTEXT_POINTER=1 -DHAVE_LIBZ=1 -DHAVE_LIBPNG=1 -DSTDC_HEADERS=1 -DHAVE_SYS_TYPES_H=1 -DHAVE_SYS_STAT_H=1 -DHAVE_STDLIB_H=1 -DHAVE_STRING_H=1 -DHAVE_MEMORY_H=1 -DHAVE_STRINGS_H=1 -DHAVE_INTTYPES_H=1 -DHAVE_STDINT_H=1 -DHAVE_UNISTD_H=1 -DHAVE_STRINGS_H=1 -DHAVE_UNISTD_H=1 -DHAVE_ARPA_INET_H=1 -DHAVE_NETINET_IN_H=1  -I. -I.     -g -O2 -DPROFILING -DMMX -DDEV_VERSION -MT prof.o -MD -MP -MF ".deps/prof.Tpo" \
  -c -o prof.o `test -f 'prof.cpp' || echo './'`prof.cpp; \
then mv -f ".deps/prof.Tpo" ".deps/prof.Po"; \
else rm -f ".deps/prof.Tpo"; exit 1; \
fi
rm -f libprof.a
ar cru libprof.a prof.o 
ranlib libprof.a
Making all in i386
/usr/bin/nasm -f elf -o 2xSaImmx.o 2xSaImmx.asm
rm -f lib386.a
ar cru lib386.a 2xSaImmx.o 
ranlib lib386.a
ranlib: warning for library: lib386.a the table of contents is empty (no object file members in the library define global symbols)
Making all in sdl
if g++ -DPACKAGE_NAME=\"\" -DPACKAGE_TARNAME=\"\" -DPACKAGE_VERSION=\"\" -DPACKAGE_STRING=\"\" -DPACKAGE_BUGREPORT=\"\" -DPACKAGE=\"VisualBoyAdvance\" -DVERSION=\"1.7.2\" -DYYTEXT_POINTER=1 -DHAVE_LIBZ=1 -DHAVE_LIBPNG=1 -DSTDC_HEADERS=1 -DHAVE_SYS_TYPES_H=1 -DHAVE_SYS_STAT_H=1 -DHAVE_STDLIB_H=1 -DHAVE_STRING_H=1 -DHAVE_MEMORY_H=1 -DHAVE_STRINGS_H=1 -DHAVE_INTTYPES_H=1 -DHAVE_STDINT_H=1 -DHAVE_UNISTD_H=1 -DHAVE_STRINGS_H=1 -DHAVE_UNISTD_H=1 -DHAVE_ARPA_INET_H=1 -DHAVE_NETINET_IN_H=1  -I. -I.  -I../../src -DSDL -DSYSCONFDIR=\"/usr/local/etc\"  -fno-exceptions -I/opt/local/include/SDL -D_GNU_SOURCE=1 -D_THREAD_SAFE -g -O2 -DPROFILING -DMMX -DDEV_VERSION -MT SDL.o -MD -MP -MF ".deps/SDL.Tpo" \
  -c -o SDL.o `test -f 'SDL.cpp' || echo './'`SDL.cpp; \
then mv -f ".deps/SDL.Tpo" ".deps/SDL.Po"; \
else rm -f ".deps/SDL.Tpo"; exit 1; \
fi
if g++ -DPACKAGE_NAME=\"\" -DPACKAGE_TARNAME=\"\" -DPACKAGE_VERSION=\"\" -DPACKAGE_STRING=\"\" -DPACKAGE_BUGREPORT=\"\" -DPACKAGE=\"VisualBoyAdvance\" -DVERSION=\"1.7.2\" -DYYTEXT_POINTER=1 -DHAVE_LIBZ=1 -DHAVE_LIBPNG=1 -DSTDC_HEADERS=1 -DHAVE_SYS_TYPES_H=1 -DHAVE_SYS_STAT_H=1 -DHAVE_STDLIB_H=1 -DHAVE_STRING_H=1 -DHAVE_MEMORY_H=1 -DHAVE_STRINGS_H=1 -DHAVE_INTTYPES_H=1 -DHAVE_STDINT_H=1 -DHAVE_UNISTD_H=1 -DHAVE_STRINGS_H=1 -DHAVE_UNISTD_H=1 -DHAVE_ARPA_INET_H=1 -DHAVE_NETINET_IN_H=1  -I. -I.  -I../../src -DSDL -DSYSCONFDIR=\"/usr/local/etc\"  -fno-exceptions -I/opt/local/include/SDL -D_GNU_SOURCE=1 -D_THREAD_SAFE -g -O2 -DPROFILING -DMMX -DDEV_VERSION -MT debugger.o -MD -MP -MF ".deps/debugger.Tpo" \
  -c -o debugger.o `test -f 'debugger.cpp' || echo './'`debugger.cpp; \
then mv -f ".deps/debugger.Tpo" ".deps/debugger.Po"; \
else rm -f ".deps/debugger.Tpo"; exit 1; \
fi
if g++ -DPACKAGE_NAME=\"\" -DPACKAGE_TARNAME=\"\" -DPACKAGE_VERSION=\"\" -DPACKAGE_STRING=\"\" -DPACKAGE_BUGREPORT=\"\" -DPACKAGE=\"VisualBoyAdvance\" -DVERSION=\"1.7.2\" -DYYTEXT_POINTER=1 -DHAVE_LIBZ=1 -DHAVE_LIBPNG=1 -DSTDC_HEADERS=1 -DHAVE_SYS_TYPES_H=1 -DHAVE_SYS_STAT_H=1 -DHAVE_STDLIB_H=1 -DHAVE_STRING_H=1 -DHAVE_MEMORY_H=1 -DHAVE_STRINGS_H=1 -DHAVE_INTTYPES_H=1 -DHAVE_STDINT_H=1 -DHAVE_UNISTD_H=1 -DHAVE_STRINGS_H=1 -DHAVE_UNISTD_H=1 -DHAVE_ARPA_INET_H=1 -DHAVE_NETINET_IN_H=1  -I. -I.  -I../../src -DSDL -DSYSCONFDIR=\"/usr/local/etc\"  -fno-exceptions -I/opt/local/include/SDL -D_GNU_SOURCE=1 -D_THREAD_SAFE -g -O2 -DPROFILING -DMMX -DDEV_VERSION -MT 2xSaI.o -MD -MP -MF ".deps/2xSaI.Tpo" \
  -c -o 2xSaI.o `test -f '../2xSaI.cpp' || echo './'`../2xSaI.cpp; \
then mv -f ".deps/2xSaI.Tpo" ".deps/2xSaI.Po"; \
else rm -f ".deps/2xSaI.Tpo"; exit 1; \
fi
if g++ -DPACKAGE_NAME=\"\" -DPACKAGE_TARNAME=\"\" -DPACKAGE_VERSION=\"\" -DPACKAGE_STRING=\"\" -DPACKAGE_BUGREPORT=\"\" -DPACKAGE=\"VisualBoyAdvance\" -DVERSION=\"1.7.2\" -DYYTEXT_POINTER=1 -DHAVE_LIBZ=1 -DHAVE_LIBPNG=1 -DSTDC_HEADERS=1 -DHAVE_SYS_TYPES_H=1 -DHAVE_SYS_STAT_H=1 -DHAVE_STDLIB_H=1 -DHAVE_STRING_H=1 -DHAVE_MEMORY_H=1 -DHAVE_STRINGS_H=1 -DHAVE_INTTYPES_H=1 -DHAVE_STDINT_H=1 -DHAVE_UNISTD_H=1 -DHAVE_STRINGS_H=1 -DHAVE_UNISTD_H=1 -DHAVE_ARPA_INET_H=1 -DHAVE_NETINET_IN_H=1  -I. -I.  -I../../src -DSDL -DSYSCONFDIR=\"/usr/local/etc\"  -fno-exceptions -I/opt/local/include/SDL -D_GNU_SOURCE=1 -D_THREAD_SAFE -g -O2 -DPROFILING -DMMX -DDEV_VERSION -MT Cheats.o -MD -MP -MF ".deps/Cheats.Tpo" \
  -c -o Cheats.o `test -f '../Cheats.cpp' || echo './'`../Cheats.cpp; \
then mv -f ".deps/Cheats.Tpo" ".deps/Cheats.Po"; \
else rm -f ".deps/Cheats.Tpo"; exit 1; \
fi
if g++ -DPACKAGE_NAME=\"\" -DPACKAGE_TARNAME=\"\" -DPACKAGE_VERSION=\"\" -DPACKAGE_STRING=\"\" -DPACKAGE_BUGREPORT=\"\" -DPACKAGE=\"VisualBoyAdvance\" -DVERSION=\"1.7.2\" -DYYTEXT_POINTER=1 -DHAVE_LIBZ=1 -DHAVE_LIBPNG=1 -DSTDC_HEADERS=1 -DHAVE_SYS_TYPES_H=1 -DHAVE_SYS_STAT_H=1 -DHAVE_STDLIB_H=1 -DHAVE_STRING_H=1 -DHAVE_MEMORY_H=1 -DHAVE_STRINGS_H=1 -DHAVE_INTTYPES_H=1 -DHAVE_STDINT_H=1 -DHAVE_UNISTD_H=1 -DHAVE_STRINGS_H=1 -DHAVE_UNISTD_H=1 -DHAVE_ARPA_INET_H=1 -DHAVE_NETINET_IN_H=1  -I. -I.  -I../../src -DSDL -DSYSCONFDIR=\"/usr/local/etc\"  -fno-exceptions -I/opt/local/include/SDL -D_GNU_SOURCE=1 -D_THREAD_SAFE -g -O2 -DPROFILING -DMMX -DDEV_VERSION -MT EEprom.o -MD -MP -MF ".deps/EEprom.Tpo" \
  -c -o EEprom.o `test -f '../EEprom.cpp' || echo './'`../EEprom.cpp; \
then mv -f ".deps/EEprom.Tpo" ".deps/EEprom.Po"; \
else rm -f ".deps/EEprom.Tpo"; exit 1; \
fi
if g++ -DPACKAGE_NAME=\"\" -DPACKAGE_TARNAME=\"\" -DPACKAGE_VERSION=\"\" -DPACKAGE_STRING=\"\" -DPACKAGE_BUGREPORT=\"\" -DPACKAGE=\"VisualBoyAdvance\" -DVERSION=\"1.7.2\" -DYYTEXT_POINTER=1 -DHAVE_LIBZ=1 -DHAVE_LIBPNG=1 -DSTDC_HEADERS=1 -DHAVE_SYS_TYPES_H=1 -DHAVE_SYS_STAT_H=1 -DHAVE_STDLIB_H=1 -DHAVE_STRING_H=1 -DHAVE_MEMORY_H=1 -DHAVE_STRINGS_H=1 -DHAVE_INTTYPES_H=1 -DHAVE_STDINT_H=1 -DHAVE_UNISTD_H=1 -DHAVE_STRINGS_H=1 -DHAVE_UNISTD_H=1 -DHAVE_ARPA_INET_H=1 -DHAVE_NETINET_IN_H=1  -I. -I.  -I../../src -DSDL -DSYSCONFDIR=\"/usr/local/etc\"  -fno-exceptions -I/opt/local/include/SDL -D_GNU_SOURCE=1 -D_THREAD_SAFE -g -O2 -DPROFILING -DMMX -DDEV_VERSION -MT Flash.o -MD -MP -MF ".deps/Flash.Tpo" \
  -c -o Flash.o `test -f '../Flash.cpp' || echo './'`../Flash.cpp; \
then mv -f ".deps/Flash.Tpo" ".deps/Flash.Po"; \
else rm -f ".deps/Flash.Tpo"; exit 1; \
fi
if g++ -DPACKAGE_NAME=\"\" -DPACKAGE_TARNAME=\"\" -DPACKAGE_VERSION=\"\" -DPACKAGE_STRING=\"\" -DPACKAGE_BUGREPORT=\"\" -DPACKAGE=\"VisualBoyAdvance\" -DVERSION=\"1.7.2\" -DYYTEXT_POINTER=1 -DHAVE_LIBZ=1 -DHAVE_LIBPNG=1 -DSTDC_HEADERS=1 -DHAVE_SYS_TYPES_H=1 -DHAVE_SYS_STAT_H=1 -DHAVE_STDLIB_H=1 -DHAVE_STRING_H=1 -DHAVE_MEMORY_H=1 -DHAVE_STRINGS_H=1 -DHAVE_INTTYPES_H=1 -DHAVE_STDINT_H=1 -DHAVE_UNISTD_H=1 -DHAVE_STRINGS_H=1 -DHAVE_UNISTD_H=1 -DHAVE_ARPA_INET_H=1 -DHAVE_NETINET_IN_H=1  -I. -I.  -I../../src -DSDL -DSYSCONFDIR=\"/usr/local/etc\"  -fno-exceptions -I/opt/local/include/SDL -D_GNU_SOURCE=1 -D_THREAD_SAFE -g -O2 -DPROFILING -DMMX -DDEV_VERSION -MT GBA.o -MD -MP -MF ".deps/GBA.Tpo" \
  -c -o GBA.o `test -f '../GBA.cpp' || echo './'`../GBA.cpp; \
then mv -f ".deps/GBA.Tpo" ".deps/GBA.Po"; \
else rm -f ".deps/GBA.Tpo"; exit 1; \
fi
../arm-new.h: In function 'void CPULoop(int)':
../arm-new.h:2936: error: can't find a register in class 'BREG' while reloading 'asm'
../arm-new.h:2936: error: can't find a register in class 'BREG' while reloading 'asm'
../arm-new.h:2936: error: can't find a register in class 'BREG' while reloading 'asm'
../arm-new.h:2936: error: can't find a register in class 'BREG' while reloading 'asm'
../arm-new.h:2936: error: can't find a register in class 'BREG' while reloading 'asm'
../arm-new.h:2936: error: can't find a register in class 'BREG' while reloading 'asm'
../arm-new.h:2936: error: can't find a register in class 'BREG' while reloading 'asm'
../arm-new.h:2936: error: can't find a register in class 'BREG' while reloading 'asm'
../arm-new.h:2936: error: can't find a register in class 'BREG' while reloading 'asm'
../arm-new.h:2936: error: can't find a register in class 'BREG' while reloading 'asm'
../arm-new.h:2936: error: can't find a register in class 'BREG' while reloading 'asm'
../arm-new.h:2936: error: can't find a register in class 'BREG' while reloading 'asm'
../arm-new.h:2936: error: can't find a register in class 'BREG' while reloading 'asm'
../arm-new.h:2936: error: can't find a register in class 'BREG' while reloading 'asm'
../arm-new.h:2936: error: can't find a register in class 'BREG' while reloading 'asm'
../arm-new.h:2936: error: can't find a register in class 'BREG' while reloading 'asm'
../arm-new.h:2936: error: can't find a register in class 'BREG' while reloading 'asm'
../arm-new.h:2936: error: can't find a register in class 'BREG' while reloading 'asm'
../arm-new.h:2937: error: can't find a register in class 'BREG' while reloading 'asm'
../arm-new.h:2937: error: can't find a register in class 'BREG' while reloading 'asm'
../arm-new.h:2937: error: can't find a register in class 'BREG' while reloading 'asm'
../arm-new.h:2937: error: can't find a register in class 'BREG' while reloading 'asm'
../arm-new.h:2937: error: can't find a register in class 'BREG' while reloading 'asm'
../arm-new.h:2937: error: can't find a register in class 'BREG' while reloading 'asm'
../arm-new.h:2937: error: can't find a register in class 'BREG' while reloading 'asm'
../arm-new.h:2937: error: can't find a register in class 'BREG' while reloading 'asm'
../arm-new.h:2937: error: can't find a register in class 'BREG' while reloading 'asm'
../arm-new.h:2937: error: can't find a register in class 'BREG' while reloading 'asm'
../arm-new.h:2937: error: can't find a register in class 'BREG' while reloading 'asm'
../arm-new.h:2937: error: can't find a register in class 'BREG' while reloading 'asm'
../arm-new.h:2937: error: can't find a register in class 'BREG' while reloading 'asm'
../arm-new.h:2937: error: can't find a register in class 'BREG' while reloading 'asm'
../arm-new.h:2937: error: can't find a register in class 'BREG' while reloading 'asm'
../arm-new.h:2937: error: can't find a register in class 'BREG' while reloading 'asm'
../arm-new.h:2937: error: can't find a register in class 'BREG' while reloading 'asm'
../arm-new.h:2937: error: can't find a register in class 'BREG' while reloading 'asm'
../arm-new.h:2938: error: can't find a register in class 'BREG' while reloading 'asm'
../arm-new.h:2938: error: can't find a register in class 'BREG' while reloading 'asm'
../arm-new.h:2938: error: can't find a register in class 'BREG' while reloading 'asm'
../arm-new.h:2938: error: can't find a register in class 'BREG' while reloading 'asm'
../arm-new.h:2938: error: can't find a register in class 'BREG' while reloading 'asm'
../arm-new.h:2938: error: can't find a register in class 'BREG' while reloading 'asm'
../arm-new.h:2938: error: can't find a register in class 'BREG' while reloading 'asm'
../arm-new.h:2938: error: can't find a register in class 'BREG' while reloading 'asm'
../arm-new.h:2938: error: can't find a register in class 'BREG' while reloading 'asm'
../arm-new.h:2938: error: can't find a register in class 'BREG' while reloading 'asm'
../arm-new.h:2938: error: can't find a register in class 'BREG' while reloading 'asm'
../arm-new.h:2938: error: can't find a register in class 'BREG' while reloading 'asm'
../arm-new.h:2938: error: can't find a register in class 'BREG' while reloading 'asm'
../arm-new.h:2938: error: can't find a register in class 'BREG' while reloading 'asm'
../arm-new.h:2938: error: can't find a register in class 'BREG' while reloading 'asm'
../arm-new.h:2938: error: can't find a register in class 'BREG' while reloading 'asm'
../arm-new.h:2938: error: can't find a register in class 'BREG' while reloading 'asm'
../arm-new.h:2938: error: can't find a register in class 'BREG' while reloading 'asm'
../arm-new.h:2939: error: can't find a register in class 'BREG' while reloading 'asm'
../arm-new.h:2939: error: can't find a register in class 'BREG' while reloading 'asm'
../arm-new.h:2939: error: can't find a register in class 'BREG' while reloading 'asm'
../arm-new.h:2939: error: can't find a register in class 'BREG' while reloading 'asm'
../arm-new.h:2939: error: can't find a register in class 'BREG' while reloading 'asm'
../arm-new.h:2939: error: can't find a register in class 'BREG' while reloading 'asm'
../arm-new.h:2939: error: can't find a register in class 'BREG' while reloading 'asm'
../arm-new.h:2939: error: can't find a register in class 'BREG' while reloading 'asm'
../arm-new.h:2939: error: can't find a register in class 'BREG' while reloading 'asm'
../arm-new.h:2939: error: can't find a register in class 'BREG' while reloading 'asm'
../arm-new.h:2939: error: can't find a register in class 'BREG' while reloading 'asm'
../arm-new.h:2939: error: can't find a register in class 'BREG' while reloading 'asm'
../arm-new.h:2939: error: can't find a register in class 'BREG' while reloading 'asm'
../arm-new.h:2939: error: can't find a register in class 'BREG' while reloading 'asm'
../arm-new.h:2939: error: can't find a register in class 'BREG' while reloading 'asm'
../arm-new.h:2939: error: can't find a register in class 'BREG' while reloading 'asm'
../arm-new.h:2939: error: can't find a register in class 'BREG' while reloading 'asm'
../arm-new.h:2939: error: can't find a register in class 'BREG' while reloading 'asm'
../arm-new.h:2940: error: can't find a register in class 'BREG' while reloading 'asm'
../arm-new.h:2940: error: can't find a register in class 'BREG' while reloading 'asm'
../arm-new.h:2940: error: can't find a register in class 'BREG' while reloading 'asm'
../arm-new.h:2940: error: can't find a register in class 'BREG' while reloading 'asm'
../arm-new.h:2940: error: can't find a register in class 'BREG' while reloading 'asm'
../arm-new.h:2940: error: can't find a register in class 'BREG' while reloading 'asm'
../arm-new.h:2940: error: can't find a register in class 'BREG' while reloading 'asm'
../arm-new.h:2940: error: can't find a register in class 'BREG' while reloading 'asm'
../arm-new.h:2940: error: can't find a register in class 'BREG' while reloading 'asm'
../arm-new.h:2940: error: can't find a register in class 'BREG' while reloading 'asm'
../arm-new.h:2940: error: can't find a register in class 'BREG' while reloading 'asm'
../arm-new.h:2940: error: can't find a register in class 'BREG' while reloading 'asm'
../arm-new.h:2940: error: can't find a register in class 'BREG' while reloading 'asm'
../arm-new.h:2940: error: can't find a register in class 'BREG' while reloading 'asm'
../arm-new.h:2940: error: can't find a register in class 'BREG' while reloading 'asm'
../arm-new.h:2940: error: can't find a register in class 'BREG' while reloading 'asm'
../arm-new.h:2940: error: can't find a register in class 'BREG' while reloading 'asm'
../arm-new.h:2940: error: can't find a register in class 'BREG' while reloading 'asm'
../arm-new.h:2941: error: can't find a register in class 'BREG' while reloading 'asm'
../arm-new.h:2941: error: can't find a register in class 'BREG' while reloading 'asm'
../arm-new.h:2941: error: can't find a register in class 'BREG' while reloading 'asm'
../arm-new.h:2941: error: can't find a register in class 'BREG' while reloading 'asm'
../arm-new.h:2941: error: can't find a register in class 'BREG' while reloading 'asm'
../arm-new.h:2941: error: can't find a register in class 'BREG' while reloading 'asm'
../arm-new.h:2941: error: can't find a register in class 'BREG' while reloading 'asm'
../arm-new.h:2941: error: can't find a register in class 'BREG' while reloading 'asm'
../arm-new.h:2941: error: can't find a register in class 'BREG' while reloading 'asm'
../arm-new.h:2941: error: can't find a register in class 'BREG' while reloading 'asm'
../arm-new.h:2941: error: can't find a register in class 'BREG' while reloading 'asm'
../arm-new.h:2941: error: can't find a register in class 'BREG' while reloading 'asm'
../arm-new.h:2941: error: can't find a register in class 'BREG' while reloading 'asm'
../arm-new.h:2941: error: can't find a register in class 'BREG' while reloading 'asm'
../arm-new.h:2941: error: can't find a register in class 'BREG' while reloading 'asm'
../arm-new.h:2941: error: can't find a register in class 'BREG' while reloading 'asm'
../arm-new.h:2941: error: can't find a register in class 'BREG' while reloading 'asm'
../arm-new.h:2941: error: can't find a register in class 'BREG' while reloading 'asm'
../arm-new.h:2984: error: can't find a register in class 'BREG' while reloading 'asm'
../arm-new.h:2984: error: can't find a register in class 'BREG' while reloading 'asm'
../arm-new.h:2984: error: can't find a register in class 'BREG' while reloading 'asm'
../arm-new.h:2984: error: can't find a register in class 'BREG' while reloading 'asm'
../arm-new.h:2984: error: can't find a register in class 'BREG' while reloading 'asm'
../arm-new.h:2984: error: can't find a register in class 'BREG' while reloading 'asm'
../arm-new.h:2984: error: can't find a register in class 'BREG' while reloading 'asm'
../arm-new.h:2984: error: can't find a register in class 'BREG' while reloading 'asm'
../arm-new.h:2984: error: can't find a register in class 'BREG' while reloading 'asm'
../arm-new.h:2984: error: can't find a register in class 'BREG' while reloading 'asm'
../arm-new.h:2984: error: can't find a register in class 'BREG' while reloading 'asm'
../arm-new.h:2984: error: can't find a register in class 'BREG' while reloading 'asm'
../arm-new.h:2984: error: can't find a register in class 'BREG' while reloading 'asm'
../arm-new.h:2984: error: can't find a register in class 'BREG' while reloading 'asm'
../arm-new.h:2984: error: can't find a register in class 'BREG' while reloading 'asm'
../arm-new.h:2984: error: can't find a register in class 'BREG' while reloading 'asm'
../arm-new.h:2984: error: can't find a register in class 'BREG' while reloading 'asm'
../arm-new.h:2984: error: can't find a register in class 'BREG' while reloading 'asm'
../arm-new.h:2985: error: can't find a register in class 'BREG' while reloading 'asm'
../arm-new.h:2985: error: can't find a register in class 'BREG' while reloading 'asm'
../arm-new.h:2985: error: can't find a register in class 'BREG' while reloading 'asm'
../arm-new.h:2985: error: can't find a register in class 'BREG' while reloading 'asm'
../arm-new.h:2985: error: can't find a register in class 'BREG' while reloading 'asm'
../arm-new.h:2985: error: can't find a register in class 'BREG' while reloading 'asm'
../arm-new.h:2985: error: can't find a register in class 'BREG' while reloading 'asm'
../arm-new.h:2985: error: can't find a register in class 'BREG' while reloading 'asm'
../arm-new.h:2985: error: can't find a register in class 'BREG' while reloading 'asm'
../arm-new.h:2985: error: can't find a register in class 'BREG' while reloading 'asm'
../arm-new.h:2985: error: can't find a register in class 'BREG' while reloading 'asm'
../arm-new.h:2985: error: can't find a register in class 'BREG' while reloading 'asm'
../arm-new.h:2985: error: can't find a register in class 'BREG' while reloading 'asm'
../arm-new.h:2985: error: can't find a register in class 'BREG' while reloading 'asm'
../arm-new.h:2985: error: can't find a register in class 'BREG' while reloading 'asm'
../arm-new.h:2985: error: can't find a register in class 'BREG' while reloading 'asm'
../arm-new.h:2985: error: can't find a register in class 'BREG' while reloading 'asm'
../arm-new.h:2985: error: can't find a register in class 'BREG' while reloading 'asm'
../arm-new.h:3034: error: can't find a register in class 'BREG' while reloading 'asm'
../arm-new.h:3034: error: can't find a register in class 'BREG' while reloading 'asm'
../arm-new.h:3034: error: can't find a register in class 'BREG' while reloading 'asm'
../arm-new.h:3034: error: can't find a register in class 'BREG' while reloading 'asm'
../arm-new.h:3034: error: can't find a register in class 'BREG' while reloading 'asm'
../arm-new.h:3034: error: can't find a register in class 'BREG' while reloading 'asm'
../arm-new.h:3034: error: can't find a register in class 'BREG' while reloading 'asm'
../arm-new.h:3034: error: can't find a register in class 'BREG' while reloading 'asm'
../arm-new.h:3034: error: can't find a register in class 'BREG' while reloading 'asm'
../arm-new.h:3034: error: can't find a register in class 'BREG' while reloading 'asm'
../arm-new.h:3034: error: can't find a register in class 'BREG' while reloading 'asm'
../arm-new.h:3034: error: can't find a register in class 'BREG' while reloading 'asm'
../arm-new.h:3034: error: can't find a register in class 'BREG' while reloading 'asm'
../arm-new.h:3034: error: can't find a register in class 'BREG' while reloading 'asm'
../arm-new.h:3034: error: can't find a register in class 'BREG' while reloading 'asm'
../arm-new.h:3034: error: can't find a register in class 'BREG' while reloading 'asm'
../arm-new.h:3034: error: can't find a register in class 'BREG' while reloading 'asm'
../arm-new.h:3034: error: can't find a register in class 'BREG' while reloading 'asm'
../arm-new.h:3035: error: can't find a register in class 'BREG' while reloading 'asm'
../arm-new.h:3035: error: can't find a register in class 'BREG' while reloading 'asm'
../arm-new.h:3035: error: can't find a register in class 'BREG' while reloading 'asm'
../arm-new.h:3035: error: can't find a register in class 'BREG' while reloading 'asm'
../arm-new.h:3035: error: can't find a register in class 'BREG' while reloading 'asm'
../arm-new.h:3035: error: can't find a register in class 'BREG' while reloading 'asm'
../arm-new.h:3035: error: can't find a register in class 'BREG' while reloading 'asm'
../arm-new.h:3035: error: can't find a register in class 'BREG' while reloading 'asm'
../arm-new.h:3035: error: can't find a register in class 'BREG' while reloading 'asm'
../arm-new.h:3035: error: can't find a register in class 'BREG' while reloading 'asm'
../arm-new.h:3035: error: can't find a register in class 'BREG' while reloading 'asm'
../arm-new.h:3035: error: can't find a register in class 'BREG' while reloading 'asm'
../arm-new.h:3035: error: can't find a register in class 'BREG' while reloading 'asm'
../arm-new.h:3035: error: can't find a register in class 'BREG' while reloading 'asm'
../arm-new.h:3035: error: can't find a register in class 'BREG' while reloading 'asm'
../arm-new.h:3035: error: can't find a register in class 'BREG' while reloading 'asm'
../arm-new.h:3035: error: can't find a register in class 'BREG' while reloading 'asm'
../arm-new.h:3035: error: can't find a register in class 'BREG' while reloading 'asm'
../arm-new.h:3084: error: can't find a register in class 'BREG' while reloading 'asm'
../arm-new.h:3084: error: can't find a register in class 'BREG' while reloading 'asm'
../arm-new.h:3084: error: can't find a register in class 'BREG' while reloading 'asm'
../arm-new.h:3084: error: can't find a register in class 'BREG' while reloading 'asm'
../arm-new.h:3084: error: can't find a register in class 'BREG' while reloading 'asm'
../arm-new.h:3084: error: can't find a register in class 'BREG' while reloading 'asm'
../arm-new.h:3084: error: can't find a register in class 'BREG' while reloading 'asm'
../arm-new.h:3084: error: can't find a register in class 'BREG' while reloading 'asm'
../arm-new.h:3084: error: can't find a register in class 'BREG' while reloading 'asm'
../arm-new.h:3084: error: can't find a register in class 'BREG' while reloading 'asm'
../arm-new.h:3084: error: can't find a register in class 'BREG' while reloading 'asm'
../arm-new.h:3084: error: can't find a register in class 'BREG' while reloading 'asm'
../arm-new.h:3084: error: can't find a register in class 'BREG' while reloading 'asm'
../arm-new.h:3084: error: can't find a register in class 'BREG' while reloading 'asm'
../arm-new.h:3084: error: can't find a register in class 'BREG' while reloading 'asm'
../arm-new.h:3084: error: can't find a register in class 'BREG' while reloading 'asm'
../arm-new.h:3084: error: can't find a register in class 'BREG' while reloading 'asm'
../arm-new.h:3084: error: can't find a register in class 'BREG' while reloading 'asm'
../arm-new.h:3085: error: can't find a register in class 'BREG' while reloading 'asm'
../arm-new.h:3085: error: can't find a register in class 'BREG' while reloading 'asm'
../arm-new.h:3085: error: can't find a register in class 'BREG' while reloading 'asm'
../arm-new.h:3085: error: can't find a register in class 'BREG' while reloading 'asm'
../arm-new.h:3085: error: can't find a register in class 'BREG' while reloading 'asm'
../arm-new.h:3085: error: can't find a register in class 'BREG' while reloading 'asm'
../arm-new.h:3085: error: can't find a register in class 'BREG' while reloading 'asm'
../arm-new.h:3085: error: can't find a register in class 'BREG' while reloading 'asm'
../arm-new.h:3085: error: can't find a register in class 'BREG' while reloading 'asm'
../arm-new.h:3085: error: can't find a register in class 'BREG' while reloading 'asm'
../arm-new.h:3085: error: can't find a register in class 'BREG' while reloading 'asm'
../arm-new.h:3085: error: can't find a register in class 'BREG' while reloading 'asm'
../arm-new.h:3085: error: can't find a register in class 'BREG' while reloading 'asm'
../arm-new.h:3085: error: can't find a register in class 'BREG' while reloading 'asm'
../arm-new.h:3085: error: can't find a register in class 'BREG' while reloading 'asm'
../arm-new.h:3085: error: can't find a register in class 'BREG' while reloading 'asm'
../arm-new.h:3085: error: can't find a register in class 'BREG' while reloading 'asm'
../arm-new.h:3085: error: can't find a register in class 'BREG' while reloading 'asm'
../thumb.h:870: error: can't find a register in class 'BREG' while reloading 'asm'
../thumb.h:880: error: can't find a register in class 'BREG' while reloading 'asm'
../thumb.h:890: error: can't find a register in class 'BREG' while reloading 'asm'
../thumb.h:900: error: can't find a register in class 'BREG' while reloading 'asm'
../thumb.h:985: error: can't find a register in class 'BREG' while reloading 'asm'
../thumb.h:989: error: can't find a register in class 'BREG' while reloading 'asm'
../thumb.h:993: error: can't find a register in class 'BREG' while reloading 'asm'
../thumb.h:997: error: can't find a register in class 'BREG' while reloading 'asm'
../thumb.h:1001: error: can't find a register in class 'BREG' while reloading 'asm'
../thumb.h:1005: error: can't find a register in class 'BREG' while reloading 'asm'
../thumb.h:1009: error: can't find a register in class 'BREG' while reloading 'asm'
../thumb.h:1013: error: can't find a register in class 'BREG' while reloading 'asm'
../thumb.h:1017: error: can't find a register in class 'BREG' while reloading 'asm'
../thumb.h:1021: error: can't find a register in class 'BREG' while reloading 'asm'
../thumb.h:1025: error: can't find a register in class 'BREG' while reloading 'asm'
../thumb.h:1029: error: can't find a register in class 'BREG' while reloading 'asm'
../thumb.h:1033: error: can't find a register in class 'BREG' while reloading 'asm'
../thumb.h:1037: error: can't find a register in class 'BREG' while reloading 'asm'
../thumb.h:1041: error: can't find a register in class 'BREG' while reloading 'asm'
../thumb.h:1045: error: can't find a register in class 'BREG' while reloading 'asm'
../thumb.h:1156: error: can't find a register in class 'BREG' while reloading 'asm'
../thumb.h:1166: error: can't find a register in class 'BREG' while reloading 'asm'
../thumb.h:1206: error: can't find a register in class 'BREG' while reloading 'asm'
make[2]: *** [GBA.o] Error 1
make[1]: *** [all-recursive] Error 1
make: *** [all-recursive] Error 1
jarrod-youngs-computer:~/Desktop/VisualBoyAdvance-1.7.2 jyoung27$