All pastes #586748 Raw Edit

Anonymous

public text v1 · immutable
#586748 ·published 2007-06-24 00:24 UTC
rendered paste body
>>> Unpacking source...
>>> Unpacking splashutils-lite-1.4.2.1.tar.bz2 to /var/tmp/portage/media-gfx/splashutils-1.4.2.1/work
>>> Unpacking splashutils-gentoo-1.0.3.tar.bz2 to /var/tmp/portage/media-gfx/splashutils-1.4.2.1/work
>>> Unpacking miscsplashutils-0.1.7.tar.bz2 to /var/tmp/portage/media-gfx/splashutils-1.4.2.1/work
>>> Unpacking libpng-1.2.8.tar.bz2 to /var/tmp/portage/media-gfx/splashutils-1.4.2.1/work
>>> Unpacking jpegsrc.v6b.tar.gz to /var/tmp/portage/media-gfx/splashutils-1.4.2.1/work
>>> Unpacking freetype-2.1.9.tar.bz2 to /var/tmp/portage/media-gfx/splashutils-1.4.2.1/work
>>> Unpacking zlib-1.2.3.tar.bz2 to /var/tmp/portage/media-gfx/splashutils-1.4.2.1/work
>>> Source unpacked.
>>> Compiling source in /var/tmp/portage/media-gfx/splashutils-1.4.2.1/work/splashutils-1.4.2.1 ...
cc -march=athlon64 -pipe -fomit-frame-pointer -O2 -mmmx -mfpmath=sse -msse -msse2 -m3dnow fbres.c -o fbres
cc -march=athlon64 -pipe -fomit-frame-pointer -O2 -mmmx -mfpmath=sse -msse -msse2 -m3dnow usleep.c -o usleep
true usleep
true fbres
make[1]: Entering directory `/var/tmp/portage/media-gfx/splashutils-1.4.2.1/work/miscsplashutils-0.1.7/fbtruetype'
gcc -march=athlon64 -pipe -fomit-frame-pointer -O2 -mmmx -mfpmath=sse -msse -msse2 -m3dnow -I/usr/include/freetype2   -c -o fbtruetype.o fbtruetype.c
gcc -march=athlon64 -pipe -fomit-frame-pointer -O2 -mmmx -mfpmath=sse -msse -msse2 -m3dnow -I/usr/include/freetype2   -c -o messages.o messages.c
gcc -march=athlon64 -pipe -fomit-frame-pointer -O2 -mmmx -mfpmath=sse -msse -msse2 -m3dnow -I/usr/include/freetype2   -c -o console.o console.c
gcc -march=athlon64 -pipe -fomit-frame-pointer -O2 -mmmx -mfpmath=sse -msse -msse2 -m3dnow -I/usr/include/freetype2   -c -o ttf.o ttf.c
gcc -march=athlon64 -pipe -fomit-frame-pointer -O2 -mmmx -mfpmath=sse -msse -msse2 -m3dnow -I/usr/include/freetype2   -c -o luxisri.o luxisri.c
gcc -march=athlon64 -pipe -fomit-frame-pointer -O2 -mmmx -mfpmath=sse -msse -msse2 -m3dnow -I/usr/include/freetype2  -L/usr/lib64 -o fbtruetype  -L/usr/lib64 fbtruetype.o messages.o console.o ttf.o luxisri.o -lfreetype -lm
gcc -march=athlon64 -pipe -fomit-frame-pointer -O2 -mmmx -mfpmath=sse -msse -msse2 -m3dnow -I/usr/include/freetype2  -L/usr/lib64 -static -o fbtruetype.static  -L/usr/lib64 fbtruetype.o messages.o console.o ttf.o luxisri.o /usr/lib64/libfreetype.a /usr/lib64/libz.a -lm
true -s fbtruetype fbtruetype.static
make[1]: Leaving directory `/var/tmp/portage/media-gfx/splashutils-1.4.2.1/work/miscsplashutils-0.1.7/fbtruetype'
make[1]: Entering directory `/var/tmp/portage/media-gfx/splashutils-1.4.2.1/work/miscsplashutils-0.1.7/kbd'
cc -march=athlon64 -pipe -fomit-frame-pointer -O2 -mmmx -mfpmath=sse -msse -msse2 -m3dnow   -c -o fgconsole.o fgconsole.c
cc -march=athlon64 -pipe -fomit-frame-pointer -O2 -mmmx -mfpmath=sse -msse -msse2 -m3dnow   -c -o getfd.o getfd.c
cc -march=athlon64 -pipe -fomit-frame-pointer -O2 -mmmx -mfpmath=sse -msse -msse2 -m3dnow  fgconsole.o getfd.o -o fgconsole
make[1]: Leaving directory `/var/tmp/portage/media-gfx/splashutils-1.4.2.1/work/miscsplashutils-0.1.7/kbd'
config.h successfully created.
You can run `make` now.
  CC      objs/solibsplash.o
  LD      objs/libsplash.so
  CONF    libjpeg
  MAKE    libjpeg
  CONF    freetype2
configure: error: cannot compute sizeof (int), 77
See `config.log' for more details.
make[1]: *** [/var/tmp/portage/media-gfx/splashutils-1.4.2.1/work/splashutils-1.4.2.1/libs/freetype-2.1.9/builds/unix/unix-def.mk] Error 1
make[1]: Entering directory `/var/tmp/portage/media-gfx/splashutils-1.4.2.1/work/splashutils-1.4.2.1/objs/freetype2'
make[1]: *** No rule to make target `library'.  Stop.
make[1]: Leaving directory `/var/tmp/portage/media-gfx/splashutils-1.4.2.1/work/splashutils-1.4.2.1/objs/freetype2'
  MAKE    freetype2
make[1]: *** No rule to make target `library'.  Stop.
make: *** [ft2] Error 2

!!! ERROR: media-gfx/splashutils-1.4.2.1 failed.
Call stack:
  ebuild.sh, line 1637:   Called dyn_compile
  ebuild.sh, line 983:   Called qa_call 'src_compile'
  ebuild.sh, line 44:   Called src_compile
  splashutils-1.4.2.1.ebuild, line 128:   Called die

!!! failed to build splashutils
!!! If you need support, post the topmost build error, and the call stack if relevant.
!!! A complete build log is located at '/var/tmp/portage/media-gfx/splashutils-1.4.2.1/temp/build.log'.


from config.log:
.....
configure:3990: checking size of int
configure:4302: klcc -o conftest -fno-stack-protector -Os -w -ffunction-sections -fdata-sections  -I/var/tmp/portage/media-gfx/splashutils-1.4.2.1/work/splashutils-1.4.2.1/libs/zlib-1.2.3 -I/var/tmp/portage/media-gfx/splashutils-1.4.2.1/work/splashutils-1.4.2.1/libs/freetype-2.1.9/include -I/var/tmp/portage/media-gfx/splashutils-1.4.2.1/work/splashutils-1.4.2.1/objs/jpeglib -DWITH_ERRLIST -DTARGET_KERNEL -DTT_CONFIG_OPTION_BYTECODE_INTERPRETER -include /var/tmp/portage/media-gfx/splashutils-1.4.2.1/work/splashutils-1.4.2.1/klibc_compat.h -I/var/tmp/portage/media-gfx/splashutils-1.4.2.1/work/splashutils-1.4.2.1/libs/zlib-1.2.3  conftest.c  >&5
configure:4305: $? = 0
configure:4307: ./conftest
/var/tmp/portage/media-gfx/splashutils-1.4.2.1/work/splashutils-1.4.2.1/libs/freetype-2.1.9/builds/unix/configure: line 4308: 23367 Killed                  ./conftest$ac_exeext
configure:4310: $? = 137
configure: program exited with status 137
....