All pastes #583896 Raw Edit

Someone

public text v1 · immutable
·published 2007-06-22 15:15 UTC
rendered paste body
cubereflex.c:72: error: expected specifier-qualifier-list before 'CubeCheckOrientationProc'
cubereflex.c: In function 'cubereflexCheckOrientation':
cubereflex.c:151: error: 'CubeScreen' has no member named 'checkOrientation'
cubereflex.c:151: error: 'CubereflexScreen' has no member named 'checkOrientation'
cubereflex.c:152: error: 'CubeScreen' has no member named 'checkOrientation'
cubereflex.c:154: error: 'CubereflexScreen' has no member named 'checkOrientation'
cubereflex.c:154: error: 'CubeScreen' has no member named 'checkOrientation'
cubereflex.c:154: error: 'CubeScreen' has no member named 'checkOrientation'
cubereflex.c:156: error: 'CubereflexScreen' has no member named 'reflection'
cubereflex.c: In function 'cubereflexGetRotation':
cubereflex.c:175: error: 'CubereflexScreen' has no member named 'reflection'
cubereflex.c:177: error: 'CubereflexScreen' has no member named 'vRot'
cubereflex.c:181: error: 'CubereflexScreen' has no member named 'vRot'
cubereflex.c: In function 'cubereflexClearTargetOutput':
cubereflex.c:190: error: 'CubereflexScreen' has no member named 'reflection'
cubereflex.c:194: error: 'CubereflexScreen' has no member named 'backVRotate'
cubereflex.c:197: error: 'CubereflexScreen' has no member named 'reflection'
cubereflex.c: In function 'cubereflexPaintTransformedOutput':
cubereflex.c:212: error: 'CubereflexScreen' has no member named 'first'
cubereflex.c:214: error: 'CubereflexScreen' has no member named 'first'
cubereflex.c:215: error: 'CubereflexScreen' has no member named 'reflection'
cubereflex.c:243: error: 'CubereflexScreen' has no member named 'backVRotate'
cubereflex.c:277: error: 'CubereflexScreen' has no member named 'yTrans'
cubereflex.c:281: error: 'CubereflexScreen' has no member named 'yTrans'
cubereflex.c:286: error: 'CubereflexScreen' has no member named 'yTrans'
cubereflex.c:291: error: 'CubereflexScreen' has no member named 'zTrans'
cubereflex.c:295: error: 'CubereflexScreen' has no member named 'zTrans'
cubereflex.c:297: error: 'CubereflexScreen' has no member named 'vRot'
cubereflex.c:299: error: 'CubereflexScreen' has no member named 'backVRotate'
cubereflex.c:299: error: 'CubereflexScreen' has no member named 'vRot'
cubereflex.c:300: error: 'CubereflexScreen' has no member named 'yTrans'
cubereflex.c:310: error: 'CubereflexScreen' has no member named 'vRot'
cubereflex.c:318: error: 'CubereflexScreen' has no member named 'zTrans'
cubereflex.c:338: error: 'CubereflexScreen' has no member named 'vRot'
cubereflex.c:342: error: 'CubereflexScreen' has no member named 'vRot'
cubereflex.c:342: error: 'CubereflexScreen' has no member named 'vRot'
cubereflex.c:400: error: 'CubereflexScreen' has no member named 'reflection'
cubereflex.c:404: error: 'CubereflexScreen' has no member named 'yTrans'
cubereflex.c:404: error: 'CubereflexScreen' has no member named 'zTrans'
cubereflex.c: In function 'cubereflexPaintOutput':
cubereflex.c:421: error: 'CubereflexScreen' has no member named 'last'
cubereflex.c:422: error: 'CubereflexScreen' has no member named 'first'
cubereflex.c:423: error: 'CubereflexScreen' has no member named 'last'
cubereflex.c: In function 'cubereflexDonePaintScreen':
cubereflex.c:436: error: 'CubereflexScreen' has no member named 'first'
cubereflex.c:437: error: 'CubereflexScreen' has no member named 'yTrans'
cubereflex.c:438: error: 'CubereflexScreen' has no member named 'zTrans'
cubereflex.c: In function 'cubereflexInitScreen':
cubereflex.c:509: error: 'CubereflexScreen' has no member named 'reflection'
cubereflex.c:510: error: 'CubereflexScreen' has no member named 'first'
cubereflex.c:511: error: 'CubereflexScreen' has no member named 'last'
cubereflex.c:512: error: 'CubereflexScreen' has no member named 'yTrans'
cubereflex.c:513: error: 'CubereflexScreen' has no member named 'zTrans'
cubereflex.c:521: error: 'CubereflexScreen' has no member named 'checkOrientation'
cubereflex.c:521: error: 'CubeScreen' has no member named 'checkOrientation'
cubereflex.c:521: error: 'CubeScreen' has no member named 'checkOrientation'
cubereflex.c: In function 'cubereflexFiniScreen':
cubereflex.c:537: error: 'CubeScreen' has no member named 'checkOrientation'
cubereflex.c:537: error: 'CubereflexScreen' has no member named 'checkOrientation'
make[3]: *** [cubereflex.lo] Error 1
make[3]: Leaving directory `/var/tmp/paludis/x11-plugins/compiz-fusion-plugins-extra-9999/work/plugins-extra/src/cubereflex'
make[2]: *** [all-recursive] Error 1
make[2]: Leaving directory `/var/tmp/paludis/x11-plugins/compiz-fusion-plugins-extra-9999/work/plugins-extra/src'
make[1]: *** [all-recursive] Error 1
make[1]: Leaving directory `/var/tmp/paludis/x11-plugins/compiz-fusion-plugins-extra-9999/work/plugins-extra'
make: *** [all] Error 2