All pastes #583847 Raw Edit

Someone

public text v1 · immutable
·published 2007-06-22 15:10 UTC
rendered paste body
os.chdir('libs/ghf-0.8-0')
scons libs i386=1 LIBS_PREFIX=/home/jd/Desktop/urth-0.1-2-src/libs/local
scons: Reading SConscript files ...
scons: done reading SConscript files.
scons: Building targets ...
Downloading http://www.mr511.de/software/libelf-0.8.9.tar.gz
Downloading: 147456/146250 speed: 304.05 Ko/s eta: 0:59
Extracting libs/libelf-0.8.9.tar.gz to libs
99 files extracted
os.chdir('libs/libelf-0.8.9')
./configure --disable-shared --prefix=/home/jd/Desktop/urth-0.1-2-src/libs/localcreating cache ./config.cache
checking whether make sets ${MAKE}... yes
checking for gcc... gcc
checking whether the C compiler (gcc  ) works... yes
checking whether the C compiler (gcc  ) is a cross-compiler... no
checking whether we are using GNU C... yes
checking whether gcc accepts -g... yes
checking how to run the C preprocessor... gcc -E
checking for a BSD compatible install... /usr/bin/install -c
checking for ranlib... ranlib
checking whether ln -s works... yes
checking for ANSI C header files... yes
checking for unistd.h... yes
checking for stdint.h... yes
checking for fcntl.h... yes
checking for elf.h... yes
checking for sys/elf.h... no
checking for link.h... yes
checking for sys/link.h... no
checking if gcc can compile elf.h... yes
checking for ar.h... yes
checking for libelf.h... yes
checking for nlist.h... yes
checking for gelf.h... yes
checking whether to install <libelf.h>, <nlist.h> and <gelf.h>... no
checking for working const... yes
checking for off_t... yes
checking for size_t... yes
checking size of short... 2
checking size of int... 4
checking size of long... 8
checking size of long long... 8
checking size of __int64... 0
checking for struct Elf32_Dyn... yes
checking for struct nlist in elf.h... no
checking for struct Elf64_Ehdr... yes
checking for Elf64_Addr... yes
checking for struct Elf64_Rel... yes
checking for Elf32_Verdef... yes
checking for Elf64_Verdef... yes
checking for SHT_SUNW_verdef... no
checking for SHT_GNU_verdef... yes
checking for 64-bit integer... long
checking for 32-bit integer... int
checking for 16-bit integer... short
checking for unistd.h... (cached) yes
checking for getpagesize... yes
checking for working mmap... yes
checking for ftruncate... yes
checking for memcmp... yes
checking for memcpy... yes
checking for memmove... yes
checking for memset... yes
checking whether overlapping arrays are copied correctly... yes
checking the coffee machine... empty - operator may not work as expected
checking whether 64-bit ELF support is sufficient... yes
checking whether to include 64-bit support... yes
checking whether versioning support is sufficient... yes
checking whether to include versioning support... yes
checking whether NLS is requested... yes
checking for dgettext... yes
checking for msgfmt... no
checking for catgets... yes
checking for gencat... /usr/bin/gencat
checking for gmsgfmt... msgfmt
checking for xgettext... xgettext
checking for catalogs to be installed... de
checking for gettext in -lintl... no
checking host system type... x86_64-unknown-linux-gnu
checking whether to build a shared library... no
updating cache ./config.cache
creating ./config.status
creating Makefile
creating lib/Makefile
creating po/Makefile
creating w32/Makefile
sed: can't read ./w32/Makefile.in: No such file or directory
creating libelf.pc
creating config.h
creating lib/sys_elf.h
os.chdir('/home/jd/Desktop/urth-0.1-2-src/libs/ghf-0.8-0')
os.chdir('libs/libelf-0.8.9')
make install CFLAGS="-O2 -m32 " CXXFLAGS="-O2 -m32 " LDFLAGS="-s -m32 "
making install in lib
make[1]: Entering directory `/home/jd/Desktop/urth-0.1-2-src/libs/ghf-0.8-0/libs/libelf-0.8.9/lib'
if test -n ""; then \
          gcc -c -DHAVE_CONFIG_H -I.. -I. -I.  -O2 -m32    begin.c && mv -f begin.o begin.os; \
        else true; fi
gcc -c -DHAVE_CONFIG_H -I.. -I. -I.  -O2 -m32   begin.c
In file included from /usr/include/features.h:346,
                 from /usr/include/stdint.h:26,
                 from ./private.h:36,
                 from begin.c:20:
/usr/include/gnu/stubs.h:7:27: error: gnu/stubs-32.h: No such file or directory
make[1]: *** [begin.o] Error 1
make[1]: Leaving directory `/home/jd/Desktop/urth-0.1-2-src/libs/ghf-0.8-0/libs/libelf-0.8.9/lib'
make: *** [install-recursive] Error 1
scons: *** [/home/jd/Desktop/urth-0.1-2-src/libs/local/lib/libelf.a] Error 2
scons: building terminated because of errors.
scons: *** ['ghf-0.8-0/build/libghf.a'] Error 2
scons: building terminated because of errors.
jd@debian:~/Desktop/urth-0.1-2-src$