mkdir .libs
i586-pc-linux-gnu-gcc -DHAVE_CONFIG_H -I. -I../.. -I/usr/include/libpng12 -I/usr/include/libxml2 -I/usr/include/startup-notification-1.0 -I/usr/include/compiz -DDATADIR=\"/usr/share\" -DLIBDIR=\"/usr/lib\" -DLOCALEDIR=\"/usr/share/locale\" -DIMAGEDIR=\"/usr/share/compiz\" -I../../include -Os -march=i586 -mno-tls-direct-seg-refs -mmmx -m32 -Wall -Wpointer-arith -Wstrict-prototypes -Wmissing-prototypes -Wmissing-declarations -Wnested-externs -fno-strict-aliasing -MT animation.lo -MD -MP -MF .deps/animation.Tpo -c animation.c -fPIC -DPIC -o .libs/animation.o
animation.c:78: error: expected identifier or '(' before '<<' token
animation.c:79:23: error: animation.h: No such file or directory
In file included from animation-internal.h:2,
from animation.c:81:
/usr/include/string.h:39: error: expected declaration specifiers or '...' before 'size_t'
/usr/include/string.h:43: error: expected declaration specifiers or '...' before 'size_t'
/usr/include/string.h:52: error: expected declaration specifiers or '...' before 'size_t'
/usr/include/string.h:59: error: expected declaration specifiers or '...' before 'size_t'
/usr/include/string.h:62: error: expected declaration specifiers or '...' before 'size_t'
/usr/include/string.h:66: error: expected declaration specifiers or '...' before 'size_t'
/usr/include/string.h:77: error: expected declaration specifiers or '...' before 'size_t'
/usr/include/string.h:88: error: expected declaration specifiers or '...' before 'size_t'
/usr/include/string.h:96: error: expected declaration specifiers or '...' before 'size_t'
/usr/include/string.h:102: error: expected declaration specifiers or '...' before 'size_t'
/usr/include/string.h:109: error: expected '=', ',', ';', 'asm' or '__attribute__' before 'strxfrm'
In file included from animation-internal.h:2,
from animation.c:81:
/usr/include/string.h:124: error: expected '=', ',', ';', 'asm' or '__attribute__' before 'strxfrm_l'
/usr/include/string.h:138: error: expected declaration specifiers or '...' before 'size_t'
/usr/include/string.h:184: error: expected '=', ',', ';', 'asm' or '__attribute__' before 'strcspn'
/usr/include/string.h:188: error: expected '=', ',', ';', 'asm' or '__attribute__' before 'strspn'
/usr/include/string.h:225: error: expected declaration specifiers or '...' before 'size_t'
/usr/include/string.h:226: error: expected declaration specifiers or '...' before 'size_t'
/usr/include/string.h:227: error: nonnull argument with out-of-range operand number (argument 1, operand 3)
/usr/include/string.h:232: error: expected declaration specifiers or '...' before 'size_t'
/usr/include/string.h:235: error: expected declaration specifiers or '...' before 'size_t'
/usr/include/string.h:242: error: expected '=', ',', ';', 'asm' or '__attribute__' before 'strlen'
/usr/include/string.h:249: error: expected '=', ',', ';', 'asm' or '__attribute__' before 'strnlen'
/usr/include/string.h:281: error: expected declaration specifiers or '...' before 'size_t'
/usr/include/string.h:288: error: expected declaration specifiers or '...' before 'size_t'
/usr/include/string.h:292: error: expected declaration specifiers or '...' before 'size_t'
/usr/include/string.h:296: error: expected declaration specifiers or '...' before 'size_t'
/usr/include/string.h:299: error: expected declaration specifiers or '...' before 'size_t'
/usr/include/string.h:329: error: expected declaration specifiers or '...' before 'size_t'
/usr/include/string.h:341: error: expected declaration specifiers or '...' before 'size_t'
/usr/include/string.h:342: error: nonnull argument with out-of-range operand number (argument 1, operand 4)
/usr/include/string.h:370: error: expected declaration specifiers or '...' before 'size_t'
/usr/include/string.h:373: error: expected declaration specifiers or '...' before 'size_t'
/usr/include/string.h:380: error: expected declaration specifiers or '...' before 'size_t'
In file included from animation-internal.h:3,
from animation.c:81:
/usr/include/stdlib.h:140: error: expected '=', ',', ';', 'asm' or '__attribute__' before '__ctype_get_mb_cur_max'
In file included from animation-internal.h:3,
from animation.c:81:
/usr/include/stdlib.h:455: error: expected declaration specifiers or '...' before 'size_t'
/usr/include/stdlib.h:485: error: expected declaration specifiers or '...' before 'size_t'
/usr/include/stdlib.h:487: error: nonnull argument with out-of-range operand number (argument 1, operand 4)
/usr/include/stdlib.h:589: error: expected ')' before '__size'
/usr/include/stdlib.h:591: error: expected ')' before '__nmemb'
/usr/include/stdlib.h:600: error: expected declaration specifiers or '...' before 'size_t'
In file included from /usr/include/stdlib.h:612,
from animation-internal.h:3,
from animation.c:81:
/usr/include/alloca.h:33: error: expected ')' before '__size'
In file included from animation-internal.h:3,
from animation.c:81:
/usr/include/stdlib.h:617: error: expected ')' before '__size'
/usr/include/stdlib.h:622: error: expected declaration specifiers or '...' before 'size_t'
/usr/include/stdlib.h:622: error: expected declaration specifiers or '...' before 'size_t'
/usr/include/stdlib.h:776: error: expected declaration specifiers or '...' before 'size_t'
/usr/include/stdlib.h:776: error: expected declaration specifiers or '...' before 'size_t'
/usr/include/stdlib.h:777: error: nonnull argument with out-of-range operand number (argument 1, operand 5)
/usr/include/stdlib.h:781: error: expected declaration specifiers or '...' before 'size_t'
/usr/include/stdlib.h:781: error: expected declaration specifiers or '...' before 'size_t'
/usr/include/stdlib.h:782: error: nonnull argument with out-of-range operand number (argument 1, operand 4)
/usr/include/stdlib.h:854: error: expected declaration specifiers or '...' before 'size_t'
/usr/include/stdlib.h:857: error: expected declaration specifiers or '...' before 'size_t'
/usr/include/stdlib.h:861: error: expected declaration specifiers or '...' before 'size_t'
/usr/include/stdlib.h:865: error: expected declaration specifiers or '...' before 'size_t'
/usr/include/stdlib.h:874: error: expected declaration specifiers or '...' before 'size_t'
/usr/include/stdlib.h:878: error: expected declaration specifiers or '...' before 'size_t'
/usr/include/stdlib.h:885: error: expected '=', ',', ';', 'asm' or '__attribute__' before 'mbstowcs'
/usr/include/stdlib.h:888: error: expected '=', ',', ';', 'asm' or '__attribute__' before 'wcstombs'
/usr/include/stdlib.h:951: error: expected declaration specifiers or '...' before 'size_t'
In file included from /usr/include/_G_config.h:44,
from /usr/include/libio.h:32,
from /usr/include/stdio.h:72,
from /usr/include/compiz/compiz.h:31,
from animation-internal.h:17,
from animation.c:81:
/usr/include/gconv.h:72: error: expected declaration specifiers or '...' before 'size_t'
/usr/include/gconv.h:88: error: expected declaration specifiers or '...' before 'size_t'
/usr/include/gconv.h:97: error: expected declaration specifiers or '...' before 'size_t'
/usr/include/gconv.h:174: error: expected specifier-qualifier-list before 'size_t'
In file included from /usr/include/stdio.h:72,
from /usr/include/compiz/compiz.h:31,
from animation-internal.h:17,
from animation.c:81:
/usr/include/libio.h:328: error: expected specifier-qualifier-list before 'size_t'
/usr/include/libio.h:360: error: expected declaration specifiers or '...' before 'size_t'
/usr/include/libio.h:369: error: expected declaration specifiers or '...' before 'size_t'
/usr/include/libio.h:485: error: expected '=', ',', ';', 'asm' or '__attribute__' before '_IO_sgetn'
In file included from /usr/include/compiz/compiz.h:31,
from animation-internal.h:17,
from animation.c:81:
/usr/include/stdio.h:289: error: expected declaration specifiers or '...' before 'size_t'
/usr/include/stdio.h:294: error: expected declaration specifiers or '...' before 'size_t'
/usr/include/stdio.h:306: error: expected declaration specifiers or '...' before 'size_t'
/usr/include/stdio.h:313: error: expected declaration specifiers or '...' before 'size_t'
/usr/include/stdio.h:355: error: expected declaration specifiers or '...' before 'size_t'
/usr/include/stdio.h:357: error: format string argument not a string type
/usr/include/stdio.h:359: error: expected declaration specifiers or '...' before 'size_t'
/usr/include/stdio.h:565: error: expected declaration specifiers or '...' before 'size_t'
/usr/include/stdio.h:568: error: expected declaration specifiers or '...' before 'size_t'
/usr/include/stdio.h:578: error: expected declaration specifiers or '...' before 'size_t'
/usr/include/stdio.h:608: error: expected '=', ',', ';', 'asm' or '__attribute__' before 'fread'
/usr/include/stdio.h:614: error: expected '=', ',', ';', 'asm' or '__attribute__' before 'fwrite'
/usr/include/stdio.h:636: error: expected '=', ',', ';', 'asm' or '__attribute__' before 'fread_unlocked'
/usr/include/stdio.h:638: error: expected '=', ',', ';', 'asm' or '__attribute__' before 'fwrite_unlocked'
In file included from /usr/include/libxml2/libxml/parser.h:16,
from /usr/include/compiz/compiz.h:43,
from animation-internal.h:17,
from animation.c:81:
/usr/include/libxml2/libxml/tree.h:638: error: expected ')' before 'size'
/usr/include/libxml2/libxml/tree.h:641: error: expected declaration specifiers or '...' before 'size_t'
In file included from /usr/include/libxml2/libxml/encoding.h:28,
from /usr/include/libxml2/libxml/parser.h:796,
from /usr/include/compiz/compiz.h:43,
from animation-internal.h:17,
from animation.c:81:
/usr/include/iconv.h:43: error: expected '=', ',', ';', 'asm' or '__attribute__' before 'iconv'
In file included from /usr/include/libxml2/libxml/globals.h:22,
from /usr/include/libxml2/libxml/xmlIO.h:117,
from /usr/include/libxml2/libxml/parser.h:797,
from /usr/include/compiz/compiz.h:43,
from animation-internal.h:17,
from animation.c:81:
/usr/include/libxml2/libxml/xmlmemory.h:66: error: expected ')' before 'size'
/usr/include/libxml2/libxml/xmlmemory.h:77: error: expected declaration specifiers or '...' before 'size_t'
/usr/include/libxml2/libxml/xmlmemory.h:105: error: expected declaration specifiers or '...' before 'xmlMallocFunc'
/usr/include/libxml2/libxml/xmlmemory.h:110: error: expected declaration specifiers or '...' before 'xmlMallocFunc'
/usr/include/libxml2/libxml/xmlmemory.h:115: error: expected declaration specifiers or '...' before 'xmlMallocFunc'
/usr/include/libxml2/libxml/xmlmemory.h:116: error: expected declaration specifiers or '...' before 'xmlMallocFunc'
/usr/include/libxml2/libxml/xmlmemory.h:121: error: expected declaration specifiers or '...' before 'xmlMallocFunc'
/usr/include/libxml2/libxml/xmlmemory.h:122: error: expected declaration specifiers or '...' before 'xmlMallocFunc'
/usr/include/libxml2/libxml/xmlmemory.h:151: error: expected ')' before 'size'
/usr/include/libxml2/libxml/xmlmemory.h:153: error: expected declaration specifiers or '...' before 'size_t'
/usr/include/libxml2/libxml/xmlmemory.h:159: error: expected ')' before 'size'
/usr/include/libxml2/libxml/xmlmemory.h:161: error: expected declaration specifiers or '...' before 'size_t'
/usr/include/libxml2/libxml/xmlmemory.h:163: error: expected ')' before 'size'
In file included from /usr/include/libxml2/libxml/xmlIO.h:117,
from /usr/include/libxml2/libxml/parser.h:797,
from /usr/include/compiz/compiz.h:43,
from animation-internal.h:17,
from animation.c:81:
/usr/include/libxml2/libxml/globals.h:91: error: expected specifier-qualifier-list before 'xmlMallocFunc'
In file included from /usr/include/libxml2/libxml/xmlIO.h:117,
from /usr/include/libxml2/libxml/parser.h:797,
from /usr/include/compiz/compiz.h:43,
from animation-internal.h:17,
from animation.c:81:
/usr/include/libxml2/libxml/globals.h:204: error: expected '=', ',', ';', 'asm' or '__attribute__' before 'xmlMalloc'
/usr/include/libxml2/libxml/globals.h:205: error: expected '=', ',', ';', 'asm' or '__attribute__' before 'xmlMallocAtomic'
animation.c:82: error: expected identifier or '(' before '>>' token
animation.c:82:9: error: invalid suffix "d600624bf9a0956375a82cfdd1f99da511af55f" on integer constant
animation.c:100: error: expected identifier or '(' before '<<' token
animation.c:105: error: expected identifier or '(' before '>>' token
animation.c:105:9: error: invalid suffix "d600624bf9a0956375a82cfdd1f99da511af55f" on integer constant
animation.c: In function 'ensureLargerClipCapacity':
animation.c:221: error: too many arguments to function 'realloc'
animation.c:226: error: too many arguments to function 'memset'
animation.c:230: error: too many arguments to function 'realloc'
animation.c:240: error: too many arguments to function 'memset'
animation.c: In function 'obtainTransformMatrix':
animation.c:370: error: expected expression before '<<' token
animation.c:373: error: expected expression before '==' token
animation.c:374:9: error: invalid suffix "d600624bf9a0956375a82cfdd1f99da511af55f" on integer constant
animation.c:378: error: expected expression before '==' token
animation.c:380: error: expected expression before '>>' token
animation.c:380:9: error: invalid suffix "d600624bf9a0956375a82cfdd1f99da511af55f" on integer constant
animation.c:384: error: expected expression before '==' token
animation.c:386: error: expected expression before '>>' token
animation.c:386:9: error: invalid suffix "d600624bf9a0956375a82cfdd1f99da511af55f" on integer constant
animation.c:392: error: expected expression before '>>' token
animation.c:392:9: error: invalid suffix "d600624bf9a0956375a82cfdd1f99da511af55f" on integer constant
animation.c:365: warning: unused variable 'perspMat'
animation.c: At top level:
animation.c:560: error: 'fxMagicLampInitGrid' undeclared here (not in a function)
animation.c: In function 'animGetWindowState':
animation.c:655: error: too many arguments to function 'memcpy'
animation.c: In function 'createModel':
animation.c:1011: warning: implicit declaration of function 'calloc'
animation.c:1011: warning: incompatible implicit declaration of built-in function 'calloc'
animation.c: In function 'animPreparePaintScreen':
animation.c:1580: warning: incompatible implicit declaration of built-in function 'calloc'
animation.c: In function 'animAddWindowGeometry':
animation.c:1785: error: 'animDrawWindowGeometry' undeclared (first use in this function)
animation.c:1785: error: (Each undeclared identifier is reported only once
animation.c:1785: error: for each function it appears in.)
animation.c:1831: error: too many arguments to function 'memset'
animation.c:1832: error: too many arguments to function 'memset'
animation.c:2073: error: too many arguments to function 'memcpy'
animation.c:2099: error: too many arguments to function 'memcpy'
animation.c:2140: error: too many arguments to function 'memcpy'
animation.c:2168: error: too many arguments to function 'memcpy'
animation.c:2191: error: too many arguments to function 'memcpy'
animation.c: In function 'updateLastClientListStacking':
animation.c:2549: error: too many arguments to function 'realloc'
animation.c:2559: error: too many arguments to function 'memcpy'
animation.c: In function 'animHandleEvent':
animation.c:3123: warning: incompatible implicit declaration of built-in function 'calloc'
animation.c: In function 'animInitDisplay':
animation.c:3675: warning: incompatible implicit declaration of built-in function 'calloc'
animation.c: In function 'animInitScreen':
animation.c:3716: warning: incompatible implicit declaration of built-in function 'calloc'
animation.c: In function 'animInitWindow':
animation.c:3849: warning: incompatible implicit declaration of built-in function 'calloc'
make[3]: *** [animation.lo] Error 1
make[2]: *** [all-recursive] Error 1
make[1]: *** [all-recursive] Error 1
make: *** [all] Error 2
!!! ERROR in x11-plugins/compiz-fusion-plugins-main-9999:
!!! In src_compile at line 3923
!!! make failed
!!! Call stack:
!!! * src_compile (/var/tmp/paludis/x11-plugins/compiz-fusion-plugins-main-9999/temp/loadsaveenv:3923)
!!! * ebuild_f_compile (/usr/libexec/paludis/src_compile.bash:51)
!!! * ebuild_main (/usr/libexec/paludis/ebuild.bash:363)
!!! * main (/usr/libexec/paludis/ebuild.bash:381)
die trap: exiting with error.