All pastes #583261 Raw Edit

Stuff

public text v1 · immutable
·published 2007-06-22 09:12 UTC
rendered paste body
animation.c:560: error: 'fxMagicLampInitGrid' undeclared here (not in a function)
animation.c: In function 'animGetWindowState':
animation.c:655: error: too many arguments to function 'memcpy'
animation.c: In function 'createModel':
animation.c:1011: warning: implicit declaration of function 'calloc'
animation.c:1011: warning: incompatible implicit declaration of built-in function 'calloc'
animation.c: In function 'animPreparePaintScreen':
animation.c:1580: warning: incompatible implicit declaration of built-in function 'calloc'
animation.c: In function 'animAddWindowGeometry':
animation.c:1785: error: 'animDrawWindowGeometry' undeclared (first use in this function)
animation.c:1785: error: (Each undeclared identifier is reported only once
animation.c:1785: error: for each function it appears in.)
animation.c:1831: error: too many arguments to function 'memset'
animation.c:1832: error: too many arguments to function 'memset'
animation.c:2073: error: too many arguments to function 'memcpy'
animation.c:2099: error: too many arguments to function 'memcpy'
animation.c:2140: error: too many arguments to function 'memcpy'
animation.c:2168: error: too many arguments to function 'memcpy'
animation.c:2191: error: too many arguments to function 'memcpy'
animation.c: In function 'updateLastClientListStacking':
animation.c:2549: error: too many arguments to function 'realloc'
animation.c:2559: error: too many arguments to function 'memcpy'
animation.c: In function 'animHandleEvent':
animation.c:3123: warning: incompatible implicit declaration of built-in function 'calloc'
animation.c: In function 'animInitDisplay':
animation.c:3675: warning: incompatible implicit declaration of built-in function 'calloc'
animation.c: In function 'animInitScreen':
animation.c:3716: warning: incompatible implicit declaration of built-in function 'calloc'
animation.c: In function 'animInitWindow':
animation.c:3849: warning: incompatible implicit declaration of built-in function 'calloc'
make[3]: *** [animation.lo] Error 1
make[2]: *** [all-recursive] Error 1
make[1]: *** [all-recursive] Error 1
make: *** [all] Error 2

!!! ERROR in x11-plugins/compiz-fusion-plugins-main-9999:
!!! In src_compile at line 3923
!!! make failed

!!! Call stack:
!!!    * src_compile (/var/tmp/paludis/x11-plugins/compiz-fusion-plugins-main-9999/temp/loadsaveenv:3923)
!!!    * ebuild_f_compile (/usr/libexec/paludis/src_compile.bash:51)
!!!    * ebuild_main (/usr/libexec/paludis/ebuild.bash:363)
!!!    * main (/usr/libexec/paludis/ebuild.bash:381)

die trap: exiting with error.