g++ -c -pipe -march=pentium4 -Wno-long-double -F/System/Library/Frameworks/{ApplicationServices,AudioUnit,Carbon,CoreAudio,IOKit}.framework/Frameworks -Wall -W -fomit-frame-pointer -O3 -Wall -Wno-switch -Wpointer-arith -Wredundant-decls -Wno-non-virtual-dtor -D__STDC_CONSTANT_MACROS -fomit-frame-pointer -DPIC -fPIC -DMMX -Di386 -DUSING_APPLEREMOTE -D_GNU_SOURCE -D_FILE_OFFSET_BITS=64 -DPREFIX=\"/usr/local\" -DLIBDIR=\"/usr/local/lib\" -DUSING_DARWIN_DA -DQT_NO_DEBUG -DQT_THREAD_SUPPORT -DQT_SHARED -DQT_ACCESSIBILITY_SUPPORT -I/Users/vadim/src/qt-mac-free-3.3.8/mkspecs/default -I. -I/usr/local/include -I/usr/X11R6/include -I../libmythsamplerate -I../libmythsoundtouch -I../.. -I.. -I/Users/vadim/src/qt-mac-free-3.3.8/include -o lircevent.o lircevent.cpp
g++ -c -pipe -march=pentium4 -Wno-long-double -F/System/Library/Frameworks/{ApplicationServices,AudioUnit,Carbon,CoreAudio,IOKit}.framework/Frameworks -Wall -W -fomit-frame-pointer -O3 -Wall -Wno-switch -Wpointer-arith -Wredundant-decls -Wno-non-virtual-dtor -D__STDC_CONSTANT_MACROS -fomit-frame-pointer -DPIC -fPIC -DMMX -Di386 -DUSING_APPLEREMOTE -D_GNU_SOURCE -D_FILE_OFFSET_BITS=64 -DPREFIX=\"/usr/local\" -DLIBDIR=\"/usr/local/lib\" -DUSING_DARWIN_DA -DQT_NO_DEBUG -DQT_THREAD_SUPPORT -DQT_SHARED -DQT_ACCESSIBILITY_SUPPORT -I/Users/vadim/src/qt-mac-free-3.3.8/mkspecs/default -I. -I/usr/local/include -I/usr/X11R6/include -I../libmythsamplerate -I../libmythsoundtouch -I../.. -I.. -I/Users/vadim/src/qt-mac-free-3.3.8/include -o screensaver-x11.o screensaver-x11.cpp
screensaver-x11.cpp:5:22: error: X11/Xlib.h: No such file or directory
screensaver-x11.cpp:8:33: error: X11/extensions/dpms.h: No such file or directory
screensaver-x11.cpp:24: error: 'BOOL' does not name a type
screensaver-x11.cpp:25: error: 'BOOL' does not name a type
screensaver-x11.cpp: In constructor 'ScreenSaverX11::ScreenSaverX11()':
screensaver-x11.cpp:51: error: 'struct ScreenSaverX11Private::<anonymous>' has no member named 'dpmsaware'
screensaver-x11.cpp:51: error: 'qt_xdisplay' was not declared in this scope
screensaver-x11.cpp:51: error: 'DPMSQueryExtension' was not declared in this scope
screensaver-x11.cpp:53: error: 'CARD16' was not declared in this scope
screensaver-x11.cpp:53: error: expected `;' before 'power_level'
screensaver-x11.cpp:61: error: 'power_level' was not declared in this scope
screensaver-x11.cpp:61: error: 'struct ScreenSaverX11Private::<anonymous>' has no member named 'dpmsenabled'
screensaver-x11.cpp:61: error: 'DPMSInfo' was not declared in this scope
screensaver-x11.cpp:63: error: 'struct ScreenSaverX11Private::<anonymous>' has no member named 'dpmsenabled'
screensaver-x11.cpp:69: error: 'struct ScreenSaverX11Private::<anonymous>' has no member named 'dpmsenabled'
screensaver-x11.cpp: In member function 'virtual void ScreenSaverX11::Disable()':
screensaver-x11.cpp:90: error: 'qt_xdisplay' was not declared in this scope
screensaver-x11.cpp:93: error: 'XGetScreenSaver' was not declared in this scope
screensaver-x11.cpp:97: error: 'qt_xdisplay' was not declared in this scope
screensaver-x11.cpp:97: error: 'XResetScreenSaver' was not declared in this scope
screensaver-x11.cpp:98: error: 'XSetScreenSaver' was not declared in this scope
screensaver-x11.cpp:100: error: 'struct ScreenSaverX11Private::<anonymous>' has no member named 'dpmsenabled'
screensaver-x11.cpp:103: error: 'DPMSDisable' was not declared in this scope
screensaver-x11.cpp: In member function 'virtual void ScreenSaverX11::Restore()':
screensaver-x11.cpp:128: error: 'qt_xdisplay' was not declared in this scope
screensaver-x11.cpp:128: error: 'XResetScreenSaver' was not declared in this scope
screensaver-x11.cpp:132: error: 'XSetScreenSaver' was not declared in this scope
screensaver-x11.cpp:138: error: 'DPMSEnable' was not declared in this scope
screensaver-x11.cpp: In member function 'virtual void ScreenSaverX11::Reset()':
screensaver-x11.cpp:148: error: 'qt_xdisplay' was not declared in this scope
screensaver-x11.cpp:148: error: 'XResetScreenSaver' was not declared in this scope
screensaver-x11.cpp:154: error: 'DPMSModeOn' was not declared in this scope
screensaver-x11.cpp:154: error: 'DPMSForceLevel' was not declared in this scope
screensaver-x11.cpp:157: error: 'XSync' was not declared in this scope
screensaver-x11.cpp: In member function 'virtual bool ScreenSaverX11::Asleep()':
screensaver-x11.cpp:163: error: 'struct ScreenSaverX11Private::<anonymous>' has no member named 'dpmsenabled'
screensaver-x11.cpp:169: error: 'BOOL' was not declared in this scope
screensaver-x11.cpp:169: error: expected `;' before 'on'
screensaver-x11.cpp:170: error: 'CARD16' was not declared in this scope
screensaver-x11.cpp:170: error: expected `;' before 'power_level'
screensaver-x11.cpp:172: error: 'qt_xdisplay' was not declared in this scope
screensaver-x11.cpp:172: error: 'power_level' was not declared in this scope
screensaver-x11.cpp:172: error: 'on' was not declared in this scope
screensaver-x11.cpp:172: error: 'DPMSInfo' was not declared in this scope
screensaver-x11.cpp:174: error: 'DPMSModeOn' was not declared in this scope
make[2]: *** [screensaver-x11.o] Error 1
make[1]: *** [sub-libmyth] Error 2
make: *** [sub-libs] Error 2