rendered paste bodyThis file contains any messages produced by compilers while
running configure, to aid debugging if configure makes a mistake.
It was created by configure, which was
generated by GNU Autoconf 2.59. Invocation command line was
$ ./configure
## --------- ##
## Platform. ##
## --------- ##
hostname = Kairos
uname -m = i686
uname -r = 2.6.15-23-386
uname -s = Linux
uname -v = #1 PREEMPT Thu May 18 16:42:54 UTC 2006
/usr/bin/uname -p = unknown
/bin/uname -X = unknown
/bin/arch = i686
/usr/bin/arch -k = unknown
/usr/convex/getsysinfo = unknown
hostinfo = unknown
/bin/machine = unknown
/usr/bin/oslevel = unknown
/bin/universe = unknown
PATH: /usr/local/sbin
PATH: /usr/local/bin
PATH: /usr/sbin
PATH: /usr/bin
PATH: /sbin
PATH: /bin
PATH: /usr/bin/X11
PATH: /opt/e17/bin
## ----------- ##
## Core tests. ##
## ----------- ##
configure:1404: checking build system type
configure:1422: result: i686-pc-linux-gnu
configure:1430: checking host system type
configure:1444: result: i686-pc-linux-gnu
configure:1508: checking for gcc
configure:1524: found /usr/bin/gcc
configure:1534: result: gcc
configure:1778: checking for C compiler version
configure:1781: gcc --version </dev/null >&5
gcc (GCC) 4.0.3 (Ubuntu 4.0.3-1ubuntu5)
Copyright (C) 2006 Free Software Foundation, Inc.
This is free software; see the source for copying conditions. There is NO
warranty; not even for MERCHANTABILITY or FITNESS FOR A PARTICULAR PURPOSE.
configure:1784: $? = 0
configure:1786: gcc -v </dev/null >&5
Using built-in specs.
Target: i486-linux-gnu
Configured with: ../src/configure -v --enable-languages=c,c++,java,f95,objc,ada,treelang --prefix=/usr --enable-shared --with-system-zlib --libexecdir=/usr/lib --without-included-gettext --enable-threads=posix --enable-nls --program-suffix=-4.0 --enable-__cxa_atexit --enable-clocale=gnu --enable-libstdcxx-debug --enable-java-awt=gtk-default --enable-gtk-cairo --with-java-home=/usr/lib/jvm/java-1.4.2-gcj-4.0-1.4.2.0/jre --enable-mpfr --disable-werror --with-tune=pentium4 --enable-checking=release i486-linux-gnu
Thread model: posix
gcc version 4.0.3 (Ubuntu 4.0.3-1ubuntu5)
configure:1789: $? = 0
configure:1791: gcc -V </dev/null >&5
gcc: '-V' option must have argument
configure:1794: $? = 1
configure:1817: checking for C compiler default output file name
configure:1820: gcc conftest.c >&5
configure:1823: $? = 0
configure:1869: result: a.out
configure:1874: checking whether the C compiler works
configure:1880: ./a.out
configure:1883: $? = 0
configure:1900: result: yes
configure:1907: checking whether we are cross compiling
configure:1909: result: no
configure:1912: checking for suffix of executables
configure:1914: gcc -o conftest conftest.c >&5
configure:1917: $? = 0
configure:1942: result:
configure:1948: checking for suffix of object files
configure:1969: gcc -c conftest.c >&5
configure:1972: $? = 0
configure:1994: result: o
configure:1998: checking whether we are using the GNU C compiler
configure:2022: gcc -c conftest.c >&5
configure:2028: $? = 0
configure:2031: test -z || test ! -s conftest.err
configure:2034: $? = 0
configure:2037: test -s conftest.o
configure:2040: $? = 0
configure:2053: result: yes
configure:2059: checking whether gcc accepts -g
configure:2080: gcc -c -g conftest.c >&5
configure:2086: $? = 0
configure:2089: test -z || test ! -s conftest.err
configure:2092: $? = 0
configure:2095: test -s conftest.o
configure:2098: $? = 0
configure:2109: result: yes
configure:2126: checking for gcc option to accept ANSI C
configure:2196: gcc -c -g -O2 conftest.c >&5
configure:2202: $? = 0
configure:2205: test -z || test ! -s conftest.err
configure:2208: $? = 0
configure:2211: test -s conftest.o
configure:2214: $? = 0
configure:2232: result: none needed
configure:2250: gcc -c -g -O2 conftest.c >&5
conftest.c:2: error: syntax error before 'me'
configure:2256: $? = 1
configure: failed program was:
| #ifndef __cplusplus
| choke me
| #endif
configure:2438: checking for g++
configure:2454: found /usr/bin/g++
configure:2464: result: g++
configure:2480: checking for C++ compiler version
configure:2483: g++ --version </dev/null >&5
g++ (GCC) 4.0.3 (Ubuntu 4.0.3-1ubuntu5)
Copyright (C) 2006 Free Software Foundation, Inc.
This is free software; see the source for copying conditions. There is NO
warranty; not even for MERCHANTABILITY or FITNESS FOR A PARTICULAR PURPOSE.
configure:2486: $? = 0
configure:2488: g++ -v </dev/null >&5
Using built-in specs.
Target: i486-linux-gnu
Configured with: ../src/configure -v --enable-languages=c,c++,java,f95,objc,ada,treelang --prefix=/usr --enable-shared --with-system-zlib --libexecdir=/usr/lib --without-included-gettext --enable-threads=posix --enable-nls --program-suffix=-4.0 --enable-__cxa_atexit --enable-clocale=gnu --enable-libstdcxx-debug --enable-java-awt=gtk-default --enable-gtk-cairo --with-java-home=/usr/lib/jvm/java-1.4.2-gcj-4.0-1.4.2.0/jre --enable-mpfr --disable-werror --with-tune=pentium4 --enable-checking=release i486-linux-gnu
Thread model: posix
gcc version 4.0.3 (Ubuntu 4.0.3-1ubuntu5)
configure:2491: $? = 0
configure:2493: g++ -V </dev/null >&5
g++: '-V' option must have argument
configure:2496: $? = 1
configure:2499: checking whether we are using the GNU C++ compiler
configure:2523: g++ -c conftest.cc >&5
configure:2529: $? = 0
configure:2532: test -z || test ! -s conftest.err
configure:2535: $? = 0
configure:2538: test -s conftest.o
configure:2541: $? = 0
configure:2554: result: yes
configure:2560: checking whether g++ accepts -g
configure:2581: g++ -c -g conftest.cc >&5
configure:2587: $? = 0
configure:2590: test -z || test ! -s conftest.err
configure:2593: $? = 0
configure:2596: test -s conftest.o
configure:2599: $? = 0
configure:2610: result: yes
configure:2652: g++ -c -g -O2 conftest.cc >&5
configure:2658: $? = 0
configure:2661: test -z || test ! -s conftest.err
configure:2664: $? = 0
configure:2667: test -s conftest.o
configure:2670: $? = 0
configure:2696: g++ -c -g -O2 conftest.cc >&5
conftest.cc: In function 'int main()':
conftest.cc:13: error: 'exit' was not declared in this scope
configure:2702: $? = 1
configure: failed program was:
| /* confdefs.h. */
|
| #define PACKAGE_NAME ""
| #define PACKAGE_TARNAME ""
| #define PACKAGE_VERSION ""
| #define PACKAGE_STRING ""
| #define PACKAGE_BUGREPORT ""
| /* end confdefs.h. */
|
| int
| main ()
| {
| exit (42);
| ;
| return 0;
| }
configure:2652: g++ -c -g -O2 conftest.cc >&5
configure:2658: $? = 0
configure:2661: test -z || test ! -s conftest.err
configure:2664: $? = 0
configure:2667: test -s conftest.o
configure:2670: $? = 0
configure:2696: g++ -c -g -O2 conftest.cc >&5
configure:2702: $? = 0
configure:2705: test -z || test ! -s conftest.err
configure:2708: $? = 0
configure:2711: test -s conftest.o
configure:2714: $? = 0
configure:2742: checking how to run the C preprocessor
configure:2777: gcc -E conftest.c
configure:2783: $? = 0
configure:2815: gcc -E conftest.c
conftest.c:12:28: error: ac_nonexistent.h: No such file or directory
configure:2821: $? = 1
configure: failed program was:
| /* confdefs.h. */
|
| #define PACKAGE_NAME ""
| #define PACKAGE_TARNAME ""
| #define PACKAGE_VERSION ""
| #define PACKAGE_STRING ""
| #define PACKAGE_BUGREPORT ""
| #ifdef __cplusplus
| extern "C" void std::exit (int) throw (); using std::exit;
| #endif
| /* end confdefs.h. */
| #include <ac_nonexistent.h>
configure:2860: result: gcc -E
configure:2884: gcc -E conftest.c
configure:2890: $? = 0
configure:2922: gcc -E conftest.c
conftest.c:12:28: error: ac_nonexistent.h: No such file or directory
configure:2928: $? = 1
configure: failed program was:
| /* confdefs.h. */
|
| #define PACKAGE_NAME ""
| #define PACKAGE_TARNAME ""
| #define PACKAGE_VERSION ""
| #define PACKAGE_STRING ""
| #define PACKAGE_BUGREPORT ""
| #ifdef __cplusplus
| extern "C" void std::exit (int) throw (); using std::exit;
| #endif
| /* end confdefs.h. */
| #include <ac_nonexistent.h>
configure:2984: checking for a BSD-compatible install
configure:3039: result: /usr/bin/install -c
configure:3053: checking for egrep
configure:3063: result: grep -E
configure:3069: checking for AIX
configure:3091: result: no
configure:3097: checking for library containing strerror
configure:3127: gcc -o conftest -g -O2 conftest.c >&5
configure:3133: $? = 0
configure:3136: test -z || test ! -s conftest.err
configure:3139: $? = 0
configure:3142: test -s conftest
configure:3145: $? = 0
configure:3214: result: none required
configure:3229: checking for working libsupc++
configure:3253: gcc -o conftest -g -O2 conftest.cc -lsupc++ >&5
configure:3259: $? = 0
configure:3262: test -z || test ! -s conftest.err
configure:3265: $? = 0
configure:3268: test -s conftest
configure:3271: $? = 0
configure:3273: result: ok
configure:3313: g++ -c -g -O3 -fno-threadsafe-statics -fno-enforce-eh-specs conftest.cc >&5
configure:3319: $? = 0
configure:3322: test -z || test ! -s conftest.err
configure:3325: $? = 0
configure:3328: test -s conftest.o
configure:3331: $? = 0
configure:3374: checking for setlocale
configure:3431: g++ -o conftest -g -O3 -fno-threadsafe-statics -fno-enforce-eh-specs conftest.cc -lsupc++ >&5
configure:3437: $? = 0
configure:3440: test -z || test ! -s conftest.err
configure:3443: $? = 0
configure:3446: test -s conftest
configure:3449: $? = 0
configure:3461: result: yes
configure:3536: checking for gethostbyname
configure:3593: g++ -o conftest -g -O3 -fno-threadsafe-statics -fno-enforce-eh-specs conftest.cc -lsupc++ >&5
configure:3599: $? = 0
configure:3602: test -z || test ! -s conftest.err
configure:3605: $? = 0
configure:3608: test -s conftest
configure:3611: $? = 0
configure:3623: result: yes
configure:3697: checking for socket
configure:3754: g++ -o conftest -g -O3 -fno-threadsafe-statics -fno-enforce-eh-specs conftest.cc -lsupc++ >&5
configure:3760: $? = 0
configure:3763: test -z || test ! -s conftest.err
configure:3766: $? = 0
configure:3769: test -s conftest
configure:3772: $? = 0
configure:3784: result: yes
configure:4302: checking for mv
configure:4320: found /bin/mv
configure:4333: result: /bin/mv
configure:4342: checking for cp
configure:4360: found /bin/cp
configure:4373: result: /bin/cp
configure:4382: checking for ln
configure:4400: found /bin/ln
configure:4413: result: /bin/ln
configure:4422: checking for sed
configure:4440: found /bin/sed
configure:4453: result: /bin/sed
configure:4462: checking for echo
configure:4480: found /bin/echo
configure:4493: result: /bin/echo
configure:4502: checking for cmp
configure:4520: found /usr/bin/cmp
configure:4533: result: /usr/bin/cmp
configure:4542: checking for tic
configure:4560: found /usr/bin/tic
configure:4572: result: /usr/bin/tic
configure:4587: checking how to run the C++ preprocessor
configure:4618: g++ -E conftest.cc
configure:4624: $? = 0
configure:4656: g++ -E conftest.cc
conftest.cc:17:28: error: ac_nonexistent.h: No such file or directory
configure:4662: $? = 1
configure: failed program was:
| /* confdefs.h. */
|
| #define PACKAGE_NAME ""
| #define PACKAGE_TARNAME ""
| #define PACKAGE_VERSION ""
| #define PACKAGE_STRING ""
| #define PACKAGE_BUGREPORT ""
| #ifdef __cplusplus
| extern "C" void std::exit (int) throw (); using std::exit;
| #endif
| #define _GNU_SOURCE 1
| #define RESFALLBACK "Rxvt"
| #define RESNAME "urxvt"
| #define RESCLASS "URxvt"
| #define RXVTNAME "urxvt"
| /* end confdefs.h. */
| #include <ac_nonexistent.h>
configure:4701: result: g++ -E
configure:4725: g++ -E conftest.cc
configure:4731: $? = 0
configure:4763: g++ -E conftest.cc
conftest.cc:17:28: error: ac_nonexistent.h: No such file or directory
configure:4769: $? = 1
configure: failed program was:
| /* confdefs.h. */
|
| #define PACKAGE_NAME ""
| #define PACKAGE_TARNAME ""
| #define PACKAGE_VERSION ""
| #define PACKAGE_STRING ""
| #define PACKAGE_BUGREPORT ""
| #ifdef __cplusplus
| extern "C" void std::exit (int) throw (); using std::exit;
| #endif
| #define _GNU_SOURCE 1
| #define RESFALLBACK "Rxvt"
| #define RESNAME "urxvt"
| #define RESCLASS "URxvt"
| #define RXVTNAME "urxvt"
| /* end confdefs.h. */
| #include <ac_nonexistent.h>
configure:4815: checking for X
configure:4921: g++ -E conftest.cc
configure:4927: $? = 0
configure:5049: result: libraries /usr/X11R6/lib, headers in standard search path
configure:5220: g++ -o conftest -g -O3 -fno-threadsafe-statics -fno-enforce-eh-specs conftest.cc -lsupc++ -L/usr/X11R6/lib -lX11 >&5
configure:5226: $? = 0
configure:5229: test -z || test ! -s conftest.err
configure:5232: $? = 0
configure:5235: test -s conftest
configure:5238: $? = 0
configure:5394: checking for gethostbyname
configure:5481: result: yes
configure:5630: checking for connect
configure:5687: g++ -o conftest -g -O3 -fno-threadsafe-statics -fno-enforce-eh-specs conftest.cc -lsupc++ >&5
configure:5693: $? = 0
configure:5696: test -z || test ! -s conftest.err
configure:5699: $? = 0
configure:5702: test -s conftest
configure:5705: $? = 0
configure:5717: result: yes
configure:5791: checking for remove
configure:5848: g++ -o conftest -g -O3 -fno-threadsafe-statics -fno-enforce-eh-specs conftest.cc -lsupc++ >&5
configure:5854: $? = 0
configure:5857: test -z || test ! -s conftest.err
configure:5860: $? = 0
configure:5863: test -s conftest
configure:5866: $? = 0
configure:5878: result: yes
configure:5952: checking for shmat
configure:6009: g++ -o conftest -g -O3 -fno-threadsafe-statics -fno-enforce-eh-specs conftest.cc -lsupc++ >&5
configure:6015: $? = 0
configure:6018: test -z || test ! -s conftest.err
configure:6021: $? = 0
configure:6024: test -s conftest
configure:6027: $? = 0
configure:6039: result: yes
configure:6122: checking for IceConnectionNumber in -lICE
configure:6152: g++ -o conftest -g -O3 -fno-threadsafe-statics -fno-enforce-eh-specs -L/usr/X11R6/lib conftest.cc -lICE -lsupc++ >&5
configure:6158: $? = 0
configure:6161: test -z || test ! -s conftest.err
configure:6164: $? = 0
configure:6167: test -s conftest
configure:6170: $? = 0
configure:6183: result: yes
configure:6206: checking for libXpm
configure:6267: g++ -E conftest.cc
configure:6273: $? = 0
configure:6368: g++ -o conftest -g -O3 -fno-threadsafe-statics -fno-enforce-eh-specs conftest.cc -lsupc++ -L/usr/X11R6/lib -lXpm -lX11 >&5
conftest.cc: In function 'int main()':
conftest.cc:21: error: 'XpmReadFileToPixmap' was not declared in this scope
configure:6374: $? = 1
configure: failed program was:
| /* confdefs.h. */
|
| #define PACKAGE_NAME ""
| #define PACKAGE_TARNAME ""
| #define PACKAGE_VERSION ""
| #define PACKAGE_STRING ""
| #define PACKAGE_BUGREPORT ""
| #ifdef __cplusplus
| extern "C" void std::exit (int) throw (); using std::exit;
| #endif
| #define _GNU_SOURCE 1
| #define RESFALLBACK "Rxvt"
| #define RESNAME "urxvt"
| #define RESCLASS "URxvt"
| #define RXVTNAME "urxvt"
| /* end confdefs.h. */
|
| int
| main ()
| {
| XpmReadFileToPixmap()
| ;
| return 0;
| }
configure:6521: result: -I, -L/usr/lib
configure:6551: checking for sys/wait.h that is POSIX.1 compatible
configure:6582: g++ -c -g -O3 -fno-threadsafe-statics -fno-enforce-eh-specs conftest.cc >&5
configure:6588: $? = 0
configure:6591: test -z || test ! -s conftest.err
configure:6594: $? = 0
configure:6597: test -s conftest.o
configure:6600: $? = 0
configure:6611: result: yes
configure:6621: checking for ANSI C header files
configure:6646: g++ -c -g -O3 -fno-threadsafe-statics -fno-enforce-eh-specs conftest.cc >&5
configure:6652: $? = 0
configure:6655: test -z || test ! -s conftest.err
configure:6658: $? = 0
configure:6661: test -s conftest.o
configure:6664: $? = 0
configure:6753: g++ -o conftest -g -O3 -fno-threadsafe-statics -fno-enforce-eh-specs conftest.cc -lsupc++ >&5
configure:6756: $? = 0
configure:6758: ./conftest
configure:6761: $? = 0
configure:6776: result: yes
configure:6800: checking for sys/types.h
configure:6816: g++ -c -g -O3 -fno-threadsafe-statics -fno-enforce-eh-specs conftest.cc >&5
configure:6822: $? = 0
configure:6825: test -z || test ! -s conftest.err
configure:6828: $? = 0
configure:6831: test -s conftest.o
configure:6834: $? = 0
configure:6845: result: yes
configure:6800: checking for sys/stat.h
configure:6816: g++ -c -g -O3 -fno-threadsafe-statics -fno-enforce-eh-specs conftest.cc >&5
configure:6822: $? = 0
configure:6825: test -z || test ! -s conftest.err
configure:6828: $? = 0
configure:6831: test -s conftest.o
configure:6834: $? = 0
configure:6845: result: yes
configure:6800: checking for stdlib.h
configure:6816: g++ -c -g -O3 -fno-threadsafe-statics -fno-enforce-eh-specs conftest.cc >&5
configure:6822: $? = 0
configure:6825: test -z || test ! -s conftest.err
configure:6828: $? = 0
configure:6831: test -s conftest.o
configure:6834: $? = 0
configure:6845: result: yes
configure:6800: checking for string.h
configure:6816: g++ -c -g -O3 -fno-threadsafe-statics -fno-enforce-eh-specs conftest.cc >&5
configure:6822: $? = 0
configure:6825: test -z || test ! -s conftest.err
configure:6828: $? = 0
configure:6831: test -s conftest.o
configure:6834: $? = 0
configure:6845: result: yes
configure:6800: checking for memory.h
configure:6816: g++ -c -g -O3 -fno-threadsafe-statics -fno-enforce-eh-specs conftest.cc >&5
configure:6822: $? = 0
configure:6825: test -z || test ! -s conftest.err
configure:6828: $? = 0
configure:6831: test -s conftest.o
configure:6834: $? = 0
configure:6845: result: yes
configure:6800: checking for strings.h
configure:6816: g++ -c -g -O3 -fno-threadsafe-statics -fno-enforce-eh-specs conftest.cc >&5
configure:6822: $? = 0
configure:6825: test -z || test ! -s conftest.err
configure:6828: $? = 0
configure:6831: test -s conftest.o
configure:6834: $? = 0
configure:6845: result: yes
configure:6800: checking for inttypes.h
configure:6816: g++ -c -g -O3 -fno-threadsafe-statics -fno-enforce-eh-specs conftest.cc >&5
configure:6822: $? = 0
configure:6825: test -z || test ! -s conftest.err
configure:6828: $? = 0
configure:6831: test -s conftest.o
configure:6834: $? = 0
configure:6845: result: yes
configure:6800: checking for stdint.h
configure:6816: g++ -c -g -O3 -fno-threadsafe-statics -fno-enforce-eh-specs conftest.cc >&5
configure:6822: $? = 0
configure:6825: test -z || test ! -s conftest.err
configure:6828: $? = 0
configure:6831: test -s conftest.o
configure:6834: $? = 0
configure:6845: result: yes
configure:6800: checking for unistd.h
configure:6816: g++ -c -g -O3 -fno-threadsafe-statics -fno-enforce-eh-specs conftest.cc >&5
configure:6822: $? = 0
configure:6825: test -z || test ! -s conftest.err
configure:6828: $? = 0
configure:6831: test -s conftest.o
configure:6834: $? = 0
configure:6845: result: yes
configure:6905: checking assert.h usability
configure:6917: g++ -c -g -O3 -fno-threadsafe-statics -fno-enforce-eh-specs conftest.cc >&5
configure:6923: $? = 0
configure:6926: test -z || test ! -s conftest.err
configure:6929: $? = 0
configure:6932: test -s conftest.o
configure:6935: $? = 0
configure:6945: result: yes
configure:6949: checking assert.h presence
configure:6959: g++ -E conftest.cc
configure:6965: $? = 0
configure:6985: result: yes
configure:7020: checking for assert.h
configure:7027: result: yes
configure:6905: checking fcntl.h usability
configure:6917: g++ -c -g -O3 -fno-threadsafe-statics -fno-enforce-eh-specs conftest.cc >&5
configure:6923: $? = 0
configure:6926: test -z || test ! -s conftest.err
configure:6929: $? = 0
configure:6932: test -s conftest.o
configure:6935: $? = 0
configure:6945: result: yes
configure:6949: checking fcntl.h presence
configure:6959: g++ -E conftest.cc
configure:6965: $? = 0
configure:6985: result: yes
configure:7020: checking for fcntl.h
configure:7027: result: yes
configure:6905: checking stdarg.h usability
configure:6917: g++ -c -g -O3 -fno-threadsafe-statics -fno-enforce-eh-specs conftest.cc >&5
configure:6923: $? = 0
configure:6926: test -z || test ! -s conftest.err
configure:6929: $? = 0
configure:6932: test -s conftest.o
configure:6935: $? = 0
configure:6945: result: yes
configure:6949: checking stdarg.h presence
configure:6959: g++ -E conftest.cc
configure:6965: $? = 0
configure:6985: result: yes
configure:7020: checking for stdarg.h
configure:7027: result: yes
configure:6896: checking for stdlib.h
configure:6901: result: yes
configure:6896: checking for string.h
configure:6901: result: yes
configure:6905: checking termios.h usability
configure:6917: g++ -c -g -O3 -fno-threadsafe-statics -fno-enforce-eh-specs conftest.cc >&5
configure:6923: $? = 0
configure:6926: test -z || test ! -s conftest.err
configure:6929: $? = 0
configure:6932: test -s conftest.o
configure:6935: $? = 0
configure:6945: result: yes
configure:6949: checking termios.h presence
configure:6959: g++ -E conftest.cc
configure:6965: $? = 0
configure:6985: result: yes
configure:7020: checking for termios.h
configure:7027: result: yes
configure:6896: checking for unistd.h
configure:6901: result: yes
configure:6905: checking sys/byteorder.h usability
configure:6917: g++ -c -g -O3 -fno-threadsafe-statics -fno-enforce-eh-specs conftest.cc >&5
conftest.cc:70:27: error: sys/byteorder.h: No such file or directory
configure:6923: $? = 1
configure: failed program was:
| /* confdefs.h. */
|
| #define PACKAGE_NAME ""
| #define PACKAGE_TARNAME ""
| #define PACKAGE_VERSION ""
| #define PACKAGE_STRING ""
| #define PACKAGE_BUGREPORT ""
| #ifdef __cplusplus
| extern "C" void std::exit (int) throw (); using std::exit;
| #endif
| #define _GNU_SOURCE 1
| #define RESFALLBACK "Rxvt"
| #define RESNAME "urxvt"
| #define RESCLASS "URxvt"
| #define RXVTNAME "urxvt"
| #define XPM_INC_X11 1
| #define HAVE_SYS_WAIT_H 1
| #define STDC_HEADERS 1
| #define HAVE_SYS_TYPES_H 1
| #define HAVE_SYS_STAT_H 1
| #define HAVE_STDLIB_H 1
| #define HAVE_STRING_H 1
| #define HAVE_MEMORY_H 1
| #define HAVE_STRINGS_H 1
| #define HAVE_INTTYPES_H 1
| #define HAVE_STDINT_H 1
| #define HAVE_UNISTD_H 1
| #define HAVE_ASSERT_H 1
| #define HAVE_FCNTL_H 1
| #define HAVE_STDARG_H 1
| #define HAVE_STDLIB_H 1
| #define HAVE_STRING_H 1
| #define HAVE_TERMIOS_H 1
| #define HAVE_UNISTD_H 1
| /* end confdefs.h. */
| #include <stdio.h>
| #if HAVE_SYS_TYPES_H
| # include <sys/types.h>
| #endif
| #if HAVE_SYS_STAT_H
| # include <sys/stat.h>
| #endif
| #if STDC_HEADERS
| # include <stdlib.h>
| # include <stddef.h>
| #else
| # if HAVE_STDLIB_H
| # include <stdlib.h>
| # endif
| #endif
| #if HAVE_STRING_H
| # if !STDC_HEADERS && HAVE_MEMORY_H
| # include <memory.h>
| # endif
| # include <string.h>
| #endif
| #if HAVE_STRINGS_H
| # include <strings.h>
| #endif
| #if HAVE_INTTYPES_H
| # include <inttypes.h>
| #else
| # if HAVE_STDINT_H
| # include <stdint.h>
| # endif
| #endif
| #if HAVE_UNISTD_H
| # include <unistd.h>
| #endif
| #include <sys/byteorder.h>
configure:6945: result: no
configure:6949: checking sys/byteorder.h presence
configure:6959: g++ -E conftest.cc
conftest.cc:36:27: error: sys/byteorder.h: No such file or directory
configure:6965: $? = 1
configure: failed program was:
| /* confdefs.h. */
|
| #define PACKAGE_NAME ""
| #define PACKAGE_TARNAME ""
| #define PACKAGE_VERSION ""
| #define PACKAGE_STRING ""
| #define PACKAGE_BUGREPORT ""
| #ifdef __cplusplus
| extern "C" void std::exit (int) throw (); using std::exit;
| #endif
| #define _GNU_SOURCE 1
| #define RESFALLBACK "Rxvt"
| #define RESNAME "urxvt"
| #define RESCLASS "URxvt"
| #define RXVTNAME "urxvt"
| #define XPM_INC_X11 1
| #define HAVE_SYS_WAIT_H 1
| #define STDC_HEADERS 1
| #define HAVE_SYS_TYPES_H 1
| #define HAVE_SYS_STAT_H 1
| #define HAVE_STDLIB_H 1
| #define HAVE_STRING_H 1
| #define HAVE_MEMORY_H 1
| #define HAVE_STRINGS_H 1
| #define HAVE_INTTYPES_H 1
| #define HAVE_STDINT_H 1
| #define HAVE_UNISTD_H 1
| #define HAVE_ASSERT_H 1
| #define HAVE_FCNTL_H 1
| #define HAVE_STDARG_H 1
| #define HAVE_STDLIB_H 1
| #define HAVE_STRING_H 1
| #define HAVE_TERMIOS_H 1
| #define HAVE_UNISTD_H 1
| /* end confdefs.h. */
| #include <sys/byteorder.h>
configure:6985: result: no
configure:7020: checking for sys/byteorder.h
configure:7027: result: no
configure:6905: checking sys/ioctl.h usability
configure:6917: g++ -c -g -O3 -fno-threadsafe-statics -fno-enforce-eh-specs conftest.cc >&5
configure:6923: $? = 0
configure:6926: test -z || test ! -s conftest.err
configure:6929: $? = 0
configure:6932: test -s conftest.o
configure:6935: $? = 0
configure:6945: result: yes
configure:6949: checking sys/ioctl.h presence
configure:6959: g++ -E conftest.cc
configure:6965: $? = 0
configure:6985: result: yes
configure:7020: checking for sys/ioctl.h
configure:7027: result: yes
configure:6905: checking sys/select.h usability
configure:6917: g++ -c -g -O3 -fno-threadsafe-statics -fno-enforce-eh-specs conftest.cc >&5
configure:6923: $? = 0
configure:6926: test -z || test ! -s conftest.err
configure:6929: $? = 0
configure:6932: test -s conftest.o
configure:6935: $? = 0
configure:6945: result: yes
configure:6949: checking sys/select.h presence
configure:6959: g++ -E conftest.cc
configure:6965: $? = 0
configure:6985: result: yes
configure:7020: checking for sys/select.h
configure:7027: result: yes
configure:6905: checking sys/sockio.h usability
configure:6917: g++ -c -g -O3 -fno-threadsafe-statics -fno-enforce-eh-specs conftest.cc >&5
conftest.cc:72:24: error: sys/sockio.h: No such file or directory
configure:6923: $? = 1
configure: failed program was:
| /* confdefs.h. */
|
| #define PACKAGE_NAME ""
| #define PACKAGE_TARNAME ""
| #define PACKAGE_VERSION ""
| #define PACKAGE_STRING ""
| #define PACKAGE_BUGREPORT ""
| #ifdef __cplusplus
| extern "C" void std::exit (int) throw (); using std::exit;
| #endif
| #define _GNU_SOURCE 1
| #define RESFALLBACK "Rxvt"
| #define RESNAME "urxvt"
| #define RESCLASS "URxvt"
| #define RXVTNAME "urxvt"
| #define XPM_INC_X11 1
| #define HAVE_SYS_WAIT_H 1
| #define STDC_HEADERS 1
| #define HAVE_SYS_TYPES_H 1
| #define HAVE_SYS_STAT_H 1
| #define HAVE_STDLIB_H 1
| #define HAVE_STRING_H 1
| #define HAVE_MEMORY_H 1
| #define HAVE_STRINGS_H 1
| #define HAVE_INTTYPES_H 1
| #define HAVE_STDINT_H 1
| #define HAVE_UNISTD_H 1
| #define HAVE_ASSERT_H 1
| #define HAVE_FCNTL_H 1
| #define HAVE_STDARG_H 1
| #define HAVE_STDLIB_H 1
| #define HAVE_STRING_H 1
| #define HAVE_TERMIOS_H 1
| #define HAVE_UNISTD_H 1
| #define HAVE_SYS_IOCTL_H 1
| #define HAVE_SYS_SELECT_H 1
| /* end confdefs.h. */
| #include <stdio.h>
| #if HAVE_SYS_TYPES_H
| # include <sys/types.h>
| #endif
| #if HAVE_SYS_STAT_H
| # include <sys/stat.h>
| #endif
| #if STDC_HEADERS
| # include <stdlib.h>
| # include <stddef.h>
| #else
| # if HAVE_STDLIB_H
| # include <stdlib.h>
| # endif
| #endif
| #if HAVE_STRING_H
| # if !STDC_HEADERS && HAVE_MEMORY_H
| # include <memory.h>
| # endif
| # include <string.h>
| #endif
| #if HAVE_STRINGS_H
| # include <strings.h>
| #endif
| #if HAVE_INTTYPES_H
| # include <inttypes.h>
| #else
| # if HAVE_STDINT_H
| # include <stdint.h>
| # endif
| #endif
| #if HAVE_UNISTD_H
| # include <unistd.h>
| #endif
| #include <sys/sockio.h>
configure:6945: result: no
configure:6949: checking sys/sockio.h presence
configure:6959: g++ -E conftest.cc
conftest.cc:38:24: error: sys/sockio.h: No such file or directory
configure:6965: $? = 1
configure: failed program was:
| /* confdefs.h. */
|
| #define PACKAGE_NAME ""
| #define PACKAGE_TARNAME ""
| #define PACKAGE_VERSION ""
| #define PACKAGE_STRING ""
| #define PACKAGE_BUGREPORT ""
| #ifdef __cplusplus
| extern "C" void std::exit (int) throw (); using std::exit;
| #endif
| #define _GNU_SOURCE 1
| #define RESFALLBACK "Rxvt"
| #define RESNAME "urxvt"
| #define RESCLASS "URxvt"
| #define RXVTNAME "urxvt"
| #define XPM_INC_X11 1
| #define HAVE_SYS_WAIT_H 1
| #define STDC_HEADERS 1
| #define HAVE_SYS_TYPES_H 1
| #define HAVE_SYS_STAT_H 1
| #define HAVE_STDLIB_H 1
| #define HAVE_STRING_H 1
| #define HAVE_MEMORY_H 1
| #define HAVE_STRINGS_H 1
| #define HAVE_INTTYPES_H 1
| #define HAVE_STDINT_H 1
| #define HAVE_UNISTD_H 1
| #define HAVE_ASSERT_H 1
| #define HAVE_FCNTL_H 1
| #define HAVE_STDARG_H 1
| #define HAVE_STDLIB_H 1
| #define HAVE_STRING_H 1
| #define HAVE_TERMIOS_H 1
| #define HAVE_UNISTD_H 1
| #define HAVE_SYS_IOCTL_H 1
| #define HAVE_SYS_SELECT_H 1
| /* end confdefs.h. */
| #include <sys/sockio.h>
configure:6985: result: no
configure:7020: checking for sys/sockio.h
configure:7027: result: no
configure:6905: checking sys/strredir.h usability
configure:6917: g++ -c -g -O3 -fno-threadsafe-statics -fno-enforce-eh-specs conftest.cc >&5
conftest.cc:72:26: error: sys/strredir.h: No such file or directory
configure:6923: $? = 1
configure: failed program was:
| /* confdefs.h. */
|
| #define PACKAGE_NAME ""
| #define PACKAGE_TARNAME ""
| #define PACKAGE_VERSION ""
| #define PACKAGE_STRING ""
| #define PACKAGE_BUGREPORT ""
| #ifdef __cplusplus
| extern "C" void std::exit (int) throw (); using std::exit;
| #endif
| #define _GNU_SOURCE 1
| #define RESFALLBACK "Rxvt"
| #define RESNAME "urxvt"
| #define RESCLASS "URxvt"
| #define RXVTNAME "urxvt"
| #define XPM_INC_X11 1
| #define HAVE_SYS_WAIT_H 1
| #define STDC_HEADERS 1
| #define HAVE_SYS_TYPES_H 1
| #define HAVE_SYS_STAT_H 1
| #define HAVE_STDLIB_H 1
| #define HAVE_STRING_H 1
| #define HAVE_MEMORY_H 1
| #define HAVE_STRINGS_H 1
| #define HAVE_INTTYPES_H 1
| #define HAVE_STDINT_H 1
| #define HAVE_UNISTD_H 1
| #define HAVE_ASSERT_H 1
| #define HAVE_FCNTL_H 1
| #define HAVE_STDARG_H 1
| #define HAVE_STDLIB_H 1
| #define HAVE_STRING_H 1
| #define HAVE_TERMIOS_H 1
| #define HAVE_UNISTD_H 1
| #define HAVE_SYS_IOCTL_H 1
| #define HAVE_SYS_SELECT_H 1
| /* end confdefs.h. */
| #include <stdio.h>
| #if HAVE_SYS_TYPES_H
| # include <sys/types.h>
| #endif
| #if HAVE_SYS_STAT_H
| # include <sys/stat.h>
| #endif
| #if STDC_HEADERS
| # include <stdlib.h>
| # include <stddef.h>
| #else
| # if HAVE_STDLIB_H
| # include <stdlib.h>
| # endif
| #endif
| #if HAVE_STRING_H
| # if !STDC_HEADERS && HAVE_MEMORY_H
| # include <memory.h>
| # endif
| # include <string.h>
| #endif
| #if HAVE_STRINGS_H
| # include <strings.h>
| #endif
| #if HAVE_INTTYPES_H
| # include <inttypes.h>
| #else
| # if HAVE_STDINT_H
| # include <stdint.h>
| # endif
| #endif
| #if HAVE_UNISTD_H
| # include <unistd.h>
| #endif
| #include <sys/strredir.h>
configure:6945: result: no
configure:6949: checking sys/strredir.h presence
configure:6959: g++ -E conftest.cc
conftest.cc:38:26: error: sys/strredir.h: No such file or directory
configure:6965: $? = 1
configure: failed program was:
| /* confdefs.h. */
|
| #define PACKAGE_NAME ""
| #define PACKAGE_TARNAME ""
| #define PACKAGE_VERSION ""
| #define PACKAGE_STRING ""
| #define PACKAGE_BUGREPORT ""
| #ifdef __cplusplus
| extern "C" void std::exit (int) throw (); using std::exit;
| #endif
| #define _GNU_SOURCE 1
| #define RESFALLBACK "Rxvt"
| #define RESNAME "urxvt"
| #define RESCLASS "URxvt"
| #define RXVTNAME "urxvt"
| #define XPM_INC_X11 1
| #define HAVE_SYS_WAIT_H 1
| #define STDC_HEADERS 1
| #define HAVE_SYS_TYPES_H 1
| #define HAVE_SYS_STAT_H 1
| #define HAVE_STDLIB_H 1
| #define HAVE_STRING_H 1
| #define HAVE_MEMORY_H 1
| #define HAVE_STRINGS_H 1
| #define HAVE_INTTYPES_H 1
| #define HAVE_STDINT_H 1
| #define HAVE_UNISTD_H 1
| #define HAVE_ASSERT_H 1
| #define HAVE_FCNTL_H 1
| #define HAVE_STDARG_H 1
| #define HAVE_STDLIB_H 1
| #define HAVE_STRING_H 1
| #define HAVE_TERMIOS_H 1
| #define HAVE_UNISTD_H 1
| #define HAVE_SYS_IOCTL_H 1
| #define HAVE_SYS_SELECT_H 1
| /* end confdefs.h. */
| #include <sys/strredir.h>
configure:6985: result: no
configure:7020: checking for sys/strredir.h
configure:7027: result: no
configure:6905: checking sys/time.h usability
configure:6917: g++ -c -g -O3 -fno-threadsafe-statics -fno-enforce-eh-specs conftest.cc >&5
configure:6923: $? = 0
configure:6926: test -z || test ! -s conftest.err
configure:6929: $? = 0
configure:6932: test -s conftest.o
configure:6935: $? = 0
configure:6945: result: yes
configure:6949: checking sys/time.h presence
configure:6959: g++ -E conftest.cc
configure:6965: $? = 0
configure:6985: result: yes
configure:7020: checking for sys/time.h
configure:7027: result: yes
configure:6896: checking for stdint.h
configure:6901: result: yes
configure:6905: checking wchar.h usability
configure:6917: g++ -c -g -O3 -fno-threadsafe-statics -fno-enforce-eh-specs conftest.cc >&5
configure:6923: $? = 0
configure:6926: test -z || test ! -s conftest.err
configure:6929: $? = 0
configure:6932: test -s conftest.o
configure:6935: $? = 0
configure:6945: result: yes
configure:6949: checking wchar.h presence
configure:6959: g++ -E conftest.cc
configure:6965: $? = 0
configure:6985: result: yes
configure:7020: checking for wchar.h
configure:7027: result: yes
configure:6905: checking cwchar usability
configure:6917: g++ -c -g -O3 -fno-threadsafe-statics -fno-enforce-eh-specs conftest.cc >&5
configure:6923: $? = 0
configure:6926: test -z || test ! -s conftest.err
configure:6929: $? = 0
configure:6932: test -s conftest.o
configure:6935: $? = 0
configure:6945: result: yes
configure:6949: checking cwchar presence
configure:6959: g++ -E conftest.cc
configure:6965: $? = 0
configure:6985: result: yes
configure:7020: checking for cwchar
configure:7027: result: yes
configure:6905: checking clocale usability
configure:6917: g++ -c -g -O3 -fno-threadsafe-statics -fno-enforce-eh-specs conftest.cc >&5
configure:6923: $? = 0
configure:6926: test -z || test ! -s conftest.err
configure:6929: $? = 0
configure:6932: test -s conftest.o
configure:6935: $? = 0
configure:6945: result: yes
configure:6949: checking clocale presence
configure:6959: g++ -E conftest.cc
configure:6965: $? = 0
configure:6985: result: yes
configure:7020: checking for clocale
configure:7027: result: yes
configure:7041: checking whether time.h and sys/time.h may both be included
configure:7066: g++ -c -g -O3 -fno-threadsafe-statics -fno-enforce-eh-specs conftest.cc >&5
configure:7072: $? = 0
configure:7075: test -z || test ! -s conftest.err
configure:7078: $? = 0
configure:7081: test -s conftest.o
configure:7084: $? = 0
configure:7095: result: yes
configure:7106: checking whether termios.h and sys/ioctl.h may both be included
configure:7131: g++ -c -g -O3 -fno-threadsafe-statics -fno-enforce-eh-specs conftest.cc >&5
configure:7137: $? = 0
configure:7140: test -z || test ! -s conftest.err
configure:7143: $? = 0
configure:7146: test -s conftest.o
configure:7149: $? = 0
configure:7160: result: yes
configure:7174: checking for -rpath dynamic library path recording
configure:7197: g++ -o conftest -g -O3 -fno-threadsafe-statics -fno-enforce-eh-specs conftest.cc -lsupc++ -L/usr/X11R6/lib -Wl,-rpath -Wl,/usr/X11R6/lib -lX11 >&5
conftest.cc: In function 'int main()':
conftest.cc:48: error: 'XOpenDisplay' was not declared in this scope
configure:7200: $? = 1
configure: program exited with status 1
configure: failed program was:
| /* confdefs.h. */
|
| #define PACKAGE_NAME ""
| #define PACKAGE_TARNAME ""
| #define PACKAGE_VERSION ""
| #define PACKAGE_STRING ""
| #define PACKAGE_BUGREPORT ""
| #ifdef __cplusplus
| extern "C" void std::exit (int) throw (); using std::exit;
| #endif
| #define _GNU_SOURCE 1
| #define RESFALLBACK "Rxvt"
| #define RESNAME "urxvt"
| #define RESCLASS "URxvt"
| #define RXVTNAME "urxvt"
| #define XPM_INC_X11 1
| #define HAVE_SYS_WAIT_H 1
| #define STDC_HEADERS 1
| #define HAVE_SYS_TYPES_H 1
| #define HAVE_SYS_STAT_H 1
| #define HAVE_STDLIB_H 1
| #define HAVE_STRING_H 1
| #define HAVE_MEMORY_H 1
| #define HAVE_STRINGS_H 1
| #define HAVE_INTTYPES_H 1
| #define HAVE_STDINT_H 1
| #define HAVE_UNISTD_H 1
| #define HAVE_ASSERT_H 1
| #define HAVE_FCNTL_H 1
| #define HAVE_STDARG_H 1
| #define HAVE_STDLIB_H 1
| #define HAVE_STRING_H 1
| #define HAVE_TERMIOS_H 1
| #define HAVE_UNISTD_H 1
| #define HAVE_SYS_IOCTL_H 1
| #define HAVE_SYS_SELECT_H 1
| #define HAVE_SYS_TIME_H 1
| #define HAVE_STDINT_H 1
| #define HAVE_WCHAR_H 1
| #define HAVE_CWCHAR 1
| #define HAVE_CLOCALE 1
| #define TIME_WITH_SYS_TIME 1
| /* end confdefs.h. */
|
| main()
| {
| exit(0);
| (void) XOpenDisplay("foobar");
| }
configure:7219: result: no
configure:7224: checking for -R dynamic library path recording
configure:7246: g++ -o conftest -g -O3 -fno-threadsafe-statics -fno-enforce-eh-specs conftest.cc -lsupc++ -L/usr/X11R6/lib -Wl,-R/usr/X11R6/lib -lX11 >&5
conftest.cc: In function 'int main()':
conftest.cc:48: error: 'XOpenDisplay' was not declared in this scope
configure:7249: $? = 1
configure: program exited with status 1
configure: failed program was:
| /* confdefs.h. */
|
| #define PACKAGE_NAME ""
| #define PACKAGE_TARNAME ""
| #define PACKAGE_VERSION ""
| #define PACKAGE_STRING ""
| #define PACKAGE_BUGREPORT ""
| #ifdef __cplusplus
| extern "C" void std::exit (int) throw (); using std::exit;
| #endif
| #define _GNU_SOURCE 1
| #define RESFALLBACK "Rxvt"
| #define RESNAME "urxvt"
| #define RESCLASS "URxvt"
| #define RXVTNAME "urxvt"
| #define XPM_INC_X11 1
| #define HAVE_SYS_WAIT_H 1
| #define STDC_HEADERS 1
| #define HAVE_SYS_TYPES_H 1
| #define HAVE_SYS_STAT_H 1
| #define HAVE_STDLIB_H 1
| #define HAVE_STRING_H 1
| #define HAVE_MEMORY_H 1
| #define HAVE_STRINGS_H 1
| #define HAVE_INTTYPES_H 1
| #define HAVE_STDINT_H 1
| #define HAVE_UNISTD_H 1
| #define HAVE_ASSERT_H 1
| #define HAVE_FCNTL_H 1
| #define HAVE_STDARG_H 1
| #define HAVE_STDLIB_H 1
| #define HAVE_STRING_H 1
| #define HAVE_TERMIOS_H 1
| #define HAVE_UNISTD_H 1
| #define HAVE_SYS_IOCTL_H 1
| #define HAVE_SYS_SELECT_H 1
| #define HAVE_SYS_TIME_H 1
| #define HAVE_STDINT_H 1
| #define HAVE_WCHAR_H 1
| #define HAVE_CWCHAR 1
| #define HAVE_CLOCALE 1
| #define TIME_WITH_SYS_TIME 1
| /* end confdefs.h. */
|
| main()
| {
| exit(0);
| (void) XOpenDisplay("foobar");
| }
configure:7268: result: no
configure:7275: checking for XPointer
configure:7296: g++ -c -g -O3 -fno-threadsafe-statics -fno-enforce-eh-specs conftest.cc >&5
configure:7302: $? = 0
configure:7305: test -z || test ! -s conftest.err
configure:7308: $? = 0
configure:7311: test -s conftest.o
configure:7314: $? = 0
configure:7325: result: yes
configure:7337: checking for XLIB_ILLEGAL_ACCESS
configure:7364: g++ -c -g -O3 -fno-threadsafe-statics -fno-enforce-eh-specs conftest.cc >&5
configure:7370: $? = 0
configure:7373: test -z || test ! -s conftest.err
configure:7376: $? = 0
configure:7379: test -s conftest.o
configure:7382: $? = 0
configure:7394: result: yes
configure:7404: checking for an ANSI C-conforming const
configure:7471: g++ -c -g -O3 -fno-threadsafe-statics -fno-enforce-eh-specs conftest.cc >&5
configure:7477: $? = 0
configure:7480: test -z || test ! -s conftest.err
configure:7483: $? = 0
configure:7486: test -s conftest.o
configure:7489: $? = 0
configure:7500: result: yes
configure:7510: checking for inline
configure:7531: g++ -c -g -O3 -fno-threadsafe-statics -fno-enforce-eh-specs conftest.cc >&5
configure:7537: $? = 0
configure:7540: test -z || test ! -s conftest.err
configure:7543: $? = 0
configure:7546: test -s conftest.o
configure:7549: $? = 0
configure:7561: result: inline
configure:7582: checking for mode_t
configure:7606: g++ -c -g -O3 -fno-threadsafe-statics -fno-enforce-eh-specs conftest.cc >&5
configure:7612: $? = 0
configure:7615: test -z || test ! -s conftest.err
configure:7618: $? = 0
configure:7621: test -s conftest.o
configure:7624: $? = 0
configure:7635: result: yes
configure:7647: checking for pid_t
configure:7671: g++ -c -g -O3 -fno-threadsafe-statics -fno-enforce-eh-specs conftest.cc >&5
configure:7677: $? = 0
configure:7680: test -z || test ! -s conftest.err
configure:7683: $? = 0
configure:7686: test -s conftest.o
configure:7689: $? = 0
configure:7700: result: yes
configure:7712: checking for uid_t in sys/types.h
configure:7735: result: yes
configure:7751: checking for short
configure:7775: g++ -c -g -O3 -fno-threadsafe-statics -fno-enforce-eh-specs conftest.cc >&5
configure:7781: $? = 0
configure:7784: test -z || test ! -s conftest.err
configure:7787: $? = 0
configure:7790: test -s conftest.o
configure:7793: $? = 0
configure:7804: result: yes
configure:7807: checking size of short
configure:8119: g++ -o conftest -g -O3 -fno-threadsafe-statics -fno-enforce-eh-specs conftest.cc -lsupc++ >&5
configure:8122: $? = 0
configure:8124: ./conftest
configure:8127: $? = 0
configure:8150: result: 2
configure:8157: checking for int
configure:8181: g++ -c -g -O3 -fno-threadsafe-statics -fno-enforce-eh-specs conftest.cc >&5
configure:8187: $? = 0
configure:8190: test -z || test ! -s conftest.err
configure:8193: $? = 0
configure:8196: test -s conftest.o
configure:8199: $? = 0
configure:8210: result: yes
configure:8213: checking size of int
configure:8525: g++ -o conftest -g -O3 -fno-threadsafe-statics -fno-enforce-eh-specs conftest.cc -lsupc++ >&5
configure:8528: $? = 0
configure:8530: ./conftest
configure:8533: $? = 0
configure:8556: result: 4
configure:8563: checking for long long
configure:8587: g++ -c -g -O3 -fno-threadsafe-statics -fno-enforce-eh-specs conftest.cc >&5
configure:8593: $? = 0
configure:8596: test -z || test ! -s conftest.err
configure:8599: $? = 0
configure:8602: test -s conftest.o
configure:8605: $? = 0
configure:8616: result: yes
configure:8619: checking size of long long
configure:8931: g++ -o conftest -g -O3 -fno-threadsafe-statics -fno-enforce-eh-specs conftest.cc -lsupc++ >&5
configure:8934: $? = 0
configure:8936: ./conftest
configure:8939: $? = 0
configure:8962: result: 8
configure:8969: checking for int *
configure:8993: g++ -c -g -O3 -fno-threadsafe-statics -fno-enforce-eh-specs conftest.cc >&5
configure:8999: $? = 0
configure:9002: test -z || test ! -s conftest.err
configure:9005: $? = 0
configure:9008: test -s conftest.o
configure:9011: $? = 0
configure:9022: result: yes
configure:9025: checking size of int *
configure:9337: g++ -o conftest -g -O3 -fno-threadsafe-statics -fno-enforce-eh-specs conftest.cc -lsupc++ >&5
configure:9340: $? = 0
configure:9342: ./conftest
configure:9345: $? = 0
configure:9368: result: 4
configure:9377: checking for int16_t
configure:9398: g++ -c -g -O3 -fno-threadsafe-statics -fno-enforce-eh-specs conftest.cc >&5
configure:9404: $? = 0
configure:9407: test -z || test ! -s conftest.err
configure:9410: $? = 0
configure:9413: test -s conftest.o
configure:9416: $? = 0
configure:9447: result: yes
configure:9459: checking for uint16_t
configure:9480: g++ -c -g -O3 -fno-threadsafe-statics -fno-enforce-eh-specs conftest.cc >&5
configure:9486: $? = 0
configure:9489: test -z || test ! -s conftest.err
configure:9492: $? = 0
configure:9495: test -s conftest.o
configure:9498: $? = 0
configure:9529: result: yes
configure:9541: checking for int32_t
configure:9562: g++ -c -g -O3 -fno-threadsafe-statics -fno-enforce-eh-specs conftest.cc >&5
configure:9568: $? = 0
configure:9571: test -z || test ! -s conftest.err
configure:9574: $? = 0
configure:9577: test -s conftest.o
configure:9580: $? = 0
configure:9611: result: yes
configure:9623: checking for uint32_t
configure:9644: g++ -c -g -O3 -fno-threadsafe-statics -fno-enforce-eh-specs conftest.cc >&5
configure:9650: $? = 0
configure:9653: test -z || test ! -s conftest.err
configure:9656: $? = 0
configure:9659: test -s conftest.o
configure:9662: $? = 0
configure:9693: result: yes
configure:9725: checking return type of signal handlers
configure:9756: g++ -c -g -O3 -fno-threadsafe-statics -fno-enforce-eh-specs conftest.cc >&5
configure:9762: $? = 0
configure:9765: test -z || test ! -s conftest.err
configure:9768: $? = 0
configure:9771: test -s conftest.o
configure:9774: $? = 0
configure:9785: result: void
configure:9804: checking for unsetenv
configure:9861: g++ -o conftest -g -O3 -fno-threadsafe-statics -fno-enforce-eh-specs conftest.cc -lsupc++ >&5
configure:9867: $? = 0
configure:9870: test -z || test ! -s conftest.err
configure:9873: $? = 0
configure:9876: test -s conftest
configure:9879: $? = 0
configure:9891: result: yes
configure:9804: checking for setutent
configure:9861: g++ -o conftest -g -O3 -fno-threadsafe-statics -fno-enforce-eh-specs conftest.cc -lsupc++ >&5
configure:9867: $? = 0
configure:9870: test -z || test ! -s conftest.err
configure:9873: $? = 0
configure:9876: test -s conftest
configure:9879: $? = 0
configure:9891: result: yes
configure:9804: checking for on_exit
configure:9861: g++ -o conftest -g -O3 -fno-threadsafe-statics -fno-enforce-eh-specs conftest.cc -lsupc++ >&5
configure:9867: $? = 0
configure:9870: test -z || test ! -s conftest.err
configure:9873: $? = 0
configure:9876: test -s conftest
configure:9879: $? = 0
configure:9891: result: yes
configure:9963: checking for ttyslot
configure:10020: g++ -o conftest -g -O3 -fno-threadsafe-statics -fno-enforce-eh-specs conftest.cc -lsupc++ >&5
configure:10026: $? = 0
configure:10029: test -z || test ! -s conftest.err
configure:10032: $? = 0
configure:10035: test -s conftest
configure:10038: $? = 0
configure:10050: result: yes
configure:9963: checking for updwtmp
configure:10020: g++ -o conftest -g -O3 -fno-threadsafe-statics -fno-enforce-eh-specs conftest.cc -lsupc++ >&5
configure:10026: $? = 0
configure:10029: test -z || test ! -s conftest.err
configure:10032: $? = 0
configure:10035: test -s conftest
configure:10038: $? = 0
configure:10050: result: yes
configure:9963: checking for updwtmpx
configure:10020: g++ -o conftest -g -O3 -fno-threadsafe-statics -fno-enforce-eh-specs conftest.cc -lsupc++ >&5
configure:10026: $? = 0
configure:10029: test -z || test ! -s conftest.err
configure:10032: $? = 0
configure:10035: test -s conftest
configure:10038: $? = 0
configure:10050: result: yes
configure:10081: checking utmp.h usability
configure:10093: g++ -c -g -O3 -fno-threadsafe-statics -fno-enforce-eh-specs conftest.cc >&5
configure:10099: $? = 0
configure:10102: test -z || test ! -s conftest.err
configure:10105: $? = 0
configure:10108: test -s conftest.o
configure:10111: $? = 0
configure:10121: result: yes
configure:10125: checking utmp.h presence
configure:10135: g++ -E conftest.cc
configure:10141: $? = 0
configure:10161: result: yes
configure:10196: checking for utmp.h
configure:10203: result: yes
configure:10081: checking utmpx.h usability
configure:10093: g++ -c -g -O3 -fno-threadsafe-statics -fno-enforce-eh-specs conftest.cc >&5
configure:10099: $? = 0
configure:10102: test -z || test ! -s conftest.err
configure:10105: $? = 0
configure:10108: test -s conftest.o
configure:10111: $? = 0
configure:10121: result: yes
configure:10125: checking utmpx.h presence
configure:10135: g++ -E conftest.cc
configure:10141: $? = 0
configure:10161: result: yes
configure:10196: checking for utmpx.h
configure:10203: result: yes
configure:10081: checking lastlog.h usability
configure:10093: g++ -c -g -O3 -fno-threadsafe-statics -fno-enforce-eh-specs conftest.cc >&5
configure:10099: $? = 0
configure:10102: test -z || test ! -s conftest.err
configure:10105: $? = 0
configure:10108: test -s conftest.o
configure:10111: $? = 0
configure:10121: result: yes
configure:10125: checking lastlog.h presence
configure:10135: g++ -E conftest.cc
configure:10141: $? = 0
configure:10161: result: yes
configure:10196: checking for lastlog.h
configure:10203: result: yes
configure:10219: checking for utmp.h
configure:10224: result: yes
configure:10355: checking for struct utmp
configure:10377: g++ -c -g -O3 -fno-threadsafe-statics -fno-enforce-eh-specs conftest.cc >&5
configure:10383: $? = 0
configure:10386: test -z || test ! -s conftest.err
configure:10389: $? = 0
configure:10392: test -s conftest.o
configure:10395: $? = 0
configure:10406: result: yes
configure:10417: checking for ut_host in utmp struct
configure:10439: g++ -c -g -O3 -fno-threadsafe-statics -fno-enforce-eh-specs conftest.cc >&5
configure:10445: $? = 0
configure:10448: test -z || test ! -s conftest.err
configure:10451: $? = 0
configure:10454: test -s conftest.o
configure:10457: $? = 0
configure:10468: result: yes
configure:10478: checking for ut_pid in utmp struct
configure:10500: g++ -c -g -O3 -fno-threadsafe-statics -fno-enforce-eh-specs conftest.cc >&5
configure:10506: $? = 0
configure:10509: test -z || test ! -s conftest.err
configure:10512: $? = 0
configure:10515: test -s conftest.o
configure:10518: $? = 0
configure:10529: result: yes
configure:10544: checking for utmpx.h
configure:10549: result: yes
configure:10680: checking for struct utmpx
configure:10702: g++ -c -g -O3 -fno-threadsafe-statics -fno-enforce-eh-specs conftest.cc >&5
configure:10708: $? = 0
configure:10711: test -z || test ! -s conftest.err
configure:10714: $? = 0
configure:10717: test -s conftest.o
configure:10720: $? = 0
configure:10731: result: yes
configure:10742: checking for host in utmpx struct
configure:10764: g++ -c -g -O3 -fno-threadsafe-statics -fno-enforce-eh-specs conftest.cc >&5
configure:10770: $? = 0
configure:10773: test -z || test ! -s conftest.err
configure:10776: $? = 0
configure:10779: test -s conftest.o
configure:10782: $? = 0
configure:10793: result: yes
configure:10803: checking for session in utmpx struct
configure:10825: g++ -c -g -O3 -fno-threadsafe-statics -fno-enforce-eh-specs conftest.cc >&5
configure:10831: $? = 0
configure:10834: test -z || test ! -s conftest.err
configure:10837: $? = 0
configure:10840: test -s conftest.o
configure:10843: $? = 0
configure:10854: result: yes
configure:10867: checking for struct lastlog
configure:10893: g++ -c -g -O3 -fno-threadsafe-statics -fno-enforce-eh-specs conftest.cc >&5
configure:10899: $? = 0
configure:10902: test -z || test ! -s conftest.err
configure:10905: $? = 0
configure:10908: test -s conftest.o
configure:10911: $? = 0
configure:10922: result: yes
configure:10932: checking for struct lastlogx
configure:10958: g++ -c -g -O3 -fno-threadsafe-statics -fno-enforce-eh-specs conftest.cc >&5
conftest.cc: In function 'int main()':
conftest.cc:79: error: aggregate 'lastlogx ll' has incomplete type and cannot be defined
configure:10964: $? = 1
configure: failed program was:
| /* confdefs.h. */
|
| #define PACKAGE_NAME ""
| #define PACKAGE_TARNAME ""
| #define PACKAGE_VERSION ""
| #define PACKAGE_STRING ""
| #define PACKAGE_BUGREPORT ""
| #ifdef __cplusplus
| extern "C" void std::exit (int) throw (); using std::exit;
| #endif
| #define _GNU_SOURCE 1
| #define RESFALLBACK "Rxvt"
| #define RESNAME "urxvt"
| #define RESCLASS "URxvt"
| #define RXVTNAME "urxvt"
| #define XPM_INC_X11 1
| #define HAVE_SYS_WAIT_H 1
| #define STDC_HEADERS 1
| #define HAVE_SYS_TYPES_H 1
| #define HAVE_SYS_STAT_H 1
| #define HAVE_STDLIB_H 1
| #define HAVE_STRING_H 1
| #define HAVE_MEMORY_H 1
| #define HAVE_STRINGS_H 1
| #define HAVE_INTTYPES_H 1
| #define HAVE_STDINT_H 1
| #define HAVE_UNISTD_H 1
| #define HAVE_ASSERT_H 1
| #define HAVE_FCNTL_H 1
| #define HAVE_STDARG_H 1
| #define HAVE_STDLIB_H 1
| #define HAVE_STRING_H 1
| #define HAVE_TERMIOS_H 1
| #define HAVE_UNISTD_H 1
| #define HAVE_SYS_IOCTL_H 1
| #define HAVE_SYS_SELECT_H 1
| #define HAVE_SYS_TIME_H 1
| #define HAVE_STDINT_H 1
| #define HAVE_WCHAR_H 1
| #define HAVE_CWCHAR 1
| #define HAVE_CLOCALE 1
| #define TIME_WITH_SYS_TIME 1
| #define HAVE_XPOINTER 1
| #define XLIB_ILLEGAL_ACCESS 1
| #define SIZEOF_SHORT 2
| #define SIZEOF_INT 4
| #define SIZEOF_LONG_LONG 8
| #define SIZEOF_INT_P 4
| #define RETSIGTYPE void
| #define HAVE_UNSETENV 1
| #define HAVE_SETUTENT 1
| #define HAVE_ON_EXIT 1
| #define UTMP_SUPPORT 1
| #define WTMP_SUPPORT 1
| #define LASTLOG_SUPPORT 1
| #define HAVE_TTYSLOT 1
| #define HAVE_UPDWTMP 1
| #define HAVE_UPDWTMPX 1
| #define HAVE_UTMP_H 1
| #define HAVE_UTMPX_H 1
| #define HAVE_LASTLOG_H 1
| #define HAVE_STRUCT_UTMP 1
| #define HAVE_UTMP_HOST 1
| #define HAVE_UTMP_PID 1
| #define HAVE_STRUCT_UTMPX 1
| #define HAVE_UTMPX_HOST 1
| #define HAVE_UTMPX_SESSION 1
| #define HAVE_STRUCT_LASTLOG 1
| /* end confdefs.h. */
| #include <sys/types.h>
| #include <utmpx.h>
| #ifdef HAVE_LASTLOG_H
| #include <lastlog.h>
| #endif
|
| int
| main ()
| {
| struct lastlogx ll;
| ;
| return 0;
| }
configure:10987: result: no
configure:10998: checking where utmp is located
configure:11041: g++ -o conftest -g -O3 -fno-threadsafe-statics -fno-enforce-eh-specs conftest.cc -lsupc++ >&5
configure:11044: $? = 0
configure:11046: ./conftest
configure:11049: $? = 0
configure:11063: result: /var/run/utmp
configure:11074: checking where utmpx is located
configure:11127: g++ -o conftest -g -O3 -fno-threadsafe-statics -fno-enforce-eh-specs conftest.cc -lsupc++ >&5
configure:11130: $? = 0
configure:11132: ./conftest
configure:11135: $? = 0
configure:11149: result: /var/run/utmp
configure:11160: checking where wtmp is located
configure:11205: g++ -o conftest -g -O3 -fno-threadsafe-statics -fno-enforce-eh-specs conftest.cc -lsupc++ >&5
configure:11208: $? = 0
configure:11210: ./conftest
configure:11213: $? = 0
configure:11227: result: /var/log/wtmp
configure:11237: checking where wtmpx is located
configure:11281: g++ -o conftest -g -O3 -fno-threadsafe-statics -fno-enforce-eh-specs conftest.cc -lsupc++ >&5
configure:11284: $? = 0
configure:11286: ./conftest
configure:11289: $? = 0
configure:11303: result: /var/log/wtmp
configure:11313: checking where lastlog is located
configure:11362: g++ -o conftest -g -O3 -fno-threadsafe-statics -fno-enforce-eh-specs conftest.cc -lsupc++ >&5
configure:11365: $? = 0
configure:11367: ./conftest
configure:11370: $? = 0
configure:11384: result: /var/log/lastlog
configure:11401: checking where lastlogx is located
configure:11444: g++ -o conftest -g -O3 -fno-threadsafe-statics -fno-enforce-eh-specs conftest.cc -lsupc++ >&5
configure:11447: $? = 0
configure:11449: ./conftest
configure:11452: $? = 0
configure:11466: result:
configure:11491: checking where ttys/ttytab is located
configure:11505: result:
configure:11523: checking for working Xlocale
configure:11547: g++ -o conftest -g -O3 -fno-threadsafe-statics -fno-enforce-eh-specs conftest.cc -lsupc++ -L/usr/X11R6/lib -lX11 >&5
configure:11550: $? = 0
configure:11552: ./conftest
configure:11555: $? = 0
configure:11569: result: yes
configure:11579: checking for working X setlocale
configure:11601: g++ -o conftest -g -O3 -fno-threadsafe-statics -fno-enforce-eh-specs conftest.cc -lsupc++ -L/usr/X11R6/lib -lX11 >&5
/tmp/ccsSgAHL.o: In function `main':/home/colin/Desktop/rxvt-unicode-7.7/conftest.cc:81: undefined reference to `_Xsetlocale'
collect2: ld returned 1 exit status
configure:11607: $? = 1
configure: failed program was:
| /* confdefs.h. */
|
| #define PACKAGE_NAME ""
| #define PACKAGE_TARNAME ""
| #define PACKAGE_VERSION ""
| #define PACKAGE_STRING ""
| #define PACKAGE_BUGREPORT ""
| #ifdef __cplusplus
| extern "C" void std::exit (int) throw (); using std::exit;
| #endif
| #define _GNU_SOURCE 1
| #define RESFALLBACK "Rxvt"
| #define RESNAME "urxvt"
| #define RESCLASS "URxvt"
| #define RXVTNAME "urxvt"
| #define XPM_INC_X11 1
| #define HAVE_SYS_WAIT_H 1
| #define STDC_HEADERS 1
| #define HAVE_SYS_TYPES_H 1
| #define HAVE_SYS_STAT_H 1
| #define HAVE_STDLIB_H 1
| #define HAVE_STRING_H 1
| #define HAVE_MEMORY_H 1
| #define HAVE_STRINGS_H 1
| #define HAVE_INTTYPES_H 1
| #define HAVE_STDINT_H 1
| #define HAVE_UNISTD_H 1
| #define HAVE_ASSERT_H 1
| #define HAVE_FCNTL_H 1
| #define HAVE_STDARG_H 1
| #define HAVE_STDLIB_H 1
| #define HAVE_STRING_H 1
| #define HAVE_TERMIOS_H 1
| #define HAVE_UNISTD_H 1
| #define HAVE_SYS_IOCTL_H 1
| #define HAVE_SYS_SELECT_H 1
| #define HAVE_SYS_TIME_H 1
| #define HAVE_STDINT_H 1
| #define HAVE_WCHAR_H 1
| #define HAVE_CWCHAR 1
| #define HAVE_CLOCALE 1
| #define TIME_WITH_SYS_TIME 1
| #define HAVE_XPOINTER 1
| #define XLIB_ILLEGAL_ACCESS 1
| #define SIZEOF_SHORT 2
| #define SIZEOF_INT 4
| #define SIZEOF_LONG_LONG 8
| #define SIZEOF_INT_P 4
| #define RETSIGTYPE void
| #define HAVE_UNSETENV 1
| #define HAVE_SETUTENT 1
| #define HAVE_ON_EXIT 1
| #define UTMP_SUPPORT 1
| #define WTMP_SUPPORT 1
| #define LASTLOG_SUPPORT 1
| #define HAVE_TTYSLOT 1
| #define HAVE_UPDWTMP 1
| #define HAVE_UPDWTMPX 1
| #define HAVE_UTMP_H 1
| #define HAVE_UTMPX_H 1
| #define HAVE_LASTLOG_H 1
| #define HAVE_STRUCT_UTMP 1
| #define HAVE_UTMP_HOST 1
| #define HAVE_UTMP_PID 1
| #define HAVE_STRUCT_UTMPX 1
| #define HAVE_UTMPX_HOST 1
| #define HAVE_UTMPX_SESSION 1
| #define HAVE_STRUCT_LASTLOG 1
| #define UTMP_FILE "/var/run/utmp"
| #define UTMPX_FILE "/var/run/utmp"
| #define WTMP_FILE "/var/log/wtmp"
| #define WTMPX_FILE "/var/log/wtmp"
| #define LASTLOG_FILE "/var/log/lastlog"
| #define HAVE_XLOCALE 1
| /* end confdefs.h. */
| #define X_LOCALE 1
| #include <X11/Xlocale.h>
| int
| main ()
| {
| setlocale(LC_CTYPE, "");
| ;
| return 0;
| }
configure:11631: result: no
configure:11643: checking for working plain setlocale
configure:11664: g++ -o conftest -g -O3 -fno-threadsafe-statics -fno-enforce-eh-specs conftest.cc -lsupc++ >&5
configure:11670: $? = 0
configure:11673: test -z || test ! -s conftest.err
configure:11676: $? = 0
configure:11679: test -s conftest
configure:11682: $? = 0
configure:11694: result: yes
configure:11704: checking for working nl_langinfo
configure:11725: g++ -o conftest -g -O3 -fno-threadsafe-statics -fno-enforce-eh-specs conftest.cc -lsupc++ >&5
configure:11731: $? = 0
configure:11734: test -z || test ! -s conftest.err
configure:11737: $? = 0
configure:11740: test -s conftest
configure:11743: $? = 0
configure:11755: result: yes
configure:11766: checking for unix-compliant filehandle passing ability
configure:11816: g++ -o conftest -g -O3 -fno-threadsafe-statics -fno-enforce-eh-specs conftest.cc -lsupc++ >&5
configure:11822: $? = 0
configure:11825: test -z || test ! -s conftest.err
configure:11828: $? = 0
configure:11831: test -s conftest
configure:11834: $? = 0
configure:11846: result: yes
configure:11861: checking for broken XIM callback
configure:11879: g++ -c -g -O3 -fno-threadsafe-statics -fno-enforce-eh-specs conftest.cc >&5
conftest.cc: In function 'void f()':
conftest.cc:8: error: invalid conversion from 'void (*)(_XIC*, char*, char*)' to 'void (*)(_XIM*, char*, char*)'
configure:11885: $? = 1
configure: failed program was:
|
| #include <X11/Xlib.h>
|
| void im_destroy_cb (XIC unused1, XPointer client_data, XPointer unused3);
|
| void f() {
| XIMCallback cb;
| cb.callback = im_destroy_cb;
| }
|
configure:11908: result: no
configure:11944: checking pty.h usability
configure:11956: g++ -c -g -O3 -fno-threadsafe-statics -fno-enforce-eh-specs conftest.cc >&5
configure:11962: $? = 0
configure:11965: test -z || test ! -s conftest.err
configure:11968: $? = 0
configure:11971: test -s conftest.o
configure:11974: $? = 0
configure:11984: result: yes
configure:11988: checking pty.h presence
configure:11998: g++ -E conftest.cc
configure:12004: $? = 0
configure:12024: result: yes
configure:12059: checking for pty.h
configure:12066: result: yes
configure:11944: checking util.h usability
configure:11956: g++ -c -g -O3 -fno-threadsafe-statics -fno-enforce-eh-specs conftest.cc >&5
conftest.cc:114:18: error: util.h: No such file or directory
configure:11962: $? = 1
configure: failed program was:
| /* confdefs.h. */
|
| #define PACKAGE_NAME ""
| #define PACKAGE_TARNAME ""
| #define PACKAGE_VERSION ""
| #define PACKAGE_STRING ""
| #define PACKAGE_BUGREPORT ""
| #ifdef __cplusplus
| extern "C" void std::exit (int) throw (); using std::exit;
| #endif
| #define _GNU_SOURCE 1
| #define RESFALLBACK "Rxvt"
| #define RESNAME "urxvt"
| #define RESCLASS "URxvt"
| #define RXVTNAME "urxvt"
| #define XPM_INC_X11 1
| #define HAVE_SYS_WAIT_H 1
| #define STDC_HEADERS 1
| #define HAVE_SYS_TYPES_H 1
| #define HAVE_SYS_STAT_H 1
| #define HAVE_STDLIB_H 1
| #define HAVE_STRING_H 1
| #define HAVE_MEMORY_H 1
| #define HAVE_STRINGS_H 1
| #define HAVE_INTTYPES_H 1
| #define HAVE_STDINT_H 1
| #define HAVE_UNISTD_H 1
| #define HAVE_ASSERT_H 1
| #define HAVE_FCNTL_H 1
| #define HAVE_STDARG_H 1
| #define HAVE_STDLIB_H 1
| #define HAVE_STRING_H 1
| #define HAVE_TERMIOS_H 1
| #define HAVE_UNISTD_H 1
| #define HAVE_SYS_IOCTL_H 1
| #define HAVE_SYS_SELECT_H 1
| #define HAVE_SYS_TIME_H 1
| #define HAVE_STDINT_H 1
| #define HAVE_WCHAR_H 1
| #define HAVE_CWCHAR 1
| #define HAVE_CLOCALE 1
| #define TIME_WITH_SYS_TIME 1
| #define HAVE_XPOINTER 1
| #define XLIB_ILLEGAL_ACCESS 1
| #define SIZEOF_SHORT 2
| #define SIZEOF_INT 4
| #define SIZEOF_LONG_LONG 8
| #define SIZEOF_INT_P 4
| #define RETSIGTYPE void
| #define HAVE_UNSETENV 1
| #define HAVE_SETUTENT 1
| #define HAVE_ON_EXIT 1
| #define UTMP_SUPPORT 1
| #define WTMP_SUPPORT 1
| #define LASTLOG_SUPPORT 1
| #define HAVE_TTYSLOT 1
| #define HAVE_UPDWTMP 1
| #define HAVE_UPDWTMPX 1
| #define HAVE_UTMP_H 1
| #define HAVE_UTMPX_H 1
| #define HAVE_LASTLOG_H 1
| #define HAVE_STRUCT_UTMP 1
| #define HAVE_UTMP_HOST 1
| #define HAVE_UTMP_PID 1
| #define HAVE_STRUCT_UTMPX 1
| #define HAVE_UTMPX_HOST 1
| #define HAVE_UTMPX_SESSION 1
| #define HAVE_STRUCT_LASTLOG 1
| #define UTMP_FILE "/var/run/utmp"
| #define UTMPX_FILE "/var/run/utmp"
| #define WTMP_FILE "/var/log/wtmp"
| #define WTMPX_FILE "/var/log/wtmp"
| #define LASTLOG_FILE "/var/log/lastlog"
| #define HAVE_XLOCALE 1
| #define HAVE_SETLOCALE 1
| #define HAVE_NL_LANGINFO 1
| #define HAVE_UNIX_FDPASS 1
| #define HAVE_PTY_H 1
| /* end confdefs.h. */
| #include <stdio.h>
| #if HAVE_SYS_TYPES_H
| # include <sys/types.h>
| #endif
| #if HAVE_SYS_STAT_H
| # include <sys/stat.h>
| #endif
| #if STDC_HEADERS
| # include <stdlib.h>
| # include <stddef.h>
| #else
| # if HAVE_STDLIB_H
| # include <stdlib.h>
| # endif
| #endif
| #if HAVE_STRING_H
| # if !STDC_HEADERS && HAVE_MEMORY_H
| # include <memory.h>
| # endif
| # include <string.h>
| #endif
| #if HAVE_STRINGS_H
| # include <strings.h>
| #endif
| #if HAVE_INTTYPES_H
| # include <inttypes.h>
| #else
| # if HAVE_STDINT_H
| # include <stdint.h>
| # endif
| #endif
| #if HAVE_UNISTD_H
| # include <unistd.h>
| #endif
| #include <util.h>
configure:11984: result: no
configure:11988: checking util.h presence
configure:11998: g++ -E conftest.cc
conftest.cc:80:18: error: util.h: No such file or directory
configure:12004: $? = 1
configure: failed program was:
| /* confdefs.h. */
|
| #define PACKAGE_NAME ""
| #define PACKAGE_TARNAME ""
| #define PACKAGE_VERSION ""
| #define PACKAGE_STRING ""
| #define PACKAGE_BUGREPORT ""
| #ifdef __cplusplus
| extern "C" void std::exit (int) throw (); using std::exit;
| #endif
| #define _GNU_SOURCE 1
| #define RESFALLBACK "Rxvt"
| #define RESNAME "urxvt"
| #define RESCLASS "URxvt"
| #define RXVTNAME "urxvt"
| #define XPM_INC_X11 1
| #define HAVE_SYS_WAIT_H 1
| #define STDC_HEADERS 1
| #define HAVE_SYS_TYPES_H 1
| #define HAVE_SYS_STAT_H 1
| #define HAVE_STDLIB_H 1
| #define HAVE_STRING_H 1
| #define HAVE_MEMORY_H 1
| #define HAVE_STRINGS_H 1
| #define HAVE_INTTYPES_H 1
| #define HAVE_STDINT_H 1
| #define HAVE_UNISTD_H 1
| #define HAVE_ASSERT_H 1
| #define HAVE_FCNTL_H 1
| #define HAVE_STDARG_H 1
| #define HAVE_STDLIB_H 1
| #define HAVE_STRING_H 1
| #define HAVE_TERMIOS_H 1
| #define HAVE_UNISTD_H 1
| #define HAVE_SYS_IOCTL_H 1
| #define HAVE_SYS_SELECT_H 1
| #define HAVE_SYS_TIME_H 1
| #define HAVE_STDINT_H 1
| #define HAVE_WCHAR_H 1
| #define HAVE_CWCHAR 1
| #define HAVE_CLOCALE 1
| #define TIME_WITH_SYS_TIME 1
| #define HAVE_XPOINTER 1
| #define XLIB_ILLEGAL_ACCESS 1
| #define SIZEOF_SHORT 2
| #define SIZEOF_INT 4
| #define SIZEOF_LONG_LONG 8
| #define SIZEOF_INT_P 4
| #define RETSIGTYPE void
| #define HAVE_UNSETENV 1
| #define HAVE_SETUTENT 1
| #define HAVE_ON_EXIT 1
| #define UTMP_SUPPORT 1
| #define WTMP_SUPPORT 1
| #define LASTLOG_SUPPORT 1
| #define HAVE_TTYSLOT 1
| #define HAVE_UPDWTMP 1
| #define HAVE_UPDWTMPX 1
| #define HAVE_UTMP_H 1
| #define HAVE_UTMPX_H 1
| #define HAVE_LASTLOG_H 1
| #define HAVE_STRUCT_UTMP 1
| #define HAVE_UTMP_HOST 1
| #define HAVE_UTMP_PID 1
| #define HAVE_STRUCT_UTMPX 1
| #define HAVE_UTMPX_HOST 1
| #define HAVE_UTMPX_SESSION 1
| #define HAVE_STRUCT_LASTLOG 1
| #define UTMP_FILE "/var/run/utmp"
| #define UTMPX_FILE "/var/run/utmp"
| #define WTMP_FILE "/var/log/wtmp"
| #define WTMPX_FILE "/var/log/wtmp"
| #define LASTLOG_FILE "/var/log/lastlog"
| #define HAVE_XLOCALE 1
| #define HAVE_SETLOCALE 1
| #define HAVE_NL_LANGINFO 1
| #define HAVE_UNIX_FDPASS 1
| #define HAVE_PTY_H 1
| /* end confdefs.h. */
| #include <util.h>
configure:12024: result: no
configure:12059: checking for util.h
configure:12066: result: no
configure:11944: checking libutil.h usability
configure:11956: g++ -c -g -O3 -fno-threadsafe-statics -fno-enforce-eh-specs conftest.cc >&5
conftest.cc:114:21: error: libutil.h: No such file or directory
configure:11962: $? = 1
configure: failed program was:
| /* confdefs.h. */
|
| #define PACKAGE_NAME ""
| #define PACKAGE_TARNAME ""
| #define PACKAGE_VERSION ""
| #define PACKAGE_STRING ""
| #define PACKAGE_BUGREPORT ""
| #ifdef __cplusplus
| extern "C" void std::exit (int) throw (); using std::exit;
| #endif
| #define _GNU_SOURCE 1
| #define RESFALLBACK "Rxvt"
| #define RESNAME "urxvt"
| #define RESCLASS "URxvt"
| #define RXVTNAME "urxvt"
| #define XPM_INC_X11 1
| #define HAVE_SYS_WAIT_H 1
| #define STDC_HEADERS 1
| #define HAVE_SYS_TYPES_H 1
| #define HAVE_SYS_STAT_H 1
| #define HAVE_STDLIB_H 1
| #define HAVE_STRING_H 1
| #define HAVE_MEMORY_H 1
| #define HAVE_STRINGS_H 1
| #define HAVE_INTTYPES_H 1
| #define HAVE_STDINT_H 1
| #define HAVE_UNISTD_H 1
| #define HAVE_ASSERT_H 1
| #define HAVE_FCNTL_H 1
| #define HAVE_STDARG_H 1
| #define HAVE_STDLIB_H 1
| #define HAVE_STRING_H 1
| #define HAVE_TERMIOS_H 1
| #define HAVE_UNISTD_H 1
| #define HAVE_SYS_IOCTL_H 1
| #define HAVE_SYS_SELECT_H 1
| #define HAVE_SYS_TIME_H 1
| #define HAVE_STDINT_H 1
| #define HAVE_WCHAR_H 1
| #define HAVE_CWCHAR 1
| #define HAVE_CLOCALE 1
| #define TIME_WITH_SYS_TIME 1
| #define HAVE_XPOINTER 1
| #define XLIB_ILLEGAL_ACCESS 1
| #define SIZEOF_SHORT 2
| #define SIZEOF_INT 4
| #define SIZEOF_LONG_LONG 8
| #define SIZEOF_INT_P 4
| #define RETSIGTYPE void
| #define HAVE_UNSETENV 1
| #define HAVE_SETUTENT 1
| #define HAVE_ON_EXIT 1
| #define UTMP_SUPPORT 1
| #define WTMP_SUPPORT 1
| #define LASTLOG_SUPPORT 1
| #define HAVE_TTYSLOT 1
| #define HAVE_UPDWTMP 1
| #define HAVE_UPDWTMPX 1
| #define HAVE_UTMP_H 1
| #define HAVE_UTMPX_H 1
| #define HAVE_LASTLOG_H 1
| #define HAVE_STRUCT_UTMP 1
| #define HAVE_UTMP_HOST 1
| #define HAVE_UTMP_PID 1
| #define HAVE_STRUCT_UTMPX 1
| #define HAVE_UTMPX_HOST 1
| #define HAVE_UTMPX_SESSION 1
| #define HAVE_STRUCT_LASTLOG 1
| #define UTMP_FILE "/var/run/utmp"
| #define UTMPX_FILE "/var/run/utmp"
| #define WTMP_FILE "/var/log/wtmp"
| #define WTMPX_FILE "/var/log/wtmp"
| #define LASTLOG_FILE "/var/log/lastlog"
| #define HAVE_XLOCALE 1
| #define HAVE_SETLOCALE 1
| #define HAVE_NL_LANGINFO 1
| #define HAVE_UNIX_FDPASS 1
| #define HAVE_PTY_H 1
| /* end confdefs.h. */
| #include <stdio.h>
| #if HAVE_SYS_TYPES_H
| # include <sys/types.h>
| #endif
| #if HAVE_SYS_STAT_H
| # include <sys/stat.h>
| #endif
| #if STDC_HEADERS
| # include <stdlib.h>
| # include <stddef.h>
| #else
| # if HAVE_STDLIB_H
| # include <stdlib.h>
| # endif
| #endif
| #if HAVE_STRING_H
| # if !STDC_HEADERS && HAVE_MEMORY_H
| # include <memory.h>
| # endif
| # include <string.h>
| #endif
| #if HAVE_STRINGS_H
| # include <strings.h>
| #endif
| #if HAVE_INTTYPES_H
| # include <inttypes.h>
| #else
| # if HAVE_STDINT_H
| # include <stdint.h>
| # endif
| #endif
| #if HAVE_UNISTD_H
| # include <unistd.h>
| #endif
| #include <libutil.h>
configure:11984: result: no
configure:11988: checking libutil.h presence
configure:11998: g++ -E conftest.cc
conftest.cc:80:21: error: libutil.h: No such file or directory
configure:12004: $? = 1
configure: failed program was:
| /* confdefs.h. */
|
| #define PACKAGE_NAME ""
| #define PACKAGE_TARNAME ""
| #define PACKAGE_VERSION ""
| #define PACKAGE_STRING ""
| #define PACKAGE_BUGREPORT ""
| #ifdef __cplusplus
| extern "C" void std::exit (int) throw (); using std::exit;
| #endif
| #define _GNU_SOURCE 1
| #define RESFALLBACK "Rxvt"
| #define RESNAME "urxvt"
| #define RESCLASS "URxvt"
| #define RXVTNAME "urxvt"
| #define XPM_INC_X11 1
| #define HAVE_SYS_WAIT_H 1
| #define STDC_HEADERS 1
| #define HAVE_SYS_TYPES_H 1
| #define HAVE_SYS_STAT_H 1
| #define HAVE_STDLIB_H 1
| #define HAVE_STRING_H 1
| #define HAVE_MEMORY_H 1
| #define HAVE_STRINGS_H 1
| #define HAVE_INTTYPES_H 1
| #define HAVE_STDINT_H 1
| #define HAVE_UNISTD_H 1
| #define HAVE_ASSERT_H 1
| #define HAVE_FCNTL_H 1
| #define HAVE_STDARG_H 1
| #define HAVE_STDLIB_H 1
| #define HAVE_STRING_H 1
| #define HAVE_TERMIOS_H 1
| #define HAVE_UNISTD_H 1
| #define HAVE_SYS_IOCTL_H 1
| #define HAVE_SYS_SELECT_H 1
| #define HAVE_SYS_TIME_H 1
| #define HAVE_STDINT_H 1
| #define HAVE_WCHAR_H 1
| #define HAVE_CWCHAR 1
| #define HAVE_CLOCALE 1
| #define TIME_WITH_SYS_TIME 1
| #define HAVE_XPOINTER 1
| #define XLIB_ILLEGAL_ACCESS 1
| #define SIZEOF_SHORT 2
| #define SIZEOF_INT 4
| #define SIZEOF_LONG_LONG 8
| #define SIZEOF_INT_P 4
| #define RETSIGTYPE void
| #define HAVE_UNSETENV 1
| #define HAVE_SETUTENT 1
| #define HAVE_ON_EXIT 1
| #define UTMP_SUPPORT 1
| #define WTMP_SUPPORT 1
| #define LASTLOG_SUPPORT 1
| #define HAVE_TTYSLOT 1
| #define HAVE_UPDWTMP 1
| #define HAVE_UPDWTMPX 1
| #define HAVE_UTMP_H 1
| #define HAVE_UTMPX_H 1
| #define HAVE_LASTLOG_H 1
| #define HAVE_STRUCT_UTMP 1
| #define HAVE_UTMP_HOST 1
| #define HAVE_UTMP_PID 1
| #define HAVE_STRUCT_UTMPX 1
| #define HAVE_UTMPX_HOST 1
| #define HAVE_UTMPX_SESSION 1
| #define HAVE_STRUCT_LASTLOG 1
| #define UTMP_FILE "/var/run/utmp"
| #define UTMPX_FILE "/var/run/utmp"
| #define WTMP_FILE "/var/log/wtmp"
| #define WTMPX_FILE "/var/log/wtmp"
| #define LASTLOG_FILE "/var/log/lastlog"
| #define HAVE_XLOCALE 1
| #define HAVE_SETLOCALE 1
| #define HAVE_NL_LANGINFO 1
| #define HAVE_UNIX_FDPASS 1
| #define HAVE_PTY_H 1
| /* end confdefs.h. */
| #include <libutil.h>
configure:12024: result: no
configure:12059: checking for libutil.h
configure:12066: result: no
configure:11935: checking for sys/ioctl.h
configure:11940: result: yes
configure:11944: checking sys/stropts.h usability
configure:11956: g++ -c -g -O3 -fno-threadsafe-statics -fno-enforce-eh-specs conftest.cc >&5
configure:11962: $? = 0
configure:11965: test -z || test ! -s conftest.err
configure:11968: $? = 0
configure:11971: test -s conftest.o
configure:11974: $? = 0
configure:11984: result: yes
configure:11988: checking sys/stropts.h presence
configure:11998: g++ -E conftest.cc
configure:12004: $? = 0
configure:12024: result: yes
configure:12059: checking for sys/stropts.h
configure:12066: result: yes
configure:12102: checking for revoke
configure:12159: g++ -o conftest -g -O3 -fno-threadsafe-statics -fno-enforce-eh-specs conftest.cc -lsupc++ >&5
conftest.cc:111: error: 'choke' does not name a type
conftest.cc: In function 'int main()':
conftest.cc:122: error: 'f' was not declared in this scope
conftest.cc: At global scope:
conftest.cc:125: error: expected `}' at end of input
configure:12165: $? = 1
configure: failed program was:
| /* confdefs.h. */
|
| #define PACKAGE_NAME ""
| #define PACKAGE_TARNAME ""
| #define PACKAGE_VERSION ""
| #define PACKAGE_STRING ""
| #define PACKAGE_BUGREPORT ""
| #ifdef __cplusplus
| extern "C" void std::exit (int) throw (); using std::exit;
| #endif
| #define _GNU_SOURCE 1
| #define RESFALLBACK "Rxvt"
| #define RESNAME "urxvt"
| #define RESCLASS "URxvt"
| #define RXVTNAME "urxvt"
| #define XPM_INC_X11 1
| #define HAVE_SYS_WAIT_H 1
| #define STDC_HEADERS 1
| #define HAVE_SYS_TYPES_H 1
| #define HAVE_SYS_STAT_H 1
| #define HAVE_STDLIB_H 1
| #define HAVE_STRING_H 1
| #define HAVE_MEMORY_H 1
| #define HAVE_STRINGS_H 1
| #define HAVE_INTTYPES_H 1
| #define HAVE_STDINT_H 1
| #define HAVE_UNISTD_H 1
| #define HAVE_ASSERT_H 1
| #define HAVE_FCNTL_H 1
| #define HAVE_STDARG_H 1
| #define HAVE_STDLIB_H 1
| #define HAVE_STRING_H 1
| #define HAVE_TERMIOS_H 1
| #define HAVE_UNISTD_H 1
| #define HAVE_SYS_IOCTL_H 1
| #define HAVE_SYS_SELECT_H 1
| #define HAVE_SYS_TIME_H 1
| #define HAVE_STDINT_H 1
| #define HAVE_WCHAR_H 1
| #define HAVE_CWCHAR 1
| #define HAVE_CLOCALE 1
| #define TIME_WITH_SYS_TIME 1
| #define HAVE_XPOINTER 1
| #define XLIB_ILLEGAL_ACCESS 1
| #define SIZEOF_SHORT 2
| #define SIZEOF_INT 4
| #define SIZEOF_LONG_LONG 8
| #define SIZEOF_INT_P 4
| #define RETSIGTYPE void
| #define HAVE_UNSETENV 1
| #define HAVE_SETUTENT 1
| #define HAVE_ON_EXIT 1
| #define UTMP_SUPPORT 1
| #define WTMP_SUPPORT 1
| #define LASTLOG_SUPPORT 1
| #define HAVE_TTYSLOT 1
| #define HAVE_UPDWTMP 1
| #define HAVE_UPDWTMPX 1
| #define HAVE_UTMP_H 1
| #define HAVE_UTMPX_H 1
| #define HAVE_LASTLOG_H 1
| #define HAVE_STRUCT_UTMP 1
| #define HAVE_UTMP_HOST 1
| #define HAVE_UTMP_PID 1
| #define HAVE_STRUCT_UTMPX 1
| #define HAVE_UTMPX_HOST 1
| #define HAVE_UTMPX_SESSION 1
| #define HAVE_STRUCT_LASTLOG 1
| #define UTMP_FILE "/var/run/utmp"
| #define UTMPX_FILE "/var/run/utmp"
| #define WTMP_FILE "/var/log/wtmp"
| #define WTMPX_FILE "/var/log/wtmp"
| #define LASTLOG_FILE "/var/log/lastlog"
| #define HAVE_XLOCALE 1
| #define HAVE_SETLOCALE 1
| #define HAVE_NL_LANGINFO 1
| #define HAVE_UNIX_FDPASS 1
| #define HAVE_PTY_H 1
| #define HAVE_SYS_IOCTL_H 1
| #define HAVE_SYS_STROPTS_H 1
| /* end confdefs.h. */
| /* Define revoke to an innocuous variant, in case <limits.h> declares revoke.
| For example, HP-UX 11i <limits.h> declares gettimeofday. */
| #define revoke innocuous_revoke
|
| /* System header to define __stub macros and hopefully few prototypes,
| which can conflict with char revoke (); below.
| Prefer <limits.h> to <assert.h> if __STDC__ is defined, since
| <limits.h> exists even on freestanding compilers. */
|
| #ifdef __STDC__
| # include <limits.h>
| #else
| # include <assert.h>
| #endif
|
| #undef revoke
|
| /* Override any gcc2 internal prototype to avoid an error. */
| #ifdef __cplusplus
| extern "C"
| {
| #endif
| /* We use char because int might match the return type of a gcc2
| builtin and then its argument prototype would still apply. */
| char revoke ();
| /* The GNU C library defines this for functions which it implements
| to always fail with ENOSYS. Some functions are actually named
| something starting with __ and the normal name is an alias. */
| #if defined (__stub_revoke) || defined (__stub___revoke)
| choke me
| #else
| char (*f) () = revoke;
| #endif
| #ifdef __cplusplus
| }
| #endif
|
| int
| main ()
| {
| return f != revoke;
| ;
| return 0;
| }
configure:12189: result: no
configure:12102: checking for _getpty
configure:12159: g++ -o conftest -g -O3 -fno-threadsafe-statics -fno-enforce-eh-specs conftest.cc -lsupc++ >&5
/tmp/ccQPPQTa.o: In function `main':/home/colin/Desktop/rxvt-unicode-7.7/conftest.cc:120: undefined reference to `_getpty'
/tmp/ccQPPQTa.o:(.data+0x0): undefined reference to `_getpty'
collect2: ld returned 1 exit status
configure:12165: $? = 1
configure: failed program was:
| /* confdefs.h. */
|
| #define PACKAGE_NAME ""
| #define PACKAGE_TARNAME ""
| #define PACKAGE_VERSION ""
| #define PACKAGE_STRING ""
| #define PACKAGE_BUGREPORT ""
| #ifdef __cplusplus
| extern "C" void std::exit (int) throw (); using std::exit;
| #endif
| #define _GNU_SOURCE 1
| #define RESFALLBACK "Rxvt"
| #define RESNAME "urxvt"
| #define RESCLASS "URxvt"
| #define RXVTNAME "urxvt"
| #define XPM_INC_X11 1
| #define HAVE_SYS_WAIT_H 1
| #define STDC_HEADERS 1
| #define HAVE_SYS_TYPES_H 1
| #define HAVE_SYS_STAT_H 1
| #define HAVE_STDLIB_H 1
| #define HAVE_STRING_H 1
| #define HAVE_MEMORY_H 1
| #define HAVE_STRINGS_H 1
| #define HAVE_INTTYPES_H 1
| #define HAVE_STDINT_H 1
| #define HAVE_UNISTD_H 1
| #define HAVE_ASSERT_H 1
| #define HAVE_FCNTL_H 1
| #define HAVE_STDARG_H 1
| #define HAVE_STDLIB_H 1
| #define HAVE_STRING_H 1
| #define HAVE_TERMIOS_H 1
| #define HAVE_UNISTD_H 1
| #define HAVE_SYS_IOCTL_H 1
| #define HAVE_SYS_SELECT_H 1
| #define HAVE_SYS_TIME_H 1
| #define HAVE_STDINT_H 1
| #define HAVE_WCHAR_H 1
| #define HAVE_CWCHAR 1
| #define HAVE_CLOCALE 1
| #define TIME_WITH_SYS_TIME 1
| #define HAVE_XPOINTER 1
| #define XLIB_ILLEGAL_ACCESS 1
| #define SIZEOF_SHORT 2
| #define SIZEOF_INT 4
| #define SIZEOF_LONG_LONG 8
| #define SIZEOF_INT_P 4
| #define RETSIGTYPE void
| #define HAVE_UNSETENV 1
| #define HAVE_SETUTENT 1
| #define HAVE_ON_EXIT 1
| #define UTMP_SUPPORT 1
| #define WTMP_SUPPORT 1
| #define LASTLOG_SUPPORT 1
| #define HAVE_TTYSLOT 1
| #define HAVE_UPDWTMP 1
| #define HAVE_UPDWTMPX 1
| #define HAVE_UTMP_H 1
| #define HAVE_UTMPX_H 1
| #define HAVE_LASTLOG_H 1
| #define HAVE_STRUCT_UTMP 1
| #define HAVE_UTMP_HOST 1
| #define HAVE_UTMP_PID 1
| #define HAVE_STRUCT_UTMPX 1
| #define HAVE_UTMPX_HOST 1
| #define HAVE_UTMPX_SESSION 1
| #define HAVE_STRUCT_LASTLOG 1
| #define UTMP_FILE "/var/run/utmp"
| #define UTMPX_FILE "/var/run/utmp"
| #define WTMP_FILE "/var/log/wtmp"
| #define WTMPX_FILE "/var/log/wtmp"
| #define LASTLOG_FILE "/var/log/lastlog"
| #define HAVE_XLOCALE 1
| #define HAVE_SETLOCALE 1
| #define HAVE_NL_LANGINFO 1
| #define HAVE_UNIX_FDPASS 1
| #define HAVE_PTY_H 1
| #define HAVE_SYS_IOCTL_H 1
| #define HAVE_SYS_STROPTS_H 1
| /* end confdefs.h. */
| /* Define _getpty to an innocuous variant, in case <limits.h> declares _getpty.
| For example, HP-UX 11i <limits.h> declares gettimeofday. */
| #define _getpty innocuous__getpty
|
| /* System header to define __stub macros and hopefully few prototypes,
| which can conflict with char _getpty (); below.
| Prefer <limits.h> to <assert.h> if __STDC__ is defined, since
| <limits.h> exists even on freestanding compilers. */
|
| #ifdef __STDC__
| # include <limits.h>
| #else
| # include <assert.h>
| #endif
|
| #undef _getpty
|
| /* Override any gcc2 internal prototype to avoid an error. */
| #ifdef __cplusplus
| extern "C"
| {
| #endif
| /* We use char because int might match the return type of a gcc2
| builtin and then its argument prototype would still apply. */
| char _getpty ();
| /* The GNU C library defines this for functions which it implements
| to always fail with ENOSYS. Some functions are actually named
| something starting with __ and the normal name is an alias. */
| #if defined (__stub__getpty) || defined (__stub____getpty)
| choke me
| #else
| char (*f) () = _getpty;
| #endif
| #ifdef __cplusplus
| }
| #endif
|
| int
| main ()
| {
| return f != _getpty;
| ;
| return 0;
| }
configure:12189: result: no
configure:12102: checking for getpt
configure:12159: g++ -o conftest -g -O3 -fno-threadsafe-statics -fno-enforce-eh-specs conftest.cc -lsupc++ >&5
configure:12165: $? = 0
configure:12168: test -z || test ! -s conftest.err
configure:12171: $? = 0
configure:12174: test -s conftest
configure:12177: $? = 0
configure:12189: result: yes
configure:12102: checking for posix_openpt
configure:12159: g++ -o conftest -g -O3 -fno-threadsafe-statics -fno-enforce-eh-specs conftest.cc -lsupc++ >&5
configure:12165: $? = 0
configure:12168: test -z || test ! -s conftest.err
configure:12171: $? = 0
configure:12174: test -s conftest
configure:12177: $? = 0
configure:12189: result: yes
configure:12102: checking for isastream
configure:12159: g++ -o conftest -g -O3 -fno-threadsafe-statics -fno-enforce-eh-specs conftest.cc -lsupc++ >&5
configure:12165: $? = 0
configure:12168: test -z || test ! -s conftest.err
configure:12171: $? = 0
configure:12174: test -s conftest
configure:12177: $? = 0
configure:12189: result: yes
configure:12102: checking for setuid
configure:12159: g++ -o conftest -g -O3 -fno-threadsafe-statics -fno-enforce-eh-specs conftest.cc -lsupc++ >&5
configure:12165: $? = 0
configure:12168: test -z || test ! -s conftest.err
configure:12171: $? = 0
configure:12174: test -s conftest
configure:12177: $? = 0
configure:12189: result: yes
configure:12102: checking for seteuid
configure:12159: g++ -o conftest -g -O3 -fno-threadsafe-statics -fno-enforce-eh-specs conftest.cc -lsupc++ >&5
configure:12165: $? = 0
configure:12168: test -z || test ! -s conftest.err
configure:12171: $? = 0
configure:12174: test -s conftest
configure:12177: $? = 0
configure:12189: result: yes
configure:12102: checking for setreuid
configure:12159: g++ -o conftest -g -O3 -fno-threadsafe-statics -fno-enforce-eh-specs conftest.cc -lsupc++ >&5
configure:12165: $? = 0
configure:12168: test -z || test ! -s conftest.err
configure:12171: $? = 0
configure:12174: test -s conftest
configure:12177: $? = 0
configure:12189: result: yes
configure:12102: checking for setresuid
configure:12159: g++ -o conftest -g -O3 -fno-threadsafe-statics -fno-enforce-eh-specs conftest.cc -lsupc++ >&5
configure:12165: $? = 0
configure:12168: test -z || test ! -s conftest.err
configure:12171: $? = 0
configure:12174: test -s conftest
configure:12177: $? = 0
configure:12189: result: yes
configure:12202: checking for /dev/ptym/clone
configure:12219: result: no
configure:12223: checking for /dev/ptc
configure:12240: result: no
configure:12254: checking for /dev/ptmx
configure:12257: result: yes
configure:12278: checking for UNIX98 ptys
configure:12296: g++ -o conftest -g -O3 -fno-threadsafe-statics -fno-enforce-eh-specs conftest.cc -lsupc++ >&5
configure:12302: $? = 0
configure:12305: test -z || test ! -s conftest.err
configure:12308: $? = 0
configure:12311: test -s conftest
configure:12314: $? = 0
configure:12322: result: yes
configure:12512: checking for tty group
configure:12549: g++ -o conftest -g -O3 -fno-threadsafe-statics -fno-enforce-eh-specs conftest.cc -lsupc++ >&5
configure:12552: $? = 0
configure:12554: ./conftest
configure:12557: $? = 0
configure:12571: result: yes
configure:12584: checking for pkg-config
configure:12602: found /usr/bin/pkg-config
configure:12615: result: /usr/bin/pkg-config
configure:12686: checking X11/Xft/Xft.h usability
configure:12698: g++ -c -g -O3 -fno-threadsafe-statics -fno-enforce-eh-specs -I/usr/include/freetype2 conftest.cc >&5
configure:12704: $? = 0
configure:12707: test -z || test ! -s conftest.err
configure:12710: $? = 0
configure:12713: test -s conftest.o
configure:12716: $? = 0
configure:12726: result: yes
configure:12730: checking X11/Xft/Xft.h presence
configure:12740: g++ -E -I/usr/include/freetype2 conftest.cc
configure:12746: $? = 0
configure:12766: result: yes
configure:12801: checking for X11/Xft/Xft.h
configure:12808: result: yes
configure:12824: checking for XftDrawString32 in -lXft
configure:12854: g++ -o conftest -g -O3 -fno-threadsafe-statics -fno-enforce-eh-specs -I/usr/include/freetype2 conftest.cc -lXft -lsupc++ -lXft -lXrender -lfontconfig -lfreetype -lz -lX11 >&5
configure:12860: $? = 0
configure:12863: test -z || test ! -s conftest.err
configure:12866: $? = 0
configure:12869: test -s conftest
configure:12872: $? = 0
configure:12885: result: yes
configure:13107: checking for perl5
configure:13140: result: no
configure:13146: checking for perl
configure:13164: found /usr/bin/perl
configure:13176: result: /usr/bin/perl
configure:13184: checking for /usr/bin/perl suitability
configure:13214: g++ -o conftest -g -O3 -fno-threadsafe-statics -fno-enforce-eh-specs -D_REENTRANT -D_GNU_SOURCE -DTHREADS_HAVE_PIDS -DDEBIAN -fno-strict-aliasing -pipe -I/usr/local/include -D_LARGEFILE_SOURCE -D_FILE_OFFSET_BITS=64 -I/usr/lib/perl/5.8/CORE -I/usr/include/freetype2 conftest.cc -lXft -lsupc++ -lXft -lXrender -lfontconfig -lfreetype -lz -lX11 -Wl,-E -L/usr/local/lib /usr/lib/perl/5.8/auto/DynaLoader/DynaLoader.a -L/usr/lib/perl/5.8/CORE -lperl -ldl -lm -lpthread -lc -lcrypt >&5
/usr/bin/ld: cannot find -lperl
collect2: ld returned 1 exit status
configure:13220: $? = 1
configure: failed program was:
| /* confdefs.h. */
|
| #define PACKAGE_NAME ""
| #define PACKAGE_TARNAME ""
| #define PACKAGE_VERSION ""
| #define PACKAGE_STRING ""
| #define PACKAGE_BUGREPORT ""
| #ifdef __cplusplus
| extern "C" void std::exit (int) throw (); using std::exit;
| #endif
| #define _GNU_SOURCE 1
| #define RESFALLBACK "Rxvt"
| #define RESNAME "urxvt"
| #define RESCLASS "URxvt"
| #define RXVTNAME "urxvt"
| #define XPM_INC_X11 1
| #define HAVE_SYS_WAIT_H 1
| #define STDC_HEADERS 1
| #define HAVE_SYS_TYPES_H 1
| #define HAVE_SYS_STAT_H 1
| #define HAVE_STDLIB_H 1
| #define HAVE_STRING_H 1
| #define HAVE_MEMORY_H 1
| #define HAVE_STRINGS_H 1
| #define HAVE_INTTYPES_H 1
| #define HAVE_STDINT_H 1
| #define HAVE_UNISTD_H 1
| #define HAVE_ASSERT_H 1
| #define HAVE_FCNTL_H 1
| #define HAVE_STDARG_H 1
| #define HAVE_STDLIB_H 1
| #define HAVE_STRING_H 1
| #define HAVE_TERMIOS_H 1
| #define HAVE_UNISTD_H 1
| #define HAVE_SYS_IOCTL_H 1
| #define HAVE_SYS_SELECT_H 1
| #define HAVE_SYS_TIME_H 1
| #define HAVE_STDINT_H 1
| #define HAVE_WCHAR_H 1
| #define HAVE_CWCHAR 1
| #define HAVE_CLOCALE 1
| #define TIME_WITH_SYS_TIME 1
| #define HAVE_XPOINTER 1
| #define XLIB_ILLEGAL_ACCESS 1
| #define SIZEOF_SHORT 2
| #define SIZEOF_INT 4
| #define SIZEOF_LONG_LONG 8
| #define SIZEOF_INT_P 4
| #define RETSIGTYPE void
| #define HAVE_UNSETENV 1
| #define HAVE_SETUTENT 1
| #define HAVE_ON_EXIT 1
| #define UTMP_SUPPORT 1
| #define WTMP_SUPPORT 1
| #define LASTLOG_SUPPORT 1
| #define HAVE_TTYSLOT 1
| #define HAVE_UPDWTMP 1
| #define HAVE_UPDWTMPX 1
| #define HAVE_UTMP_H 1
| #define HAVE_UTMPX_H 1
| #define HAVE_LASTLOG_H 1
| #define HAVE_STRUCT_UTMP 1
| #define HAVE_UTMP_HOST 1
| #define HAVE_UTMP_PID 1
| #define HAVE_STRUCT_UTMPX 1
| #define HAVE_UTMPX_HOST 1
| #define HAVE_UTMPX_SESSION 1
| #define HAVE_STRUCT_LASTLOG 1
| #define UTMP_FILE "/var/run/utmp"
| #define UTMPX_FILE "/var/run/utmp"
| #define WTMP_FILE "/var/log/wtmp"
| #define WTMPX_FILE "/var/log/wtmp"
| #define LASTLOG_FILE "/var/log/lastlog"
| #define HAVE_XLOCALE 1
| #define HAVE_SETLOCALE 1
| #define HAVE_NL_LANGINFO 1
| #define HAVE_UNIX_FDPASS 1
| #define HAVE_PTY_H 1
| #define HAVE_SYS_IOCTL_H 1
| #define HAVE_SYS_STROPTS_H 1
| #define HAVE_GETPT 1
| #define HAVE_POSIX_OPENPT 1
| #define HAVE_ISASTREAM 1
| #define HAVE_SETUID 1
| #define HAVE_SETEUID 1
| #define HAVE_SETREUID 1
| #define HAVE_SETRESUID 1
| #define HAVE_DEV_PTMX 1
| #define CLONE_DEVICE "/dev/ptmx"
| #define UNIX98_PTY 1
| #define TTY_GID_SUPPORT 1
| #define HAVE_X11_XFT_XFT_H 1
| #define HAVE_LIBXFT 1
| #define XFT 1
| #define ENABLE_STYLES 1
| #define ISO_14755 1
| #define OFF_FOCUS_FADING 1
| #define TINTING 1
| #define TRANSPARENT 1
| #define SELECTION_SCROLLING 1
| #define ENABLE_FRILLS 1
| #define MOUSE_WHEEL 1
| #define MOUSE_SLIP_WHEELING 1
| #define USE_XIM 1
| #define XPM_BACKGROUND 1
| #define RXVT_SCROLLBAR 1
| #define NEXT_SCROLLBAR 1
| #define XTERM_SCROLLBAR 1
| #define PLAIN_SCROLLBAR 1
| #define POINTER_BLANK 1
| #define TEXT_BLINK 1
| #define ENABLE_COMBINING 1
| #define ENCODING_EU 1
| #define ENCODING_VN 1
| #define ENCODING_JP 1
| #define ENCODING_JP_EXT 1
| #define ENCODING_KR 1
| #define ENCODING_ZH 1
| #define ENCODING_ZH_EXT 1
| /* end confdefs.h. */
|
| #include <EXTERN.h>
| #include <perl.h>
| #include <XSUB.h>
|
| int
| main ()
| {
|
| PerlInterpreter *perl = perl_alloc ();
|
| ;
| return 0;
| }
configure:13260: error: no, unable to link
## ---------------- ##
## Cache variables. ##
## ---------------- ##
ac_cv_build=i686-pc-linux-gnu
ac_cv_build_alias=i686-pc-linux-gnu
ac_cv_c_compiler_gnu=yes
ac_cv_c_const=yes
ac_cv_c_inline=inline
ac_cv_cxx_compiler_gnu=yes
ac_cv_env_CC_set=
ac_cv_env_CC_value=
ac_cv_env_CFLAGS_set=
ac_cv_env_CFLAGS_value=
ac_cv_env_CPPFLAGS_set=
ac_cv_env_CPPFLAGS_value=
ac_cv_env_CPP_set=
ac_cv_env_CPP_value=
ac_cv_env_CXXCPP_set=
ac_cv_env_CXXCPP_value=
ac_cv_env_CXXFLAGS_set=
ac_cv_env_CXXFLAGS_value=
ac_cv_env_CXX_set=
ac_cv_env_CXX_value=
ac_cv_env_LDFLAGS_set=
ac_cv_env_LDFLAGS_value=
ac_cv_env_build_alias_set=
ac_cv_env_build_alias_value=
ac_cv_env_host_alias_set=
ac_cv_env_host_alias_value=
ac_cv_env_target_alias_set=
ac_cv_env_target_alias_value=
ac_cv_exeext=
ac_cv_func__getpty=no
ac_cv_func_connect=yes
ac_cv_func_gethostbyname=yes
ac_cv_func_getpt=yes
ac_cv_func_isastream=yes
ac_cv_func_on_exit=yes
ac_cv_func_posix_openpt=yes
ac_cv_func_remove=yes
ac_cv_func_revoke=no
ac_cv_func_seteuid=yes
ac_cv_func_setlocale=yes
ac_cv_func_setresuid=yes
ac_cv_func_setreuid=yes
ac_cv_func_setuid=yes
ac_cv_func_setutent=yes
ac_cv_func_shmat=yes
ac_cv_func_socket=yes
ac_cv_func_ttyslot=yes
ac_cv_func_unsetenv=yes
ac_cv_func_updwtmp=yes
ac_cv_func_updwtmpx=yes
ac_cv_have_x='have_x=yes ac_x_includes= ac_x_libraries=/usr/X11R6/lib'
ac_cv_have_xpm='have_xpm=yes vt_xpm_includes= vt_xpm_libraries=/usr/lib vt_xpm_include_X11=yes'
ac_cv_header_X11_Xft_Xft_h=yes
ac_cv_header_assert_h=yes
ac_cv_header_clocale=yes
ac_cv_header_cwchar=yes
ac_cv_header_fcntl_h=yes
ac_cv_header_inttypes_h=yes
ac_cv_header_lastlog_h=yes
ac_cv_header_libutil_h=no
ac_cv_header_memory_h=yes
ac_cv_header_pty_h=yes
ac_cv_header_stdarg_h=yes
ac_cv_header_stdc=yes
ac_cv_header_stdint_h=yes
ac_cv_header_stdlib_h=yes
ac_cv_header_string_h=yes
ac_cv_header_strings_h=yes
ac_cv_header_sys_byteorder_h=no
ac_cv_header_sys_ioctl_h=yes
ac_cv_header_sys_select_h=yes
ac_cv_header_sys_sockio_h=no
ac_cv_header_sys_stat_h=yes
ac_cv_header_sys_stropts_h=yes
ac_cv_header_sys_strredir_h=no
ac_cv_header_sys_time_h=yes
ac_cv_header_sys_types_h=yes
ac_cv_header_sys_wait_h=yes
ac_cv_header_termios_h=yes
ac_cv_header_time=yes
ac_cv_header_unistd_h=yes
ac_cv_header_util_h=no
ac_cv_header_utmp_h=yes
ac_cv_header_utmpx_h=yes
ac_cv_header_wchar_h=yes
ac_cv_host=i686-pc-linux-gnu
ac_cv_host_alias=i686-pc-linux-gnu
ac_cv_lib_ICE_IceConnectionNumber=yes
ac_cv_lib_Xft_XftDrawString32=yes
ac_cv_objext=o
ac_cv_path_CMP=/usr/bin/cmp
ac_cv_path_CP=/bin/cp
ac_cv_path_ECHO=/bin/echo
ac_cv_path_LN=/bin/ln
ac_cv_path_MV=/bin/mv
ac_cv_path_PERL=/usr/bin/perl
ac_cv_path_PKG_CONFIG=/usr/bin/pkg-config
ac_cv_path_SED=/bin/sed
ac_cv_path_TIC=/usr/bin/tic
ac_cv_path_install='/usr/bin/install -c'
ac_cv_prog_CPP='gcc -E'
ac_cv_prog_CXXCPP='g++ -E'
ac_cv_prog_ac_ct_CC=gcc
ac_cv_prog_ac_ct_CXX=g++
ac_cv_prog_cc_g=yes
ac_cv_prog_cc_stdc=
ac_cv_prog_cxx_g=yes
ac_cv_prog_egrep='grep -E'
ac_cv_search_strerror='none required'
ac_cv_sizeof_int=4
ac_cv_sizeof_int_p=4
ac_cv_sizeof_long_long=8
ac_cv_sizeof_short=2
ac_cv_type_int=yes
ac_cv_type_int_p=yes
ac_cv_type_long_long=yes
ac_cv_type_mode_t=yes
ac_cv_type_pid_t=yes
ac_cv_type_short=yes
ac_cv_type_signal=void
ac_cv_type_uid_t=yes
rxvt_cv_R=no
rxvt_cv_func_nl_langinfo=yes
rxvt_cv_func_setlocale=yes
rxvt_cv_func_xlocale=yes
rxvt_cv_func_xsetlocale=no
rxvt_cv_header_sysioctl=yes
rxvt_cv_int16_t=yes
rxvt_cv_int32_t=yes
rxvt_cv_rpath=no
rxvt_cv_uint16_t=yes
rxvt_cv_uint32_t=yes
rxvt_cv_xpointer=yes
## ----------------- ##
## Output variables. ##
## ----------------- ##
CC='gcc'
CFLAGS='-g -O3 -fno-threadsafe-statics -fno-enforce-eh-specs'
CMP='/usr/bin/cmp'
CP='/bin/cp'
CPP='gcc -E'
CPPFLAGS=' -I/usr/include/freetype2 '
CXX='g++'
CXXCPP='g++ -E'
CXXFLAGS='-g -O3 -fno-threadsafe-statics -fno-enforce-eh-specs'
DATE='2006-02-21'
DEBUG=''
DEFS=''
DINCLUDE=''
DLIB=''
ECHO='/bin/echo'
ECHO_C=''
ECHO_N='-n'
ECHO_T=''
EGREP='grep -E'
EXEEXT=''
IF_PERL='#'
INSTALL_DATA='${INSTALL} -m 644'
INSTALL_LIBRXVT=''
INSTALL_PROGRAM='${INSTALL}'
INSTALL_SCRIPT='${INSTALL}'
LDFLAGS=''
LIBOBJS=''
LIBS='-lXft -lsupc++ -lXft -lXrender -lfontconfig -lfreetype -lz -lX11 '
LIBVERSION=''
LINKER='gcc'
LN='/bin/ln'
LSMDATE=''
LTLIBOBJS=''
MV='/bin/mv'
OBJEXT='o'
PACKAGE_BUGREPORT=''
PACKAGE_NAME=''
PACKAGE_STRING=''
PACKAGE_TARNAME=''
PACKAGE_VERSION=''
PATH_SEPARATOR=':'
PERL='/usr/bin/perl'
PERLFLAGS=''
PERLLIB=''
PERLPRIVLIBEXP=''
PERL_O=''
PKG_CONFIG='/usr/bin/pkg-config'
RXVTNAME='urxvt'
SED='/bin/sed'
SHELL='/bin/sh'
TIC='/usr/bin/tic'
VERSION='7.7'
XFT_CONFIG=''
XPM_CFLAGS=''
XPM_CPPFLAGS=''
XPM_LIBS='-L/usr/lib -lXpm'
X_CFLAGS=''
X_EXTRA_LIBS=''
X_LIBS=' -L/usr/X11R6/lib'
X_PRE_LIBS=' -lSM -lICE'
ac_ct_CC='gcc'
ac_ct_CXX='g++'
bindir='${exec_prefix}/bin'
build='i686-pc-linux-gnu'
build_alias=''
build_cpu='i686'
build_os='linux-gnu'
build_vendor='pc'
datadir='${prefix}/share'
exec_prefix='NONE'
host='i686-pc-linux-gnu'
host_alias=''
host_cpu='i686'
host_os='linux-gnu'
host_vendor='pc'
include_assert_h=''
include_fcntl_h=''
include_stdarg_h=''
include_stdint_h=''
include_stdlib_h=''
include_string_h=''
include_sys_ioctl_h=''
include_sys_select_h=''
include_sys_strredir_h=''
include_sys_time_h=''
include_time_h=''
include_unistd_h=''
include_util_h=''
includedir='${prefix}/include'
infodir='${prefix}/info'
libdir='${exec_prefix}/lib'
libexecdir='${exec_prefix}/libexec'
localstatedir='${prefix}/var'
mandir='${prefix}/man'
oldincludedir='/usr/include'
prefix='NONE'
program_transform_name='s,x,x,'
rxvt_int16_typedef='/* typedef short int16_t; */'
rxvt_int32_typedef='/* typedef int int32_t; */'
rxvt_intp_define='#define intp_t int32_t'
rxvt_u_intp_define='#define u_intp_t u_int32_t'
rxvt_uint16_typedef='/* typedef unsigned short uint16_t; */'
rxvt_uint32_typedef='/* typedef unsigned int uint32_t; */'
sbindir='${exec_prefix}/sbin'
sharedstatedir='${prefix}/com'
sysconfdir='${prefix}/etc'
target_alias=''
## ----------- ##
## confdefs.h. ##
## ----------- ##
#define CLONE_DEVICE "/dev/ptmx"
#define ENABLE_COMBINING 1
#define ENABLE_FRILLS 1
#define ENABLE_STYLES 1
#define ENCODING_EU 1
#define ENCODING_JP 1
#define ENCODING_JP_EXT 1
#define ENCODING_KR 1
#define ENCODING_VN 1
#define ENCODING_ZH 1
#define ENCODING_ZH_EXT 1
#define HAVE_ASSERT_H 1
#define HAVE_CLOCALE 1
#define HAVE_CWCHAR 1
#define HAVE_DEV_PTMX 1
#define HAVE_FCNTL_H 1
#define HAVE_GETPT 1
#define HAVE_INTTYPES_H 1
#define HAVE_ISASTREAM 1
#define HAVE_LASTLOG_H 1
#define HAVE_LIBXFT 1
#define HAVE_MEMORY_H 1
#define HAVE_NL_LANGINFO 1
#define HAVE_ON_EXIT 1
#define HAVE_POSIX_OPENPT 1
#define HAVE_PTY_H 1
#define HAVE_SETEUID 1
#define HAVE_SETLOCALE 1
#define HAVE_SETRESUID 1
#define HAVE_SETREUID 1
#define HAVE_SETUID 1
#define HAVE_SETUTENT 1
#define HAVE_STDARG_H 1
#define HAVE_STDINT_H 1
#define HAVE_STDINT_H 1
#define HAVE_STDLIB_H 1
#define HAVE_STDLIB_H 1
#define HAVE_STRINGS_H 1
#define HAVE_STRING_H 1
#define HAVE_STRING_H 1
#define HAVE_STRUCT_LASTLOG 1
#define HAVE_STRUCT_UTMP 1
#define HAVE_STRUCT_UTMPX 1
#define HAVE_SYS_IOCTL_H 1
#define HAVE_SYS_IOCTL_H 1
#define HAVE_SYS_SELECT_H 1
#define HAVE_SYS_STAT_H 1
#define HAVE_SYS_STROPTS_H 1
#define HAVE_SYS_TIME_H 1
#define HAVE_SYS_TYPES_H 1
#define HAVE_SYS_WAIT_H 1
#define HAVE_TERMIOS_H 1
#define HAVE_TTYSLOT 1
#define HAVE_UNISTD_H 1
#define HAVE_UNISTD_H 1
#define HAVE_UNIX_FDPASS 1
#define HAVE_UNSETENV 1
#define HAVE_UPDWTMP 1
#define HAVE_UPDWTMPX 1
#define HAVE_UTMPX_H 1
#define HAVE_UTMPX_HOST 1
#define HAVE_UTMPX_SESSION 1
#define HAVE_UTMP_H 1
#define HAVE_UTMP_HOST 1
#define HAVE_UTMP_PID 1
#define HAVE_WCHAR_H 1
#define HAVE_X11_XFT_XFT_H 1
#define HAVE_XLOCALE 1
#define HAVE_XPOINTER 1
#define ISO_14755 1
#define LASTLOG_FILE "/var/log/lastlog"
#define LASTLOG_SUPPORT 1
#define MOUSE_SLIP_WHEELING 1
#define MOUSE_WHEEL 1
#define NEXT_SCROLLBAR 1
#define OFF_FOCUS_FADING 1
#define PACKAGE_BUGREPORT ""
#define PACKAGE_NAME ""
#define PACKAGE_STRING ""
#define PACKAGE_TARNAME ""
#define PACKAGE_VERSION ""
#define PLAIN_SCROLLBAR 1
#define POINTER_BLANK 1
#define RESCLASS "URxvt"
#define RESFALLBACK "Rxvt"
#define RESNAME "urxvt"
#define RETSIGTYPE void
#define RXVTNAME "urxvt"
#define RXVT_SCROLLBAR 1
#define SELECTION_SCROLLING 1
#define SIZEOF_INT 4
#define SIZEOF_INT_P 4
#define SIZEOF_LONG_LONG 8
#define SIZEOF_SHORT 2
#define STDC_HEADERS 1
#define TEXT_BLINK 1
#define TIME_WITH_SYS_TIME 1
#define TINTING 1
#define TRANSPARENT 1
#define TTY_GID_SUPPORT 1
#define UNIX98_PTY 1
#define USE_XIM 1
#define UTMPX_FILE "/var/run/utmp"
#define UTMP_FILE "/var/run/utmp"
#define UTMP_SUPPORT 1
#define WTMPX_FILE "/var/log/wtmp"
#define WTMP_FILE "/var/log/wtmp"
#define WTMP_SUPPORT 1
#define XFT 1
#define XLIB_ILLEGAL_ACCESS 1
#define XPM_BACKGROUND 1
#define XPM_INC_X11 1
#define XTERM_SCROLLBAR 1
#define _GNU_SOURCE 1
#endif
#ifdef __cplusplus
extern "C" void std::exit (int) throw (); using std::exit;
configure: exit 1