(KDE4)whirm@sphynx:~/src/kde4/build/KDE/kdebase$ cmakekdej2
-- Found Qt-Version 4.3.0
-- Found X11: /usr/lib/libX11.so
-- Found KDE 4.0 include dir: /home/whirm/src/kde4/include
-- Found KDE 4 library dir: /home/whirm/src/kde4/lib
-- Found KDE4 kconfig_compiler preprocessor: /home/whirm/src/kde4/bin/kconfig_compiler
-- Found Strigi: /home/whirm/src/kde4/lib/libstreamanalyzer.so
-- Found Strigi: /home/whirm/src/kde4/lib/libstreams.so
-- Make sure Strigi is a recent SVN version!
-- ** svn://anonsvn.kde.org/home/kde/trunk/kdesupport/strigi
-- Found KDE PIM libraries
-- Found sasl2: /usr/lib/libsasl2.so
-- Found sasl2: /usr/lib/libsasl2.so
-- Create macro to display info at the end of install
-- Found NetworkManager:
-- Found bluez: /usr/lib/libbluetooth.so
-- Found Nepomuk: /home/whirm/src/kde4/lib/libnepomuk.so;/home/whirm/src/kde4/lib/libnepomuk-middleware.so
-- Found Nepomuk: /home/whirm/src/kde4/lib/libnepomuk.so;/home/whirm/src/kde4/lib/libnepomuk-middleware.so
-- Found Qt-Version 4.3.0
-- Found X11: /usr/lib/libX11.so
-- Found KDE 4.0 include dir: /home/whirm/src/kde4/include
-- Found KDE 4 library dir: /home/whirm/src/kde4/lib
-- Found KDE4 kconfig_compiler preprocessor: /home/whirm/src/kde4/bin/kconfig_compiler
-- Found Strigi: /home/whirm/src/kde4/lib/libstreamanalyzer.so
-- Found Strigi: /home/whirm/src/kde4/lib/libstreams.so
-- Make sure Strigi is a recent SVN version!
-- ** svn://anonsvn.kde.org/home/kde/trunk/kdesupport/strigi
-- Found PNG: /usr/lib/libpng.so
-- Found sensors: /usr/lib/libsensors.so
-- Found Freetype: -lfreetype -lz
-- option: USE_XKLAVIER <ON>
-- Found LibXKlavier: /usr/lib/libxklavier.so
-- Found GObject libraries: /usr/lib/libgobject-2.0.so;/usr/lib/libgmodule-2.0.so;/usr/lib/libgthread-2.0.so;/usr/lib/libglib-2.0.so
-- Found GObject includes : /usr/include/glib-2.0/gobject
-- /home/whirm/src/kde4/src/KDE/kdebase/workspace/kcontrol: skipped subdir $(KSMCARD_SUBDIR)
-- taskbar panel extension disable (since taskbar lib is disabled), reactivate it when we use plasma or remove it
--
----------------------------------------------------------------------------------
-- The following list of OPTIONAL packages were located on your system. --
-- You will have all the following features available from this software. --
----------------------------------------------------------------------------------
+ BlueZ
+ Compositing support
----------------------------------------------------------------------------------
-- The following list of OPTIONAL packages could NOT be located on your system. --
-- Consider installing them to enable more features from this software. --
----------------------------------------------------------------------------------
+ Samba: Sambas libsmbclient is required for the smb-ioslave. A version which already has smbc_set_context() is required <http://www.samba.org>
+ NetworkManager: NetworkManager is a daemon for user controlled networking <http://www.gnome.org/projects/NetworkManager>
-- Configuring done
-- Generating done
-- Build files have been written to: /home/whirm/src/kde4/build/KDE/kdebase
makeobj[0]: Entering directory `/home/whirm/src/kde4/build/KDE/kdebase'
[ 1%] [ 1%] Built target kdeinit_kuiserver
Built target drkonqi
[ 1%] Built target khc_indexbuilder
[ 1%] Built target kioexec
[ 1%] Built target kio_about
[ 1%] Built target kio_cgi
[ 2%] Built target kdeinit_khelpcenter
[ 3%] Built target kcm_cgi
[ 3%] Built target kio_floppy
[ 3%] Built target kio_filter
[ 3%] Built target kio_info
[ 3%] Built target kio_nntp
[ 3%] Built target kio_pop3
[ 3%] Built target kio_tar
[ 3%] Built target kio_smtp
[ 3%] Built target kio_settings
[ 3%] Built target kio_trash
[ 3%] Built target ktrash
[ 3%] Built target trash
[ 4%] Built target kio_media
[ 5%] Built target kded_mediamanager
[ 5%] Built target kded_medianotifier
[ 6%] Built target kio_media_mounthelper
[ 6%] Built target kio_remote
[ 6%] Built target kded_remotedirnotify
[ 6%] Built target kio_home
[ 6%] Built target kded_homedirnotify
[ 7%] Built target kcm_media
[ 8%] Built target kio_system
[ 8%] Built target kio_ldap
[ 8%] Built target kded_systemdirnotify
[ 8%] Built target kio_fish
[ 8%] Built target kio_sftp
[ 8%] Built target kio_finger
[ 8%] Built target kio_man
[ 8%] Built target kmanpart
[ 8%] Built target kio_nfs
[ 8%] Built target cursorthumbnail
[ 8%] Built target djvuthumbnail
[ 8%] Built target exrthumbnail
[ 8%] Built target htmlthumbnail
[ 8%] Built target imagethumbnail
[ 8%] [ 8%] Built target kio_thumbnail
Built target svgthumbnail
[ 8%] Built target textthumbnail
[ 8%] Built target knetattach
[ 8%] Built target kded_kpasswdserver
[ 8%] [ 8%] Built target kded_ktimezoned
Built target kdebugdialog
[ 9%] Built target kdeinit_kcontrol
[ 9%] Built target kcm_icons
[ 10%] Built target kdeinit_kinfocenter
[ 10%] Built target kcm_kded
[ 10%] [ 10%] Built target kcm_knotify
Built target kcm_locale
[ 10%] Built target kcm_kdnssd
[ 11%] Built target kcm_componentchooser
[ 11%] [ 11%] Built target kdeinit_kcmshell
Built target kcm_samba
[ 11%] Built target khotnewstuff
[ 11%] Built target kcm_printmgr
[ 11%] Built target kdeprint_part
[ 11%] Built target kdeinit_kjobviewer
[ 11%] [ 12%] Built target kdeinit_kprinter
Built target kdeprintfax
[ 12%] Built target kio_print
[ 12%] Built target kdesu_executable
[ 12%] Built target klocaldomainurifilterhelper
[ 13%] [ 13%] Built target localdomainurifilter
Built target kdesud
[ 13%] Built target kuriikwsfilter
[ 13%] Built target kurisearchfilter
[ 13%] Built target kshorturifilter
[ 13%] Built target fixhosturifilter
[ 14%] Built target solidcontrolifaces
[ 14%] Built target solid_fakenet_static
[ 14%] Built target solid_fakebluetooth_static
[ 14%] Built target kcm_solid
[ 15%] Built target solid_hal_power_static
[ 15%] Built target solid_hal_power
[ 15%] Built target solid_bluez
[ 15%] Built target solid_bluez_static
[ 15%] Built target kinstalltheme
[ 15%] Built target kquitapp_executable
[ 15%] Built target kde-cp
[ 15%] Built target kde-mv
[ 16%] Built target kde-open
[ 16%] Built target ktraderclient
[ 16%] Built target kioclient
[ 16%] Built target kreadconfig
[ 16%] Built target kwriteconfig
[ 16%] Built target kmimetypefinder
[ 16%] Built target kfile
[ 16%] Built target kstart
[ 16%] Built target kde4-menu
[ 16%] Built target knotify
[ 17%] Built target nepomukregcore
[ 17%] Built target nepomukcoreservices
[ 17%] Built target testbase_backbone
[ 17%] Built target konq_sound
[ 18%] Built target kded_favicons
[ 18%] Built target kdeinit_kwrite
[ 18%] Built target kdialog
[ 19%] Built target konq
[ 19%] Built target kbookmarkmerger
[ 19%] Built target kdeinit_kfmclient
[ 19%] Built target konq_aboutpage
[ 19%] Built target konqsidebarplugin
[ 19%] Built target kcm_history
[ 19%] Built target kded_konqy_preloader
[ 19%] Built target konq_remoteencoding
[ 19%] [ 20%] Built target konq_part
Built target kcm_kurifilt
[ 20%] Built target kcm_konq
[ 20%] [ 21%] Built target kcm_performance
Built target kcm_konqhtml
[ 21%] Built target kcm_filetypes
[ 23%] Built target kcm_kio
[ 23%] Built target keditfiletype
[ 24%] Built target kcm_css
[ 24%] Built target khtmlkttsdplugin
[ 24%] Built target konq_shellcmdplugin
[ 24%] Built target kfind
[ 25%] Built target kappfinder
[ 25%] [ 25%] Built target kappfinder_install
Built target kfindpart
[ 25%] Built target kcm_nsplugins
[ 25%] Built target kcminit_nsplugin
[ 25%] Built target nspluginscan
[ 26%] [ 26%] Built target nspluginviewer
Built target fontembedder
[ 26%] Built target kded_kwrited
[ 29%] Built target kdeinit_konsole
[ 29%] Built target kdepasswd
[ 31%] Built target konsolepart
[ 31%] Built target kcm_useraccount
[ 31%] Built target kworkspace
[ 31%] Built target kgreet_classic
[ 31%] Built target kgreet_winbind
[ 33%] Built target plasma
[ 33%] Built target kcheckpass
[ 33%] Built target kscreensaver
[ 33%] Built target krandom.kss
[ 33%] Built target kdeinit_kcminit
[ 33%] Built target kdeinit_kcminit_startup
[ 33%] Built target ksplashx_scale
[ 33%] Built target prepareanim
[ 34%] Built target ksplashx
[ 34%] Built target shade
[ 34%] Built target ksplashsimple
[ 34%] Built target kcm_ksplashthemes
[ 34%] Built target processcore
[ 35%] Built target ksgrd
[ 35%] Built target libksysguardd
[ 35%] [ 36%] Built target ktip
Built target kickermain
[ 37%] Built target kdeinit_klipper
[ 37%] Built target klipper_panelapplet
[ 38%] Built target kdeinit_kcontroledit
[ 38%] [ 38%] Built target kwineffects
Built target kdeinit_kmenuedit
[ 38%] Built target kwin_killer_helper
[ 39%] Built target kdecorations
[ 39%] Built target kcm_kwinoptions
[ 40%] Built target kcm_kwinrules
[ 41%] Built target kcm_kwineffects
[ 41%] Built target kdeinit_kwin_rules_dialog
[ 41%] Built target kwin3_plastik
[ 41%] Built target kwin_plastik_config
[ 41%] [ 41%] Built target kwin3_b2
Built target kwin_b2_config
[ 41%] [ 41%] Built target kwin3_default
Built target kwin_default_config
[ 41%] Built target kwin_keramik_config
[ 41%] Built target kwin3_keramik
[ 41%] Built target kwin3_laptop
[ 41%] Built target kwin3_modernsys
[ 41%] Built target kwin_modernsys_config
[ 42%] Built target kwin3_oxy
[ 42%] Built target kwin3_quartz
[ 42%] Built target kwin_quartz_config
[ 42%] Built target kwin3_redmond
[ 42%] Built target kwin3_web
[ 42%] Built target kcm_kwin4_effect_builtins
[ 42%] Built target kwin4_effect_tests
[ 42%] Built target kwin_update_default_rules
[ 43%] Built target kwin4_effect_builtins
[ 43%] Built target kwin_update_window_settings
[ 43%] Built target plasma_animator_default
[ 43%] Built target plasma_applet_clock
[ 43%] Built target plasma_applet_url
[ 44%] Built target plasma_applet_ciavc
[ 44%] Built target plasma_engine_time
[ 44%] Built target plasma_engine_ciavc
[ 44%] Built target plasmaengineexplorer
[ 44%] Built target kdostartupconfig
[ 44%] Built target plasma-qgv
[ 44%] Built target kstartupconfig
[ 45%] Built target kded_khotkeys
[ 46%] Built target kdeinit_khotkeys
[ 46%] Built target khotkeys_update
[ 47%] Built target kcm_randr
[ 53%] Built target kcm_khotkeys
[ 54%] Built target krandrtray
[ 54%] Built target kcm_keyboard
[ 54%] Built target kxkb_panelapplet
[ 55%] Built target kdeinit_kxkb
[ 55%] Built target kcm_bell
[ 55%] Built target kapplymousetheme
[ 55%] Built target kcm_input
[ 56%] Built target kcm_background
[ 56%] Built target kcm_launch
[ 56%] Built target kcm_clock
[ 56%] Built target kcm_colors
[ 58%] Built target kcm_kdm
[ 58%] Built target kcm_energy
[ 59%] Built target kcm_fonts
[ 59%] Built target kstyle_keramik_config
[ 59%] Built target kcm_style
[ 59%] Built target kcm_smserver
[ 59%] Built target kcm_screensaver
[ 59%] Built target kcm_xinerama
[ 60%] Built target kcm_keys
[ 60%] Built target test_kcm_xinerama
[ 60%] Built target kcm_display
[ 61%] [ 61%] Built target kcm_kthememanager
Built target kcm_joystick
[ 61%] Built target kcm_accessibility
[ 61%] Built target kcm_info
[ 61%] Built target kcm_nic
[ 62%] [ 62%] Built target kcm_view1394
Built target kcm_usb
[ 62%] Built target kcm_access
[ 62%] Built target kdeinit_kaccess
[ 62%] Built target kfontinst
[ 62%] Built target ksystraycmd
[ 62%] Building CXX object workspace/krunner/runners/search/CMakeFiles/krunner_searchrunner.dir/searchrunner.o
[ 62%] Built target krunner_lock
[ 62%] Building CXX object workspace/krunner/runners/calculator/CMakeFiles/krunner_calculatorrunner.dir/calculatorrunner.o
In file included from /home/whirm/src/kde4/src/KDE/kdebase/workspace/krunner/runners/search/searchrunner.cpp:26:
/home/whirm/src/kde4/src/KDE/kdebase/workspace/krunner/runners/search/searchrunner.h:24:28: error: abstractrunner.h: No such file or directory
In file included from /home/whirm/src/kde4/src/KDE/kdebase/workspace/krunner/runners/calculator/calculatorrunner.cpp:32:
/home/whirm/src/kde4/src/KDE/kdebase/workspace/krunner/runners/calculator/calculatorrunner.h:24:28: error: abstractrunner.h: No such file or directory
/home/whirm/src/kde4/src/KDE/kdebase/workspace/krunner/runners/search/searchrunner.h:30: error: ‘Plasma’ has not been declared
/home/whirm/src/kde4/src/KDE/kdebase/workspace/krunner/runners/search/searchrunner.h:30: error: expected `{' before ‘AbstractRunner’
/home/whirm/src/kde4/src/KDE/kdebase/workspace/krunner/runners/search/searchrunner.h:30: error: invalid function declaration
/home/whirm/src/kde4/src/KDE/kdebase/workspace/krunner/runners/search/searchrunner.h:51: error: expected constructor, destructor, or type conversion before ‘(’ token
/home/whirm/src/kde4/src/KDE/kdebase/workspace/krunner/runners/search/searchrunner.cpp:35: error: invalid use of undefined type ‘class SearchRunner’
/home/whirm/src/kde4/src/KDE/kdebase/workspace/krunner/runners/search/searchrunner.h:30: error: forward declaration of ‘class SearchRunner’
/home/whirm/src/kde4/src/KDE/kdebase/workspace/krunner/runners/search/searchrunner.cpp:39: error: invalid use of undefined type ‘class SearchRunner’
/home/whirm/src/kde4/src/KDE/kdebase/workspace/krunner/runners/search/searchrunner.h:30: error: forward declaration of ‘class SearchRunner’
/home/whirm/src/kde4/src/KDE/kdebase/workspace/krunner/runners/search/searchrunner.cpp:48: error: invalid use of undefined type ‘class SearchRunner’
/home/whirm/src/kde4/src/KDE/kdebase/workspace/krunner/runners/search/searchrunner.h:30: error: forward declaration of ‘class SearchRunner’
/home/whirm/src/kde4/src/KDE/kdebase/workspace/krunner/runners/search/searchrunner.cpp:57: error: invalid use of undefined type ‘class SearchRunner’
/home/whirm/src/kde4/src/KDE/kdebase/workspace/krunner/runners/search/searchrunner.h:30: error: forward declaration of ‘class SearchRunner’
/home/whirm/src/kde4/src/KDE/kdebase/workspace/krunner/runners/search/searchrunner.cpp: In member function ‘void SearchRunner::fillMatches(KActionCollection*, const QString&, int, int)’:
/home/whirm/src/kde4/src/KDE/kdebase/workspace/krunner/runners/search/searchrunner.cpp:68: error: ‘connect’ was not declared in this scope
/home/whirm/src/kde4/src/KDE/kdebase/workspace/krunner/runners/search/searchrunner.cpp: At global scope:
/home/whirm/src/kde4/src/KDE/kdebase/workspace/krunner/runners/search/searchrunner.cpp:72: error: invalid use of undefined type ‘class SearchRunner’
/home/whirm/src/kde4/src/KDE/kdebase/workspace/krunner/runners/search/searchrunner.h:30: error: forward declaration of ‘class SearchRunner’
/home/whirm/src/kde4/build/KDE/kdebase/workspace/krunner/runners/search/searchrunner.moc:39: error: invalid use of undefined type ‘class SearchRunner’
/home/whirm/src/kde4/src/KDE/kdebase/workspace/krunner/runners/search/searchrunner.h:30: error: forward declaration of ‘class SearchRunner’
/home/whirm/src/kde4/build/KDE/kdebase/workspace/krunner/runners/search/searchrunner.moc:40: error: ‘Plasma’ has not been declared
/home/whirm/src/kde4/build/KDE/kdebase/workspace/krunner/runners/search/searchrunner.moc:44: error: invalid use of undefined type ‘class SearchRunner’
/home/whirm/src/kde4/src/KDE/kdebase/workspace/krunner/runners/search/searchrunner.h:30: error: forward declaration of ‘class SearchRunner’
/home/whirm/src/kde4/build/KDE/kdebase/workspace/krunner/runners/search/searchrunner.moc: In member function ‘const QMetaObject* SearchRunner::metaObject() const’:
/home/whirm/src/kde4/build/KDE/kdebase/workspace/krunner/runners/search/searchrunner.moc:46: error: ‘staticMetaObject’ was not declared in this scope
/home/whirm/src/kde4/build/KDE/kdebase/workspace/krunner/runners/search/searchrunner.moc: At global scope:
/home/whirm/src/kde4/build/KDE/kdebase/workspace/krunner/runners/search/searchrunner.moc:49: error: invalid use of undefined type ‘class SearchRunner’
/home/whirm/src/kde4/src/KDE/kdebase/workspace/krunner/runners/search/searchrunner.h:30: error: forward declaration of ‘class SearchRunner’
/home/whirm/src/kde4/build/KDE/kdebase/workspace/krunner/runners/search/searchrunner.moc: In member function ‘void* SearchRunner::qt_metacast(const char*)’:
/home/whirm/src/kde4/build/KDE/kdebase/workspace/krunner/runners/search/searchrunner.moc:54: error: ‘Plasma’ has not been declared
/home/whirm/src/kde4/build/KDE/kdebase/workspace/krunner/runners/search/searchrunner.moc:54: error: expected initializer before ‘QMocSuperClass’
/home/whirm/src/kde4/build/KDE/kdebase/workspace/krunner/runners/search/searchrunner.moc:55: error: ‘QMocSuperClass’ has not been declared
/home/whirm/src/kde4/build/KDE/kdebase/workspace/krunner/runners/search/searchrunner.moc: At global scope:
/home/whirm/src/kde4/build/KDE/kdebase/workspace/krunner/runners/search/searchrunner.moc:58: error: invalid use of undefined type ‘class SearchRunner’
/home/whirm/src/kde4/src/KDE/kdebase/workspace/krunner/runners/search/searchrunner.h:30: error: forward declaration of ‘class SearchRunner’
/home/whirm/src/kde4/build/KDE/kdebase/workspace/krunner/runners/search/searchrunner.moc: In member function ‘int SearchRunner::qt_metacall(QMetaObject::Call, int, void**)’:
/home/whirm/src/kde4/build/KDE/kdebase/workspace/krunner/runners/search/searchrunner.moc:60: error: ‘Plasma’ has not been declared
/home/whirm/src/kde4/build/KDE/kdebase/workspace/krunner/runners/search/searchrunner.moc:60: error: expected initializer before ‘QMocSuperClass’
/home/whirm/src/kde4/build/KDE/kdebase/workspace/krunner/runners/search/searchrunner.moc:61: error: ‘QMocSuperClass’ has not been declared
/home/whirm/src/kde4/build/KDE/kdebase/workspace/krunner/runners/search/searchrunner.moc:66: error: ‘launchKonsole’ was not declared in this scope
make[2]: *** [workspace/krunner/runners/search/CMakeFiles/krunner_searchrunner.dir/searchrunner.o] Error 1
make[1]: *** [workspace/krunner/runners/search/CMakeFiles/krunner_searchrunner.dir/all] Error 2
make[1]: *** Waiting for unfinished jobs....
/home/whirm/src/kde4/src/KDE/kdebase/workspace/krunner/runners/calculator/calculatorrunner.h:31: error: ‘Plasma’ has not been declared
/home/whirm/src/kde4/src/KDE/kdebase/workspace/krunner/runners/calculator/calculatorrunner.h:31: error: expected `{' before ‘AbstractRunner’
/home/whirm/src/kde4/src/KDE/kdebase/workspace/krunner/runners/calculator/calculatorrunner.h:31: error: invalid function declaration
/home/whirm/src/kde4/src/KDE/kdebase/workspace/krunner/runners/calculator/calculatorrunner.h:47: error: expected constructor, destructor, or type conversion before ‘(’ token
/home/whirm/src/kde4/src/KDE/kdebase/workspace/krunner/runners/calculator/calculatorrunner.cpp:43: error: invalid use of undefined type ‘class CalculatorRunner’
/home/whirm/src/kde4/src/KDE/kdebase/workspace/krunner/runners/calculator/calculatorrunner.h:31: error: forward declaration of ‘class CalculatorRunner’
/home/whirm/src/kde4/src/KDE/kdebase/workspace/krunner/runners/calculator/calculatorrunner.cpp: In destructor ‘CalculatorRunner::~CalculatorRunner()’:
/home/whirm/src/kde4/src/KDE/kdebase/workspace/krunner/runners/calculator/calculatorrunner.cpp:45: error: ‘m_options’ was not declared in this scope
/home/whirm/src/kde4/src/KDE/kdebase/workspace/krunner/runners/calculator/calculatorrunner.cpp: At global scope:
/home/whirm/src/kde4/src/KDE/kdebase/workspace/krunner/runners/calculator/calculatorrunner.cpp:48: error: invalid use of undefined type ‘class CalculatorRunner’
/home/whirm/src/kde4/src/KDE/kdebase/workspace/krunner/runners/calculator/calculatorrunner.h:31: error: forward declaration of ‘class CalculatorRunner’
/home/whirm/src/kde4/src/KDE/kdebase/workspace/krunner/runners/calculator/calculatorrunner.cpp: In member function ‘QAction* CalculatorRunner::accepts(const QString&)’:
/home/whirm/src/kde4/src/KDE/kdebase/workspace/krunner/runners/calculator/calculatorrunner.cpp:56: error: ‘calculate’ was not declared in this scope
/home/whirm/src/kde4/src/KDE/kdebase/workspace/krunner/runners/calculator/calculatorrunner.cpp:61: error: no matching function for call to ‘QAction::QAction(KIcon, QString, CalculatorRunner* const)’
/home/whirm/src/kde4/build/qt-copy/include/QtGui/qaction.h:193: note: candidates are: QAction::QAction(const QAction&)
/home/whirm/src/kde4/build/qt-copy/include/QtGui/qaction.h:169: note: QAction::QAction(QActionPrivate&, QObject*)
/home/whirm/src/kde4/build/qt-copy/include/QtGui/qaction.h:72: note: QAction::QAction(const QIcon&, const QString&, QObject*)
/home/whirm/src/kde4/build/qt-copy/include/QtGui/qaction.h:71: note: QAction::QAction(const QString&, QObject*)
/home/whirm/src/kde4/build/qt-copy/include/QtGui/qaction.h:70: note: QAction::QAction(QObject*)
/home/whirm/src/kde4/src/KDE/kdebase/workspace/krunner/runners/calculator/calculatorrunner.cpp: At global scope:
/home/whirm/src/kde4/src/KDE/kdebase/workspace/krunner/runners/calculator/calculatorrunner.cpp:69: error: invalid use of undefined type ‘class CalculatorRunner’
/home/whirm/src/kde4/src/KDE/kdebase/workspace/krunner/runners/calculator/calculatorrunner.h:31: error: forward declaration of ‘class CalculatorRunner’
/home/whirm/src/kde4/src/KDE/kdebase/workspace/krunner/runners/calculator/calculatorrunner.cpp:76: error: invalid use of undefined type ‘class CalculatorRunner’
/home/whirm/src/kde4/src/KDE/kdebase/workspace/krunner/runners/calculator/calculatorrunner.h:31: error: forward declaration of ‘class CalculatorRunner’
/home/whirm/src/kde4/build/KDE/kdebase/workspace/krunner/runners/calculator/calculatorrunner.moc:36: error: invalid use of undefined type ‘class CalculatorRunner’
/home/whirm/src/kde4/src/KDE/kdebase/workspace/krunner/runners/calculator/calculatorrunner.h:31: error: forward declaration of ‘class CalculatorRunner’
/home/whirm/src/kde4/build/KDE/kdebase/workspace/krunner/runners/calculator/calculatorrunner.moc:37: error: ‘Plasma’ has not been declared
/home/whirm/src/kde4/build/KDE/kdebase/workspace/krunner/runners/calculator/calculatorrunner.moc:41: error: invalid use of undefined type ‘class CalculatorRunner’
/home/whirm/src/kde4/src/KDE/kdebase/workspace/krunner/runners/calculator/calculatorrunner.h:31: error: forward declaration of ‘class CalculatorRunner’
/home/whirm/src/kde4/build/KDE/kdebase/workspace/krunner/runners/calculator/calculatorrunner.moc: In member function ‘const QMetaObject* CalculatorRunner::metaObject() const’:
/home/whirm/src/kde4/build/KDE/kdebase/workspace/krunner/runners/calculator/calculatorrunner.moc:43: error: ‘staticMetaObject’ was not declared in this scope
/home/whirm/src/kde4/build/KDE/kdebase/workspace/krunner/runners/calculator/calculatorrunner.moc: At global scope:
/home/whirm/src/kde4/build/KDE/kdebase/workspace/krunner/runners/calculator/calculatorrunner.moc:46: error: invalid use of undefined type ‘class CalculatorRunner’
/home/whirm/src/kde4/src/KDE/kdebase/workspace/krunner/runners/calculator/calculatorrunner.h:31: error: forward declaration of ‘class CalculatorRunner’
/home/whirm/src/kde4/build/KDE/kdebase/workspace/krunner/runners/calculator/calculatorrunner.moc: In member function ‘void* CalculatorRunner::qt_metacast(const char*)’:
/home/whirm/src/kde4/build/KDE/kdebase/workspace/krunner/runners/calculator/calculatorrunner.moc:51: error: ‘Plasma’ has not been declared
/home/whirm/src/kde4/build/KDE/kdebase/workspace/krunner/runners/calculator/calculatorrunner.moc:51: error: expected initializer before ‘QMocSuperClass’
/home/whirm/src/kde4/build/KDE/kdebase/workspace/krunner/runners/calculator/calculatorrunner.moc:52: error: ‘QMocSuperClass’ has not been declared
/home/whirm/src/kde4/build/KDE/kdebase/workspace/krunner/runners/calculator/calculatorrunner.moc: At global scope:
/home/whirm/src/kde4/build/KDE/kdebase/workspace/krunner/runners/calculator/calculatorrunner.moc:55: error: invalid use of undefined type ‘class CalculatorRunner’
/home/whirm/src/kde4/src/KDE/kdebase/workspace/krunner/runners/calculator/calculatorrunner.h:31: error: forward declaration of ‘class CalculatorRunner’
/home/whirm/src/kde4/build/KDE/kdebase/workspace/krunner/runners/calculator/calculatorrunner.moc: In member function ‘int CalculatorRunner::qt_metacall(QMetaObject::Call, int, void**)’:
/home/whirm/src/kde4/build/KDE/kdebase/workspace/krunner/runners/calculator/calculatorrunner.moc:57: error: ‘Plasma’ has not been declared
/home/whirm/src/kde4/build/KDE/kdebase/workspace/krunner/runners/calculator/calculatorrunner.moc:57: error: expected initializer before ‘QMocSuperClass’
/home/whirm/src/kde4/build/KDE/kdebase/workspace/krunner/runners/calculator/calculatorrunner.moc:58: error: ‘QMocSuperClass’ has not been declared
make[2]: *** [workspace/krunner/runners/calculator/CMakeFiles/krunner_calculatorrunner.dir/calculatorrunner.o] Error 1
make[1]: *** [workspace/krunner/runners/calculator/CMakeFiles/krunner_calculatorrunner.dir/all] Error 2
make: *** [all] Error 2
makeobj[0]: Leaving directory `/home/whirm/src/kde4/build/KDE/kdebase'
(KDE4)whirm@sphynx:~/src/kde4/build/KDE/kdebase$