rendered paste bodyE0 {416} [Ariel] zaku:~/X3$ make install
Making install in src
make[1]: Entering directory `/home/zaku/X3/src'
make[2]: Entering directory `/home/zaku/X3/src'
make[2]: Nothing to be done for `install-exec-am'.
make[2]: Nothing to be done for `install-data-am'.
make[2]: Leaving directory `/home/zaku/X3/src'
make[1]: Leaving directory `/home/zaku/X3/src'
make[1]: Entering directory `/home/zaku/X3'
make[2]: Entering directory `/home/zaku/X3'
/usr/bin/install -c -d -m 755 /home/zaku/X3
/usr/bin/install -c -m 744 ./src/x3 /home/zaku/X3
/usr/bin/install -c -m 644 ./src/*.help /home/zaku/X3
/usr/bin/install -c -m 600 ./x3.conf.example /home/zaku/X3
/usr/bin/install: `./x3.conf.example' and `/home/zaku/X3/x3.conf.example' are the same file
make[2]: *** [install-exec-local] Error 1
make[2]: Leaving directory `/home/zaku/X3'
make[1]: *** [install-am] Error 2
make[1]: Leaving directory `/home/zaku/X3'
make: *** [install-recursive] Error 1
E2 {416} [Ariel] zaku:~/X3$