All pastes #57868 Raw Edit

ElvenStar

public text v1 · immutable
#57868 ·published 2006-05-22 02:47 UTC
rendered paste body
collect2: ld returned 1 exit status
make[2]: *** [cc1plus] Error 1
make[2]: Leaving directory `/var/tmp/portage/gcc-3.4.6-r1/work/build/gcc'
make[1]: *** [stageprofile_build] Error 2
make[1]: Leaving directory `/var/tmp/portage/gcc-3.4.6-r1/work/build/gcc'
make: *** [profiledbootstrap] Error 2

!!! ERROR: sys-devel/gcc-3.4.6-r1 failed.
Call stack:
  ebuild.sh, line 1527:   Called dyn_compile
  ebuild.sh, line 931:   Called src_compile
  ebuild.sh, line 1240:   Called toolchain_src_compile
  toolchain.eclass, line 24:   Called gcc_src_compile
  toolchain.eclass, line 1470:   Called gcc_do_make
  toolchain.eclass, line 1344:   Called die

!!! emake failed with profiledbootstrap
!!! If you need support, post the topmost build error, and the call stack if relevant.


and 

run-iconv-test.sh: line 61: 23135 Segmentation fault      $PROG -f $from -t $t testdata/$from >$temp1
make[2]: *** [/var/tmp/portage/glibc-2.4-r3/work/build-default-i686-pc-linux-gnu-nptl/iconvdata/iconv-test.out] Error 1
make[2]: Leaving directory `/var/tmp/portage/glibc-2.4-r3/work/glibc-2.4/iconvdata'
make[1]: *** [iconvdata/tests] Error 2
make[1]: Leaving directory `/var/tmp/portage/glibc-2.4-r3/work/glibc-2.4'
make: *** [check] Error 2

!!! ERROR: sys-libs/glibc-2.4-r3 failed.
Call stack:
  ebuild.sh, line 1527:   Called dyn_test
  ebuild.sh, line 979:   Called src_test
  glibc-2.4-r3.ebuild, line 1200:   Called toolchain-glibc_src_test
  glibc-2.4-r3.ebuild, line 306:   Called die

!!! nptl glibc did not pass make check
!!! If you need support, post the topmost build error, and the call stack if relevant.