All pastes #578090 Raw Edit

Stuff

public text v1 · immutable
·published 2007-06-20 04:57 UTC
rendered paste body
Building newlib
*** removing etc/Makefile to force reconfigure
*** removing arm-eabi/libgloss/Makefile to force reconfigure
configure: error: `CC' has changed since the previous run:
configure:   former value:  arm-eabi-gcc -B/home/anders/gdc/work/build/newlib/arm-eabi/newlib/ -isystem /home/anders/gdc/work/build/newlib/arm-eabi/newlib/targ-include -isystem /home/anders/gdc/work/newlib-1.15.0/newlib/libc/include
configure:   current value: -B/home/anders/gdc/work/build/newlib/arm-eabi/newlib/ -isystem /home/anders/gdc/work/build/newlib/arm-eabi/newlib/targ-include -isystem /home/anders/gdc/work/newlib-1.15.0/newlib/libc/include
configure: error: changes in the environment can compromise the build
configure: error: run `make distclean' and/or `rm ./config.cache' and start over
make[1]: *** [configure-target-newlib] Error 1
make[1]: *** Waiting for unfinished jobs....
make: *** [all] Error 2
WARNING: `makeinfo' is missing on your system.  You should only need it if
         you modified a `.texi' or `.texinfo' file, or any other file
         indirectly affecting the aspect of the manual.  The spurious
         call might also be the consequence of using a buggy `make' (AIX,
         DU, IRIX).  You might want to install the `Texinfo' package or
         the `GNU make' package.  Grab either from any GNU archive site.
make[3]: *** [standards.info] Error 1
make[2]: *** [info] Error 1
make[1]: *** [install-etc] Error 2
make: *** [install] Error 2
Building GCC
configure: WARNING:
*** Makeinfo is missing. Info documentation will not be built.
configure: WARNING:
*** Makeinfo is missing. Info documentation will not be built.
configure: WARNING: No native atomic operations are provided for this platform.
configure: WARNING: They cannot be faked when thread support is disabled.
configure: WARNING: Thread-safety of certain classes is not guaranteed.
configure: WARNING:
*** Makeinfo is missing. Info documentation will not be built.
configure: WARNING:
*** Makeinfo is missing. Info documentation will not be built.
../../../../gcc-4.1.2/libiberty/safe-ctype.c:120:34: error: stdio.h: No such file or directory
../../../../gcc-4.1.2/libiberty/safe-ctype.c:123:3: error: #error "<safe-ctype.h> requires EOF == -1"
make[2]: *** [safe-ctype.o] Error 1
make[2]: *** Waiting for unfinished jobs....
make[1]: *** [all-target-libiberty] Error 2
make[1]: *** Waiting for unfinished jobs....
configure: WARNING: No native atomic operations are provided for this platform.
configure: WARNING: They cannot be faked when thread support is disabled.
configure: WARNING: Thread-safety of certain classes is not guaranteed.
configure: WARNING: No native atomic operations are provided for this platform.
configure: WARNING: They cannot be faked when thread support is disabled.
configure: WARNING: Thread-safety of certain classes is not guaranteed.
configure: WARNING: No native atomic operations are provided for this platform.
configure: WARNING: They cannot be faked when thread support is disabled.
configure: WARNING: Thread-safety of certain classes is not guaranteed.
make: *** [all] Error 2
In file included from ../../../../../gcc-4.1.2/libstdc++-v3/libsupc++/del_op.cc:34:
/home/anders/gdc/work/build/gcc/arm-eabi/libstdc++-v3/include/cstdlib:71:20: error: stdlib.h: No such file or directory
/home/anders/gdc/work/build/gcc/arm-eabi/libstdc++-v3/include/cstdlib:105: error: '::div_t' has not been declared
/home/anders/gdc/work/build/gcc/arm-eabi/libstdc++-v3/include/cstdlib:106: error: '::ldiv_t' has not been declared
/home/anders/gdc/work/build/gcc/arm-eabi/libstdc++-v3/include/cstdlib:108: error: '::abort' has not been declared
/home/anders/gdc/work/build/gcc/arm-eabi/libstdc++-v3/include/cstdlib:109: error: '::abs' has not been declared
/home/anders/gdc/work/build/gcc/arm-eabi/libstdc++-v3/include/cstdlib:110: error: '::atexit' has not been declared
/home/anders/gdc/work/build/gcc/arm-eabi/libstdc++-v3/include/cstdlib:111: error: '::atof' has not been declared
/home/anders/gdc/work/build/gcc/arm-eabi/libstdc++-v3/include/cstdlib:112: error: '::atoi' has not been declared
/home/anders/gdc/work/build/gcc/arm-eabi/libstdc++-v3/include/cstdlib:113: error: '::atol' has not been declared
/home/anders/gdc/work/build/gcc/arm-eabi/libstdc++-v3/include/cstdlib:114: error: '::bsearch' has not been declared
/home/anders/gdc/work/build/gcc/arm-eabi/libstdc++-v3/include/cstdlib:115: error: '::calloc' has not been declared
/home/anders/gdc/work/build/gcc/arm-eabi/libstdc++-v3/include/cstdlib:116: error: '::div' has not been declared
/home/anders/gdc/work/build/gcc/arm-eabi/libstdc++-v3/include/cstdlib:117: error: '::exit' has not been declared
/home/anders/gdc/work/build/gcc/arm-eabi/libstdc++-v3/include/cstdlib:118: error: '::free' has not been declared
/home/anders/gdc/work/build/gcc/arm-eabi/libstdc++-v3/include/cstdlib:119: error: '::getenv' has not been declared
/home/anders/gdc/work/build/gcc/arm-eabi/libstdc++-v3/include/cstdlib:120: error: '::labs' has not been declared
/home/anders/gdc/work/build/gcc/arm-eabi/libstdc++-v3/include/cstdlib:121: error: '::ldiv' has not been declared
/home/anders/gdc/work/build/gcc/arm-eabi/libstdc++-v3/include/cstdlib:122: error: '::malloc' has not been declared
/home/anders/gdc/work/build/gcc/arm-eabi/libstdc++-v3/include/cstdlib:128: error: '::qsort' has not been declared
/home/anders/gdc/work/build/gcc/arm-eabi/libstdc++-v3/include/cstdlib:129: error: '::rand' has not been declared
/home/anders/gdc/work/build/gcc/arm-eabi/libstdc++-v3/include/cstdlib:130: error: '::realloc' has not been declared
/home/anders/gdc/work/build/gcc/arm-eabi/libstdc++-v3/include/cstdlib:131: error: '::srand' has not been declared
/home/anders/gdc/work/build/gcc/arm-eabi/libstdc++-v3/include/cstdlib:132: error: '::strtod' has not been declared
/home/anders/gdc/work/build/gcc/arm-eabi/libstdc++-v3/include/cstdlib:133: error: '::strtol' has not been declared
/home/anders/gdc/work/build/gcc/arm-eabi/libstdc++-v3/include/cstdlib:134: error: '::strtoul' has not been declared
/home/anders/gdc/work/build/gcc/arm-eabi/libstdc++-v3/include/cstdlib:135: error: '::system' has not been declared
/home/anders/gdc/work/build/gcc/arm-eabi/libstdc++-v3/include/cstdlib: In function 'long int std::abs(long int)':
/home/anders/gdc/work/build/gcc/arm-eabi/libstdc++-v3/include/cstdlib:142: error: 'labs' was not declared in this scope
/home/anders/gdc/work/build/gcc/arm-eabi/libstdc++-v3/include/cstdlib: At global scope:
/home/anders/gdc/work/build/gcc/arm-eabi/libstdc++-v3/include/cstdlib:144: error: 'ldiv_t' does not name a type
../../../../../gcc-4.1.2/libstdc++-v3/libsupc++/del_op.cc:38: error: 'std::free' has not been declared
../../../../../gcc-4.1.2/libstdc++-v3/libsupc++/del_op.cc: In function 'void operator delete(void*)':
../../../../../gcc-4.1.2/libstdc++-v3/libsupc++/del_op.cc:49: error: 'free' was not declared in this scope
make[3]: *** [del_op.lo] Error 1
make[2]: *** [install-recursive] Error 1
make[1]: *** [install-target-libstdc++-v3] Error 2
make: *** [install] Error 2
[anders@california work]$