rendered paste bodydemo.c:641: Warnung: »do_animation« definiert, aber nicht verwendet
i686-pc-linux-gnu-gcc -DHAVE_CONFIG_H -I. -I. -I.. -I/usr/include/glib-2.0 -I/usr/lib/glib-2.0/include -O2 -pipe -funroll-loops -march=pentium4 -mtune=pentium4 -msse -msse2 -mfpmath=sse -fomit-frame-pointer -ffast-math -Wall -MT wswindow.lo -MD -MP -MF .deps/wswindow.Tpo -c wswindow.c -fPIC -DPIC -o .libs/wswindow.o
if i686-pc-linux-gnu-gcc -DHAVE_CONFIG_H -I. -I. -I.. -I/usr/include/glib-2.0 -I/usr/lib/glib-2.0/include -O2 -pipe -funroll-loops -march=pentium4 -mtune=pentium4 -msse -msse2 -mfpmath=sse -fomit-frame-pointer -ffast-math -Wall -MT pixtest.o -MD -MP -MF ".deps/pixtest.Tpo" -c -o pixtest.o pixtest.c; \
then mv -f ".deps/pixtest.Tpo" ".deps/pixtest.Po"; else rm -f ".deps/pixtest.Tpo"; exit 1; fi
i686-pc-linux-gnu-gcc -DHAVE_CONFIG_H -I. -I. -I.. -I/usr/include/glib-2.0 -I/usr/lib/glib-2.0/include -O2 -pipe -funroll-loops -march=pentium4 -mtune=pentium4 -msse -msse2 -mfpmath=sse -fomit-frame-pointer -ffast-math -Wall -MT wswindow.lo -MD -MP -MF .deps/wswindow.Tpo -c wswindow.c -o wswindow.o >/dev/null 2>&1
if i686-pc-linux-gnu-gcc -DHAVE_CONFIG_H -I. -I. -I.. -I/usr/include/glib-2.0 -I/usr/lib/glib-2.0/include -O2 -pipe -funroll-loops -march=pentium4 -mtune=pentium4 -msse -msse2 -mfpmath=sse -fomit-frame-pointer -ffast-math -Wall -MT gridtest.o -MD -MP -MF ".deps/gridtest.Tpo" -c -o gridtest.o gridtest.c; \
then mv -f ".deps/gridtest.Tpo" ".deps/gridtest.Po"; else rm -f ".deps/gridtest.Tpo"; exit 1; fi
gridtest.c: In function `main':
gridtest.c:126: Warnung: implizite Deklaration der Funktion »ws_window_gl_finish«
gridtest.c:85: Warnung: Variable »root« wird nicht verwendet
gridtest.c: At top level:
gridtest.c:30: Warnung: »paint_window« definiert, aber nicht verwendet
if i686-pc-linux-gnu-gcc -DHAVE_CONFIG_H -I. -I. -I.. -I/usr/include/glib-2.0 -I/usr/lib/glib-2.0/include -O2 -pipe -funroll-loops -march=pentium4 -mtune=pentium4 -msse -msse2 -mfpmath=sse -fomit-frame-pointer -ffast-math -Wall -MT cubetest.o -MD -MP -MF ".deps/cubetest.Tpo" -c -o cubetest.o cubetest.c; \
then mv -f ".deps/cubetest.Tpo" ".deps/cubetest.Po"; else rm -f ".deps/cubetest.Tpo"; exit 1; fi
if i686-pc-linux-gnu-gcc -DHAVE_CONFIG_H -I. -I. -I.. -I/usr/include/glib-2.0 -I/usr/lib/glib-2.0/include -O2 -pipe -funroll-loops -march=pentium4 -mtune=pentium4 -msse -msse2 -mfpmath=sse -fomit-frame-pointer -ffast-math -Wall -MT magtest.o -MD -MP -MF ".deps/magtest.Tpo" -c -o magtest.o magtest.c; \
then mv -f ".deps/magtest.Tpo" ".deps/magtest.Po"; else rm -f ".deps/magtest.Tpo"; exit 1; fi
cubetest.c: In function `main':
cubetest.c:127: Warnung: implizite Deklaration der Funktion »ws_window_gl_finish«
if i686-pc-linux-gnu-gcc -DHAVE_CONFIG_H -I. -I. -I.. -I/usr/include/glib-2.0 -I/usr/lib/glib-2.0/include -O2 -pipe -funroll-loops -march=pentium4 -mtune=pentium4 -msse -msse2 -mfpmath=sse -fomit-frame-pointer -ffast-math -Wall -MT overlaytest.o -MD -MP -MF ".deps/overlaytest.Tpo" -c -o overlaytest.o overlaytest.c; \
then mv -f ".deps/overlaytest.Tpo" ".deps/overlaytest.Po"; else rm -f ".deps/overlaytest.Tpo"; exit 1; fi
magtest.c: In function `main':
magtest.c:118: Warnung: Verarbeiten des Argumentes 1 von »cm_magnifier_new« von inkompatiblem Zeigertyp
magtest.c:143: Warnung: implizite Deklaration der Funktion »ws_window_gl_finish«
magtest.c:87: Warnung: Variable »root« wird nicht verwendet
magtest.c: At top level:
magtest.c:32: Warnung: »paint_window« definiert, aber nicht verwendet
/bin/sh ../libtool --tag=CC --mode=link i686-pc-linux-gnu-gcc -O2 -pipe -funroll-loops -march=pentium4 -mtune=pentium4 -msse -msse2 -mfpmath=sse -fomit-frame-pointer -ffast-math -Wall -Wl,-O1 -Wl,--enable-new-dtags -Wl,--sort-common -s -o libcm.la -rpath /usr/lib -version-info 7:0:0 -no-undefined clip.lo cube.lo deform.lo drawable-node.lo explosion.lo grid.lo magnifier.lo node.lo ortho.lo pixtexture.lo rotation.lo shadow.lo square.lo stacker.lo state.lo texenv.lo translation.lo watch.lo wobbler.lo wsdisplay.lo wsdrawable.lo wspixmap.lo wsregion.lo wsserverregion.lo wsresource.lo wsutil.lo wsscreen.lo wswindow.lo -lgobject-2.0 -lglib-2.0 -lX11 -lXcomposite -lXdamage -lXfixes -lXtst -lGL -lGLU
overlaytest.c:1:19: cm/ws.h: Datei oder Verzeichnis nicht gefunden
overlaytest.c: In function `main':
overlaytest.c:6: Warnung: implizite Deklaration der Funktion »g_type_init«
overlaytest.c:8: Fehler: »WsDisplay« nicht deklariert (erste Benutzung in dieser Funktion)
overlaytest.c:8: Fehler: (Jeder nicht deklarierte Bezeichner wird nur einmal aufgeführt
overlaytest.c:8: Fehler: für jede Funktion in der er auftritt.)
overlaytest.c:8: Fehler: »display« nicht deklariert (erste Benutzung in dieser Funktion)
overlaytest.c:8: Warnung: implizite Deklaration der Funktion »ws_display_new«
overlaytest.c:8: Fehler: »NULL« nicht deklariert (erste Benutzung in dieser Funktion)
overlaytest.c:9: Fehler: »WsScreen« nicht deklariert (erste Benutzung in dieser Funktion)
overlaytest.c:9: Fehler: »screen« nicht deklariert (erste Benutzung in dieser Funktion)
overlaytest.c:9: Warnung: implizite Deklaration der Funktion »ws_display_get_default_screen«
overlaytest.c:10: Fehler: »WsWindow« nicht deklariert (erste Benutzung in dieser Funktion)
overlaytest.c:10: Fehler: »root« nicht deklariert (erste Benutzung in dieser Funktion)
overlaytest.c:10: Warnung: implizite Deklaration der Funktion »ws_screen_get_root_window«
overlaytest.c:11: Fehler: »overlay« nicht deklariert (erste Benutzung in dieser Funktion)
overlaytest.c:13: Warnung: implizite Deklaration der Funktion »ws_display_init_composite«
overlaytest.c:15: Warnung: implizite Deklaration der Funktion »ws_window_redirect_subwindows«
overlaytest.c:17: Warnung: implizite Deklaration der Funktion »ws_screen_get_gl_window«
overlaytest.c:19: Warnung: implizite Deklaration der Funktion »g_print«
make[3]: *** [overlaytest.o] Fehler 1
make[3]: *** Warte auf noch nicht beendete Prozesse...
i686-pc-linux-gnu-gcc -shared .libs/clip.o .libs/cube.o .libs/deform.o .libs/drawable-node.o .libs/explosion.o .libs/grid.o .libs/magnifier.o .libs/node.o .libs/ortho.o .libs/pixtexture.o .libs/rotation.o .libs/shadow.o .libs/square.o .libs/stacker.o .libs/state.o .libs/texenv.o .libs/translation.o .libs/watch.o .libs/wobbler.o .libs/wsdisplay.o .libs/wsdrawable.o .libs/wspixmap.o .libs/wsregion.o .libs/wsserverregion.o .libs/wsresource.o .libs/wsutil.o .libs/wsscreen.o .libs/wswindow.o -Wl,--rpath -Wl,/usr/lib/opengl/nvidia/lib -Wl,--rpath -Wl,/usr/lib/opengl/nvidia/lib /usr/lib/libgobject-2.0.so -L/usr/lib /usr/lib/libglib-2.0.so /usr/lib/libX11.so /usr/lib/libXcomposite.so /usr/lib/libXdamage.so /usr/lib/libXfixes.so /usr/lib/libXtst.so /usr/lib/opengl/nvidia/lib/libGL.so /usr/lib/libGLU.so -march=pentium4 -mtune=pentium4 -msse -msse2 -mfpmath=sse -Wl,-O1 -Wl,--enable-new-dtags -Wl,--sort-common -Wl,-soname -Wl,libcm.so.7 -o .libs/libcm.so.7.0.0
(cd .libs && rm -f libcm.so.7 && ln -s libcm.so.7.0.0 libcm.so.7)
(cd .libs && rm -f libcm.so && ln -s libcm.so.7.0.0 libcm.so)
i686-pc-linux-gnu-ar cru .libs/libcm.a clip.o cube.o deform.o drawable-node.o explosion.o grid.o magnifier.o node.o ortho.o pixtexture.o rotation.o shadow.o square.o stacker.o state.o texenv.o translation.o watch.o wobbler.o wsdisplay.o wsdrawable.o wspixmap.o wsregion.o wsserverregion.o wsresource.o wsutil.o wsscreen.o wswindow.o
i686-pc-linux-gnu-ranlib .libs/libcm.a
creating libcm.la
(cd .libs && rm -f libcm.la && ln -s ../libcm.la libcm.la)
make[3]: Leaving directory `/var/tmp/portage/libcm-0.0.19_p20060414/work/libcm/src'
make[2]: *** [all] Fehler 2
make[2]: Leaving directory `/var/tmp/portage/libcm-0.0.19_p20060414/work/libcm/src'
make[1]: *** [all-recursive] Fehler 1
make[1]: Leaving directory `/var/tmp/portage/libcm-0.0.19_p20060414/work/libcm'
make: *** [all] Fehler 2
!!! ERROR: x11-libs/libcm-0.0.19_p20060414 failed.
Call stack:
ebuild.sh, line 1527: Called dyn_compile
ebuild.sh, line 931: Called src_compile
libcm-0.0.19_p20060414.ebuild, line 56: Called die
!!! make failed
!!! If you need support, post the topmost build error, and the call stack if relevant.