All pastes #57726 Raw Edit

Something

public text v1 · immutable
#57726 ·published 2006-05-21 20:17 UTC
rendered paste body
 i386-pc-linux-gnu-gcc -DHAVE_CONFIG_H -I. -I. -I.. -DG_LOG_DOMAIN=\"Gtk\" -DGTK_LIBDIR=\"/usr/lib\" -DGTK_DATADIR=\"/usr/share\" -DGTK_DATA_PREFIX=\"/usr\" -DGTK_SYSCONFDIR=\"/etc\" -DGTK_VERSION=\"2.8.17\" -DGTK_BINARY_VERSION=\"2.4.0\" -DGTK_HOST=\"i386-pc-linux-gnu\" -DGTK_COMPILATION -I../gtk -I.. -I../gdk -I../gdk -I../gdk-pixbuf -I../gdk-pixbuf -DG_DISABLE_DEPRECATED -DGDK_PIXBUF_DISABLE_DEPRECATED -DGDK_DISABLE_DEPRECATED -DGTK_DISABLE_DEPRECATED -DGTK_FILE_SYSTEM_ENABLE_UNSUPPORTED -DG_DISABLE_CAST_CHECKS -pthread -I/usr/include/glib-2.0 -I/usr/lib/glib-2.0/include -I/usr/include/pango-1.0 -I/usr/include/cairo -I/usr/include/atk-1.0 -march=pentium-m -O2 -pipe -Wall -MT gtkaboutdialog.lo -MD -MP -MF .deps/gtkaboutdialog.Tpo -c gtkaboutdialog.c  -fPIC -DPIC -o .libs/gtkaboutdialog.o
In file included from ../gtk/gtkcontainer.h:33,
                 from ../gtk/gtkbin.h:32,
                 from ../gtk/gtkwindow.h:33,
                 from ../gtk/gtkdialog.h:32,
                 from gtkaboutdialog.h:28,
                 from gtkaboutdialog.c:35:
../gtk/gtkwidget.h:36:27: atk/atkobject.h: No such file or directory
In file included from ../gtk/gtkcontainer.h:33,
                 from ../gtk/gtkbin.h:32,
                 from ../gtk/gtkwindow.h:33,
                 from ../gtk/gtkdialog.h:32,
                 from gtkaboutdialog.h:28,
                 from gtkaboutdialog.c:35:
../gtk/gtkwidget.h:399: error: syntax error before "AtkObject"
../gtk/gtkwidget.h:399: warning: no semicolon at end of struct or union
../gtk/gtkwidget.h:416: error: syntax error before '}' token
../gtk/gtkwidget.h:611: error: syntax error before '*' token
../gtk/gtkwidget.h:611: warning: type defaults to `int' in declaration of `gtk_widget_get_accessible'
../gtk/gtkwidget.h:611: warning: data definition has no type or storage class
In file included from ../gtk/gtkbin.h:32,
                 from ../gtk/gtkwindow.h:33,
                 from ../gtk/gtkdialog.h:32,
                 from gtkaboutdialog.h:28,
                 from gtkaboutdialog.c:35:
../gtk/gtkcontainer.h:69: error: field `parent_class' has incomplete type
In file included from ../gtk/gtkimage.h:32,
                 from gtkbutton.h:34,
                 from gtkaboutdialog.c:36:
../gtk/gtkmisc.h:61: error: field `parent_class' has incomplete type
In file included from ../gtk/gtkscrollbar.h:32,
                 from ../gtk/gtkhscrollbar.h:32,
                 from gtkscrolledwindow.h:32,
                 from gtkaboutdialog.c:44:
../gtk/gtkrange.h:103: error: field `parent_class' has incomplete type
gtkaboutdialog.c: In function `gtk_about_dialog_class_init':
gtkaboutdialog.c:193: error: dereferencing pointer to incomplete type
gtkaboutdialog.c: In function `gtk_about_dialog_style_set':
gtkaboutdialog.c:721: error: dereferencing pointer to incomplete type
gtkaboutdialog.c:722: error: dereferencing pointer to incomplete type
make[4]: *** [gtkaboutdialog.lo] Error 1
make[4]: Leaving directory `/var/tmp/portage/gtk+-2.8.17/work/gtk+-2.8.17/gtk'
make[3]: *** [all-recursive] Error 1
make[3]: Leaving directory `/var/tmp/portage/gtk+-2.8.17/work/gtk+-2.8.17/gtk'
make[2]: *** [all] Error 2
make[2]: Leaving directory `/var/tmp/portage/gtk+-2.8.17/work/gtk+-2.8.17/gtk'
make[1]: *** [all-recursive] Error 1
make[1]: Leaving directory `/var/tmp/portage/gtk+-2.8.17/work/gtk+-2.8.17'
make: *** [all] Error 2

!!! ERROR: x11-libs/gtk+-2.8.17 failed.
Call stack:
  ebuild.sh, line 1527:   Called dyn_compile
  ebuild.sh, line 931:   Called src_compile
  gtk+-2.8.17.ebuild, line 111:   Called die

!!! gtk+ failed to compile
!!! If you need support, post the topmost build error, and the call stack if relevant.