rendered paste body[ 32%] Building CXX object smoke/kde/CMakeFiles/smokekde.dir/x_8.o
/usr/bin/c++ -Dsmokekde_EXPORTS -Wnon-virtual-dtor -Wno-long-long -ansi -Wundef -Wcast-align -Wchar-subscripts -Wall -W -Wpointer-arith -Wformat-security -fno-exceptions -fno-check-new -fno-common -fvisibility=hidden -g3 -fno-inline -fPIC -I/home/pgquiles/kde/build/KDE/kdebindings/smoke/kde -I/home/pgquiles/kde/src/KDE/kdebindings/smoke/kde -I/home/pgquiles/kde/src/KDE/kdebindings -I/home/pgquiles/kde/build/KDE/kdebindings -I/home/pgquiles/kde/src/KDE/kdebindings/smoke -I/usr/include/qt4 -I/usr/include/qt4/Qt -I/usr/share/qt4/mkspecs/default -I/usr/include/qt4/QtCore -I/usr/include/qt4/QtGui -I/usr/include/qt4/Qt3Support -I/usr/include/qt4/QtAssistant -I/usr/include/qt4/QtDesigner -I/usr/include/qt4/QtNetwork -I/usr/include/qt4/QtOpenGL -I/usr/include/qt4/QtSql -I/usr/include/qt4/QtXml -I/usr/include/qt4/QtSvg -I/usr/include/qt4/QtScript -I/usr/include/qt4/QtUiTools -I/usr/include/qt4/QtTest -I/usr/include/qt4/QtDBus -I/home/pgquiles/kde/include -I/home/pgquiles/kde/include/KDE -I/usr/local/include -I/home/pgquiles/kde/include/khexedit -D_BSD_SOURCE -D_XOPEN_SOURCE=500 -D_BSD_SOURCE -D_GNU_SOURCE -DQT_NO_STL -DQT_NO_CAST_TO_ASCII -D_REENTRANT -DKDE_DEPRECATED_WARNINGS -DQT3_SUPPORT -DHAVE_CONFIG_H=1 -o smoke/kde/CMakeFiles/smokekde.dir/x_8.o -c /home/pgquiles/kde/build/KDE/kdebindings/smoke/kde/x_8.cpp
/home/pgquiles/kde/build/KDE/kdebindings/smoke/kde/x_8.cpp: In static member function ‘static void x_KPrinter::x_33(Smoke::StackItem*)’:
/home/pgquiles/kde/build/KDE/kdebindings/smoke/kde/x_8.cpp:8601: error: expected primary-expression before ‘long’
/home/pgquiles/kde/build/KDE/kdebindings/smoke/kde/x_8.cpp:8601: error: expected `)' before ‘long’
make[2]: *** [smoke/kde/CMakeFiles/smokekde.dir/x_8.o] Error 1