l,--rpath -Wl,/usr/lib:/usr/lib/Eterm
./.libs/libEterm.so: undefined reference to `imlib_render_pixmaps_for_whole_image'
./.libs/libEterm.so: undefined reference to `imlib_context_set_display'
./.libs/libEterm.so: undefined reference to `imlib_render_pixmaps_for_whole_image_at_size'
./.libs/libEterm.so: undefined reference to `imlib_context_set_colormap'
./.libs/libEterm.so: undefined reference to `imlib_context_set_drawable'
./.libs/libEterm.so: undefined reference to `imlib_context_set_visual'
./.libs/libEterm.so: undefined reference to `imlib_free_pixmap_and_mask'
collect2: ld returned 1 exit status
make[2]: *** [Eterm] Error 1
make[2]: Leaving directory `/var/tmp/portage/x11-terms/eterm-0.9.4/work/Eterm-0.9.4/src'
make[1]: *** [all-recursive] Error 1
make[1]: Leaving directory `/var/tmp/portage/x11-terms/eterm-0.9.4/work/Eterm-0.9.4'
make: *** [all] Error 2
!!! ERROR: x11-terms/eterm-0.9.4 failed.
Call stack:
ebuild.sh, line 1614: Called dyn_compile
ebuild.sh, line 971: Called qa_call 'src_compile'
environment, line 3043: Called src_compile
eterm-0.9.4.ebuild, line 47: Called die
!!! make failed
!!! If you need support, post the topmost build error, and the call stack if relevant.
!!! A complete build log is located at '/var/tmp/portage/x11-terms/eterm-0.9.4/temp/build.log'.