All pastes #574875 Raw Edit

Mine

public ini v1 · immutable
·published 2007-06-18 19:25 UTC
rendered paste body
gcc -I/to/scratch/swagiaal/frysks/frysk/frysk-core/../frysk-imports/include -I/to/scratch/swagiaal/frysks/frysk/frysk-core -I. -fPIC -fasynchronous-unwind-tables  -g -O -Wall -Werror   -o frysk/pkglibdir/funit-threads  frysk/pkglibdir/funit-threads.o -lpthread source='/to/scratch/swagiaal/frysks/frysk/frysk-core/frysk/pkglibdir/hpd-c.c' object='frysk/pkglibdir/hpd-c.o' libtool=no \        DEPDIR=.deps depmode=none /bin/sh /to/scratch/swagiaal/frysks/frysk/frysk-core/depcomp \        gcc -DPACKAGE_NAME=\"frysk\" -DPACKAGE_TARNAME=\"frysk\" -DPACKAGE_VERSION=\"0.0.1.2007.06.18\" -DPACKAGE_STRING=\"frysk\ 0.0.1.2007.06.18\" -DPACKAGE_BUGREPORT=\"\" -D_FILE_OFFSET_BITS=64 -DPACKAGE=\"frysk\" -DVERSION=\"0.0.1.2007.06.18\"  -I. -I/to/scratch/swagiaal/frysks/frysk/frysk-core    -I/to/scratch/swagiaal/frysks/frysk/frysk-core/../frysk-imports/include -I/to/scratch/swagiaal/frysks/frysk/frysk-core -I. -fPIC -fasynchronous-unwind-tables  -g -O -Wall -Werror -c -o frysk/pkglibdir/hpd-c.o /to/scratch/swagiaal/frysks/frysk/frysk-core/frysk/pkglibdir/hpd-c.c/to/scratch/swagiaal/frysks/frysk/frysk-core/frysk/pkglibdir/hpd-c.c:48: error: expected declaration specifiers or ‘...’ before ‘gettid’cc1: warnings being treated as errors/to/scratch/swagiaal/frysks/frysk/frysk-core/frysk/pkglibdir/hpd-c.c:50: warning: return type defaults to ‘int’/to/scratch/swagiaal/frysks/frysk/frysk-core/frysk/pkglibdir/hpd-c.c: In function ‘_syscall0’:/to/scratch/swagiaal/frysks/frysk/frysk-core/frysk/pkglibdir/hpd-c.c:50: error: storage class specified for parameter ‘func_1’/to/scratch/swagiaal/frysks/frysk/frysk-core/frysk/pkglibdir/hpd-c.c:50: warning: ‘noinline’ attribute ignored/to/scratch/swagiaal/frysks/frysk/frysk-core/frysk/pkglibdir/hpd-c.c:51: error: storage class specified for parameter ‘func_2’/to/scratch/swagiaal/frysks/frysk/frysk-core/frysk/pkglibdir/hpd-c.c:51: warning: ‘noinline’ attribute ignored/to/scratch/swagiaal/frysks/frysk/frysk-core/frysk/pkglibdir/hpd-c.c:55: error: expected ‘=’, ‘,’, ‘;’, ‘asm’ or ‘__attribute__’ before ‘{’ token/to/scratch/swagiaal/frysks/frysk/frysk-core/frysk/pkglibdir/hpd-c.c:61: error: expected ‘=’, ‘,’, ‘;’, ‘asm’ or ‘__attribute__’ before ‘{’ token/to/scratch/swagiaal/frysks/frysk/frysk-core/frysk/pkglibdir/hpd-c.c:67: error: expected ‘=’, ‘,’, ‘;’, ‘asm’ or ‘__attribute__’ before ‘{’ token/to/scratch/swagiaal/frysks/frysk/frysk-core/frysk/pkglibdir/hpd-c.c:73: error: expected ‘=’, ‘,’, ‘;’, ‘asm’ or ‘__attribute__’ before ‘{’ token/to/scratch/swagiaal/frysks/frysk/frysk-core/frysk/pkglibdir/hpd-c.c:79: error: expected ‘=’, ‘,’, ‘;’, ‘asm’ or ‘__attribute__’ before ‘{’ token/to/scratch/swagiaal/frysks/frysk/frysk-core/frysk/pkglibdir/hpd-c.c:85: error: expected ‘=’, ‘,’, ‘;’, ‘asm’ or ‘__attribute__’ before ‘{’ token/to/scratch/swagiaal/frysks/frysk/frysk-core/frysk/pkglibdir/hpd-c.c:91: error: expected ‘=’, ‘,’, ‘;’, ‘asm’ or ‘__attribute__’ before ‘{’ token/to/scratch/swagiaal/frysks/frysk/frysk-core/frysk/pkglibdir/hpd-c.c:97: error: expected ‘=’, ‘,’, ‘;’, ‘asm’ or ‘__attribute__’ before ‘{’ token/to/scratch/swagiaal/frysks/frysk/frysk-core/frysk/pkglibdir/hpd-c.c:106: error: expected ‘=’, ‘,’, ‘;’, ‘asm’ or ‘__attribute__’ before ‘{’ token/to/scratch/swagiaal/frysks/frysk/frysk-core/frysk/pkglibdir/hpd-c.c:115: error: expected ‘=’, ‘,’, ‘;’, ‘asm’ or ‘__attribute__’ before ‘{’ token/to/scratch/swagiaal/frysks/frysk/frysk-core/frysk/pkglibdir/hpd-c.c:125: error: expected ‘=’, ‘,’, ‘;’, ‘asm’ or ‘__attribute__’ before ‘{’ token/to/scratch/swagiaal/frysks/frysk/frysk-core/frysk/pkglibdir/hpd-c.c:131: error: storage class specified for parameter ‘assign_char_arr’/to/scratch/swagiaal/frysks/frysk/frysk-core/frysk/pkglibdir/hpd-c.c:132: error: storage class specified for parameter ‘assign_long_arr’/to/scratch/swagiaal/frysks/frysk/frysk-core/frysk/pkglibdir/hpd-c.c:133: error: storage class specified for parameter ‘assign_int_arr’/to/scratch/swagiaal/frysks/frysk/frysk-core/frysk/pkglibdir/hpd-c.c:134: error: storage class specified for parameter ‘assign_float_arr’/to/scratch/swagiaal/frysks/frysk/frysk-core/frysk/pkglibdir/hpd-c.c:135: error: storage class specified for parameter ‘assign_char’/to/scratch/swagiaal/frysks/frysk/frysk-core/frysk/pkglibdir/hpd-c.c:136: error: storage class specified for parameter ‘assign_short’/to/scratch/swagiaal/frysks/frysk/frysk-core/frysk/pkglibdir/hpd-c.c:137: error: storage class specified for parameter ‘assign_int’/to/scratch/swagiaal/frysks/frysk/frysk-core/frysk/pkglibdir/hpd-c.c:138: error: storage class specified for parameter ‘assign_long’/to/scratch/swagiaal/frysks/frysk/frysk-core/frysk/pkglibdir/hpd-c.c:139: error: storage class specified for parameter ‘assign_float’/to/scratch/swagiaal/frysks/frysk/frysk-core/frysk/pkglibdir/hpd-c.c:140: error: storage class specified for parameter ‘assign_double’/to/scratch/swagiaal/frysks/frysk/frysk-core/frysk/pkglibdir/hpd-c.c:142: error: storage class specified for parameter ‘loop_’/to/scratch/swagiaal/frysks/frysk/frysk-core/frysk/pkglibdir/hpd-c.c:143: error: storage class specified for parameter ‘func_2’/to/scratch/swagiaal/frysks/frysk/frysk-core/frysk/pkglibdir/hpd-c.c:143: warning: ‘noinline’ attribute ignored/to/scratch/swagiaal/frysks/frysk/frysk-core/frysk/pkglibdir/hpd-c.c:143: error: redefinition of parameter ‘func_2’/to/scratch/swagiaal/frysks/frysk/frysk-core/frysk/pkglibdir/hpd-c.c:51: error: previous definition of ‘func_2’ was here/to/scratch/swagiaal/frysks/frysk/frysk-core/frysk/pkglibdir/hpd-c.c:144: error: storage class specified for parameter ‘func_1’/to/scratch/swagiaal/frysks/frysk/frysk-core/frysk/pkglibdir/hpd-c.c:144: warning: ‘noinline’ attribute ignored/to/scratch/swagiaal/frysks/frysk/frysk-core/frysk/pkglibdir/hpd-c.c:144: error: redefinition of parameter ‘func_1’/to/scratch/swagiaal/frysks/frysk/frysk-core/frysk/pkglibdir/hpd-c.c:50: error: previous definition of ‘func_1’ was here/to/scratch/swagiaal/frysks/frysk/frysk-core/frysk/pkglibdir/hpd-c.c:147: error: parameter ‘static_int’ is initialized/to/scratch/swagiaal/frysks/frysk/frysk-core/frysk/pkglibdir/hpd-c.c:148: error: storage class specified for parameter ‘static_class_t’/to/scratch/swagiaal/frysks/frysk/frysk-core/frysk/pkglibdir/hpd-c.c:149: error: expected declaration specifiers before ‘static_class_t’/to/scratch/swagiaal/frysks/frysk/frysk-core/frysk/pkglibdir/hpd-c.c:149: error: expected declaration specifiers before ‘;’ token/to/scratch/swagiaal/frysks/frysk/frysk-core/frysk/pkglibdir/hpd-c.c:154: error: expected ‘=’, ‘,’, ‘;’, ‘asm’ or ‘__attribute__’ before ‘{’ token/to/scratch/swagiaal/frysks/frysk/frysk-core/frysk/pkglibdir/hpd-c.c:203: error: expected ‘=’, ‘,’, ‘;’, ‘asm’ or ‘__attribute__’ before ‘{’ token/to/scratch/swagiaal/frysks/frysk/frysk-core/frysk/pkglibdir/hpd-c.c:213: error: expected ‘=’, ‘,’, ‘;’, ‘asm’ or ‘__attribute__’ before ‘{’ token/to/scratch/swagiaal/frysks/frysk/frysk-core/frysk/pkglibdir/hpd-c.c:220: error: old-style parameter declarations in prototyped function definition/to/scratch/swagiaal/frysks/frysk/frysk-core/frysk/pkglibdir/hpd-c.c:48: error: parameter name omitted/to/scratch/swagiaal/frysks/frysk/frysk-core/frysk/pkglibdir/hpd-c.c:220: error: expected ‘{’ at end of inputmake[2]: *** [frysk/pkglibdir/hpd-c.o] Error 1make[2]: Leaving directory `/tmp/frysks.bin/frysk/frysk-core'make[1]: *** [all] Error 2make[1]: Leaving directory `/tmp/frysks.bin/frysk/frysk-core'make: *** [all-recursive] Error 1[swagiaal@toner frysk]$