rendered paste bodyC:\Tools\projects\stooge\xware\ccl>ant test
Buildfile: build.xml
clean:
[echo] Removing build files and directories.
[delete] Deleting directory C:\Tools\projects\stooge\xware\ccl\build\test-classes
[delete] Deleting directory C:\Tools\projects\stooge\xware\ccl\build\classes
[delete] Deleting directory C:\Tools\projects\stooge\xware\ccl\build
[delete] Deleting directory C:\Tools\projects\stooge\xware\ccl\doc
[delete] Deleting directory C:\Tools\projects\stooge\xware\ccl\index
distclean:
[echo] Removing distribution files and directories.
[delete] Deleting directory C:\Tools\projects\stooge\xware\ccl\dist
prepare:
[echo] Creating the necessary directories.
[mkdir] Created dir: C:\Tools\projects\stooge\xware\ccl\build
[mkdir] Created dir: C:\Tools\projects\stooge\xware\ccl\build\classes
[mkdir] Created dir: C:\Tools\projects\stooge\xware\ccl\build\test-classes
[mkdir] Created dir: C:\Tools\projects\stooge\xware\ccl\build\test-results
[mkdir] Created dir: C:\Tools\projects\stooge\xware\ccl\doc
[mkdir] Created dir: C:\Tools\projects\stooge\xware\ccl\index
[mkdir] Created dir: C:\Tools\projects\stooge\xware\ccl\dist
compile-prod:
[echo] Compiling the XWare classes.
[javac] Compiling 27 source files to C:\Tools\projects\stooge\xware\ccl\build\classes
compile-test:
[echo] Compiling the test classes.
[javac] Compiling 4 source files to C:\Tools\projects\stooge\xware\ccl\build\test-classes
test:
[junit] Testsuite: com.s2g.common.AllTests
[junit] Tests run: 1, Failures: 0, Errors: 1, Time elapsed: 0.078 sec
[junit] Testcase: com.s2g.common.AllTests: Caused an ERROR
[junit] No runnable methods
[junit] java.lang.Exception: No runnable methods
[junit] at org.junit.internal.runners.TestClassMethodsRunner.testAborted(TestClassMethodsRunner.java:42)
[junit] at org.junit.internal.runners.TestClassMethodsRunner.run(TestClassMethodsRunner.java:33)
[junit] at org.junit.internal.runners.TestClassRunner$1.runUnprotected(TestClassRunner.java:42)
[junit] at org.junit.internal.runners.BeforeAndAfterRunner.runProtected(BeforeAndAfterRunner.java:34)
[junit] at org.junit.internal.runners.TestClassRunner.run(TestClassRunner.java:52)
[junit] at junit.framework.JUnit4TestAdapter.run(JUnit4TestAdapter.java:32)
[junit] Test com.s2g.common.AllTests FAILED
BUILD FAILED
C:\Tools\projects\stooge\xware\ccl\build.xml:81: Tests failed! Check test reports.