All pastes #573447 Raw Edit

Anonymous

public text v1 · immutable
·published 2007-06-18 04:51 UTC
rendered paste body
[root@localhost zdoom]# make
src/svnrevision.h is up to date at revision 538.
Compiling fmodsound.cpp:                                              [ERROR]  
g++ -fno-rtti -pipe -Wall -Wno-unused -fno-strict-aliasing -O2 -fomit-frame-pointer -MMD -DHAVE_FILELENGTH -D__forceinline=inline -Izlib -IFLAC -I/usr/include/SDL -D_GNU_SOURCE=1 -D_REENTRANT -I/usr/include/gtk-2.0 -I/usr/lib/gtk-2.0/include -I/usr/include/atk-1.0 -I/usr/include/cairo -I/usr/include/pango-1.0 -I/usr/include/glib-2.0 -I/usr/lib/glib-2.0/include -Dstricmp=strcasecmp -Dstrnicmp=strncasecmp -DNEED_STRUPR -Isrc/ -Isrc/g_doom/ -Isrc/g_heretic/ -Isrc/g_hexen/ -Isrc/g_raven/ -Isrc/g_shared/ -Isrc/g_strife/ -Isrc/oplsynth/ -Isrc/sound/ -Isrc/sdl/ -Isrc/textures/ -DUSEASM=1 -DNDEBUG -o releaseobj/fmodsound.o -c src/sound/fmodsound.cpp
================================================================================src/sound/fmodsound.h:76: error: ‘FSOUND_SAMPLE’ has not been declared
src/sound/fmodsound.h:79: error: ISO C++ forbids declaration of ‘FSOUND_SAMPLE’ with no type
src/sound/fmodsound.h:79: error: expected ‘;’ before ‘*’ token
src/sound/sample_flac.h:14: error: ISO C++ forbids declaration of ‘FSOUND_SAMPLE’ with no type
src/sound/sample_flac.h:14: error: expected ‘;’ before ‘*’ token
src/sound/i_musicinterns.h:196: error: expected `)' before ‘*’ token
src/sound/i_musicinterns.h:197: error: expected `)' before ‘*’ token
src/sound/i_musicinterns.h:198: error: expected `)' before ‘*’ token
src/sound/i_musicinterns.h:199: error: expected `)' before ‘*’ token
src/sound/i_musicinterns.h:200: error: expected `)' before ‘*’ token
src/sound/i_musicinterns.h:201: error: expected `)' before ‘*’ token
src/sound/i_musicinterns.h:202: error: expected `)' before ‘*’ token
src/sound/i_musicinterns.h:203: error: expected `)' before ‘*’ token
src/sound/i_musicinterns.h:203: error: expected initializer before ‘*’ token
src/sound/i_musicinterns.h:230: error: ‘SNESAPUInfo_TYPE’ does not name a type
src/sound/i_musicinterns.h:231: error: ‘GetAPUData_TYPE’ does not name a type
src/sound/i_musicinterns.h:232: error: ‘LoadSPCFile_TYPE’ does not name a type
src/sound/i_musicinterns.h:233: error: ‘ResetAPU_TYPE’ does not name a type
src/sound/i_musicinterns.h:234: error: ‘SetDSPAmp_TYPE’ does not name a type
src/sound/i_musicinterns.h:235: error: ‘FixAPU_TYPE’ does not name a type
src/sound/i_musicinterns.h:236: error: ‘SetAPUOpt_TYPE’ does not name a type
src/sound/i_musicinterns.h:237: error: ‘EmuAPU_TYPE’ does not name a type
src/sound/fmodsound.cpp: In function ‘char FModLog(char)’:
src/sound/fmodsound.cpp:110: error: ‘FSOUND_GetError’ was not declared in this scope
src/sound/fmodsound.cpp: At global scope:
src/sound/fmodsound.cpp:124: error: expected `)' before ‘*’ token
src/sound/fmodsound.cpp:135: error: ‘FSOUND_STREAM’ has not been declared
src/sound/fmodsound.cpp:180: error: expected ‘;’ before ‘MyCallback’
src/sound/fmodsound.cpp:1300: error: expected `;' at end of input
src/sound/fmodsound.cpp:1300: error: expected `}' at end of input
src/sound/fmodsound.cpp: In constructor ‘FMODStreamCapsule::FMODStreamCapsule(void*, bool (*)(SoundStream*, void*, int, void*))’:
src/sound/fmodsound.cpp:128: error: class ‘FMODStreamCapsule’ does not have any field named ‘Stream’
src/sound/fmodsound.cpp:128: error: class ‘FMODStreamCapsule’ does not have any field named ‘UserData’
src/sound/fmodsound.cpp:128: error: class ‘FMODStreamCapsule’ does not have any field named ‘Callback’
src/sound/fmodsound.cpp:128: error: class ‘FMODStreamCapsule’ does not have any field named ‘Channel’
src/sound/fmodsound.cpp: In destructor ‘virtual FMODStreamCapsule::~FMODStreamCapsule()’:
src/sound/fmodsound.cpp:132: error: ‘Stream’ was not declared in this scope
src/sound/fmodsound.cpp:132: error: ‘FSOUND_Stream_Close’ was not declared in this scope
src/sound/fmodsound.cpp: In member function ‘void FMODStreamCapsule::SetStream(int*)’:
src/sound/fmodsound.cpp:137: error: ‘Stream’ was not declared in this scope
src/sound/fmodsound.cpp: In member function ‘virtual bool FMODStreamCapsule::Play(float)’:
src/sound/fmodsound.cpp:142: error: ‘Channel’ was not declared in this scope
src/sound/fmodsound.cpp:142: error: ‘FSOUND_FREE’ was not declared in this scope
src/sound/fmodsound.cpp:142: error: ‘Stream’ was not declared in this scope
src/sound/fmodsound.cpp:142: error: ‘FSOUND_Stream_PlayEx’ was not declared in this scope
src/sound/fmodsound.cpp:145: error: ‘FSOUND_SetVolumeAbsolute’ was not declared in this scope
src/sound/fmodsound.cpp:146: error: ‘FSOUND_STEREOPAN’ was not declared in this scope
src/sound/fmodsound.cpp:146: error: ‘FSOUND_SetPan’ was not declared in this scope
src/sound/fmodsound.cpp:147: error: ‘FSOUND_SetPaused’ was not declared in this scope
src/sound/fmodsound.cpp: In member function ‘virtual void FMODStreamCapsule::Stop()’:
src/sound/fmodsound.cpp:155: error: ‘Stream’ was not declared in this scope
src/sound/fmodsound.cpp:155: error: ‘FSOUND_Stream_Stop’ was not declared in this scope
src/sound/fmodsound.cpp: In member function ‘virtual bool FMODStreamCapsule::SetPaused(bool)’:
src/sound/fmodsound.cpp:160: error: ‘Channel’ was not declared in this scope
src/sound/fmodsound.cpp:162: error: ‘FSOUND_SetPaused’ was not declared in this scope
src/sound/fmodsound.cpp: In member function ‘virtual unsigned int FMODStreamCapsule::GetPosition()’:
src/sound/fmodsound.cpp:169: error: ‘Stream’ was not declared in this scope
src/sound/fmodsound.cpp:169: error: ‘FSOUND_Stream_GetPosition’ was not declared in this scope
src/sound/fmodsound.cpp: In member function ‘virtual void FMODStreamCapsule::SetVolume(float)’:
src/sound/fmodsound.cpp:174: error: ‘Channel’ was not declared in this scope
src/sound/fmodsound.cpp:176: error: ‘FSOUND_SetVolumeAbsolute’ was not declared in this scope
src/sound/fmodsound.cpp: At global scope:
src/sound/fmodsound.cpp:178: error: expected unqualified-id at end of input
make: *** [releaseobj/fmodsound.o] Error 1