All pastes #57217 Raw Edit

Mine

public text v1 · immutable
#57217 ·published 2006-05-19 22:49 UTC
rendered paste body
[hasan@localhost AM_Demod]$ make
make  all-am
make[1]: Entering directory `/home/hasan/src/components/AM_Demod'
if g++ -DPACKAGE_NAME=\"AM_Demod\" -DPACKAGE_TARNAME=\"am_demod\" -DPACKAGE_VERSION=\"0.5.0\" -DPACKAGE_STRING=\"AM_Demod\ 0.5.0\" -DPACKAGE_BUGREPORT=\"\" -DPACKAGE=\"am_demod\" -DVERSION=\"0.5.0\" -DHAVE_SYS_WAIT_H=1 -DSTDC_HEADERS=1 -DHAVE_SYS_TYPES_H=1 -DHAVE_SYS_STAT_H=1 -DHAVE_STDLIB_H=1 -DHAVE_STRING_H=1 -DHAVE_MEMORY_H=1 -DHAVE_STRINGS_H=1 -DHAVE_INTTYPES_H=1 -DHAVE_STDINT_H=1 -DHAVE_UNISTD_H=1 -DHAVE_UNISTD_H=1 -DHAVE_FORK=1 -DHAVE_VFORK=1 -DHAVE_WORKING_VFORK=1 -DHAVE_WORKING_FORK=1 -DHAVE_PTHREAD=1 -D__linux__=1 -D__OSVERSION__=2 -D__x86__=1 -DHAVE_OMNIORB4=1  -I. -I.   -pthread -I/usr/local/include -Wall  -g -O2 -I/usr/local/include   -MT AM_Demod.o -MD -MP -MF ".deps/AM_Demod.Tpo" -c -o AM_Demod.o AM_Demod.cpp; \
then mv -f ".deps/AM_Demod.Tpo" ".deps/AM_Demod.Po"; else rm -f ".deps/AM_Demod.Tpo"; exit 1; fi
AM_Demod.cpp: In member function ‘virtual void AM_Demod_i::start()’:
AM_Demod.cpp:72: error: ‘class dataOut_RX_Control_i’ has no member named ‘set_number_of_channels’
AM_Demod.cpp:73: error: ‘RX_Control_port’ was not declared in this scope
AM_Demod.cpp: In member function ‘virtual CORBA::Object* AM_Demod_i::getPort(const char*)’:
AM_Demod.cpp:64: warning: control reaches end of non-void function
make[1]: *** [AM_Demod.o] Error 1
make[1]: Leaving directory `/home/hasan/src/components/AM_Demod'
make: *** [all] Error 2
[hasan@localhost AM_Demod]$