bash-3.1# make
make -C /lib/modules/2.6.22-rc3/build M=/home/upload/new_kernel/wireless/ipwraw/ipwraw modules
make[1]: Entering directory `/usr/src/linux-2.6.22-rc3'
CC [M] /home/upload/new_kernel/wireless/ipwraw/ipwraw/ipwraw.o
/home/upload/new_kernel/wireless/ipwraw/ipwraw/ipwraw.c: In function `raw_rx':
/home/upload/new_kernel/wireless/ipwraw/ipwraw/ipwraw.c:6187: error: structure has no member named `mac'
/home/upload/new_kernel/wireless/ipwraw/ipwraw/ipwraw.c: In function `ipw_pci_probe':
/home/upload/new_kernel/wireless/ipwraw/ipwraw/ipwraw.c:8241: warning: `deprecated_irq_flag' is deprecated (declared at include/linux/interrupt.h:66)
/home/upload/new_kernel/wireless/ipwraw/ipwraw/ipwraw.c: In function `ipw_init':
/home/upload/new_kernel/wireless/ipwraw/ipwraw/ipwraw.c:8454: warning: implicit declaration of function `pci_module_init'
make[2]: *** [/home/upload/new_kernel/wireless/ipwraw/ipwraw/ipwraw.o] Error 1
make[1]: *** [_module_/home/upload/new_kernel/wireless/ipwraw/ipwraw] Error 2
make[1]: Leaving directory `/usr/src/linux-2.6.22-rc3'
make: *** [modules] Error 2
bash-3.1# ls
total 452K