rendered paste bodynmehta@linux-r8c9:~/2nd/rt2570-1.1.0-b2/Module> make
make[1]: Entering directory `/usr/src/linux-2.6.16.21-0.8-obj/i386/smp'
make -C ../../../linux-2.6.16.21-0.8 O=../linux-2.6.16.21-0.8-obj/i386/smp modules
Building modules, stage 2.
MODPOST
make[1]: Leaving directory `/usr/src/linux-2.6.16.21-0.8-obj/i386/smp'
nmehta@linux-r8c9:~/2nd/rt2570-1.1.0-b2/Module> make install
echo "2.6 module install"
2.6 module install
make -C /lib/modules/2.6.16.21-0.8-smp/build SUBDIRS=/home/nmehta/2nd/rt2570-1.1.0-b2/Module modules_install
make[1]: Entering directory `/usr/src/linux-2.6.16.21-0.8-obj/i386/smp'
make -C ../../../linux-2.6.16.21-0.8 O=../linux-2.6.16.21-0.8-obj/i386/smp modules_install
INSTALL /home/nmehta/2nd/rt2570-1.1.0-b2/Module/rt2570.ko
cp: cannot create regular file `/lib/modules/2.6.16.21-0.8-smp/extra/rt2570.ko': Permission denied
make[4]: *** [/home/nmehta/2nd/rt2570-1.1.0-b2/Module/rt2570.ko] Error 1
make[3]: *** [_emodinst_] Error 2
make[2]: *** [modules_install] Error 2
make[1]: *** [modules_install] Error 2
make[1]: Leaving directory `/usr/src/linux-2.6.16.21-0.8-obj/i386/smp'
make: *** [modules_install] Error 2
nmehta@linux-r8c9:~/2nd/rt2570-1.1.0-b2/Module>