All pastes #569490 Raw Edit

Untitled

public text v1 · immutable
·published 2007-06-16 07:12 UTC
rendered paste body
cairoint.h:257: warning: ISO C forbids forward references to ‘enum’ types
cairo-path-data.c
gcc -o cairo-path-data.o -c -fvisibility=hidden -DMOZILLA_INTERNAL_API -DOSTYPE=\"Linux2.6\" -DOSARCH=\"Linux\" -DBUILD_ID=0000000000  -I. -I./../../libpixman/src -I../../../../dist/include/png -I../../../../dist/include/zlib -I../../../../dist/include/libpixman -I../../../../dist/include/cairo -I../../../../dist/include -I../../../../dist/include/nspr     -I../../../../dist/sdk/include    -fPIC  -Wall -W -Wno-unused -Wpointer-arith -Wcast-align -Wno-long-long -pedantic -pthread -pipe  -DNDEBUG -DTRIMMED -O   -include ../../../../mozilla-config.h -DMOZILLA_CLIENT -Wp,-MD,.deps/cairo-path-data.pp cairo-path-data.c
In file included from cairo-path-data-private.h:39,
                 from cairo-path-data.c:36:
cairoint.h:142:1: warning: C++ style comments are not allowed in ISO C90
cairoint.h:142:1: warning: (this will be reported only once per input file)
In file included from cairo-path-data-private.h:39,
                 from cairo-path-data.c:36:
cairoint.h:257: warning: ISO C forbids forward references to ‘enum’ types
cairo-path-fill.c
gcc -o cairo-path-fill.o -c -fvisibility=hidden -DMOZILLA_INTERNAL_API -DOSTYPE=\"Linux2.6\" -DOSARCH=\"Linux\" -DBUILD_ID=0000000000  -I. -I./../../libpixman/src -I../../../../dist/include/png -I../../../../dist/include/zlib -I../../../../dist/include/libpixman -I../../../../dist/include/cairo -I../../../../dist/include -I../../../../dist/include/nspr     -I../../../../dist/sdk/include    -fPIC  -Wall -W -Wno-unused -Wpointer-arith -Wcast-align -Wno-long-long -pedantic -pthread -pipe  -DNDEBUG -DTRIMMED -O   -include ../../../../mozilla-config.h -DMOZILLA_CLIENT -Wp,-MD,.deps/cairo-path-fill.pp cairo-path-fill.c
In file included from cairo-path-fill.c:37:
cairoint.h:142:1: warning: C++ style comments are not allowed in ISO C90
cairoint.h:142:1: warning: (this will be reported only once per input file)
In file included from cairo-path-fill.c:37:
cairoint.h:257: warning: ISO C forbids forward references to ‘enum’ types
cairo-path-stroke.c
gcc -o cairo-path-stroke.o -c -fvisibility=hidden -DMOZILLA_INTERNAL_API -DOSTYPE=\"Linux2.6\" -DOSARCH=\"Linux\" -DBUILD_ID=0000000000  -I. -I./../../libpixman/src -I../../../../dist/include/png -I../../../../dist/include/zlib -I../../../../dist/include/libpixman -I../../../../dist/include/cairo -I../../../../dist/include -I../../../../dist/include/nspr     -I../../../../dist/sdk/include    -fPIC  -Wall -W -Wno-unused -Wpointer-arith -Wcast-align -Wno-long-long -pedantic -pthread -pipe  -DNDEBUG -DTRIMMED -O   -include ../../../../mozilla-config.h -DMOZILLA_CLIENT -Wp,-MD,.deps/cairo-path-stroke.pp cairo-path-stroke.c
In file included from cairo-path-stroke.c:37:
cairoint.h:142:1: warning: C++ style comments are not allowed in ISO C90
cairoint.h:142:1: warning: (this will be reported only once per input file)
In file included from cairo-path-stroke.c:37:
cairoint.h:257: warning: ISO C forbids forward references to ‘enum’ types
cairo-path.c
gcc -o cairo-path.o -c -fvisibility=hidden -DMOZILLA_INTERNAL_API -DOSTYPE=\"Linux2.6\" -DOSARCH=\"Linux\" -DBUILD_ID=0000000000  -I. -I./../../libpixman/src -I../../../../dist/include/png -I../../../../dist/include/zlib -I../../../../dist/include/libpixman -I../../../../dist/include/cairo -I../../../../dist/include -I../../../../dist/include/nspr     -I../../../../dist/sdk/include    -fPIC  -Wall -W -Wno-unused -Wpointer-arith -Wcast-align -Wno-long-long -pedantic -pthread -pipe  -DNDEBUG -DTRIMMED -O   -include ../../../../mozilla-config.h -DMOZILLA_CLIENT -Wp,-MD,.deps/cairo-path.pp cairo-path.c
In file included from cairo-path.c:39:
cairoint.h:142:1: warning: C++ style comments are not allowed in ISO C90
cairoint.h:142:1: warning: (this will be reported only once per input file)
In file included from cairo-path.c:39:
cairoint.h:257: warning: ISO C forbids forward references to ‘enum’ types
cairo-pattern.c
gcc -o cairo-pattern.o -c -fvisibility=hidden -DMOZILLA_INTERNAL_API -DOSTYPE=\"Linux2.6\" -DOSARCH=\"Linux\" -DBUILD_ID=0000000000  -I. -I./../../libpixman/src -I../../../../dist/include/png -I../../../../dist/include/zlib -I../../../../dist/include/libpixman -I../../../../dist/include/cairo -I../../../../dist/include -I../../../../dist/include/nspr     -I../../../../dist/sdk/include    -fPIC  -Wall -W -Wno-unused -Wpointer-arith -Wcast-align -Wno-long-long -pedantic -pthread -pipe  -DNDEBUG -DTRIMMED -O   -include ../../../../mozilla-config.h -DMOZILLA_CLIENT -Wp,-MD,.deps/cairo-pattern.pp cairo-pattern.c
In file included from cairo-pattern.c:28:
cairoint.h:142:1: warning: C++ style comments are not allowed in ISO C90
cairoint.h:142:1: warning: (this will be reported only once per input file)
In file included from cairo-pattern.c:28:
cairoint.h:257: warning: ISO C forbids forward references to ‘enum’ types
cairo-pattern.c:54: warning: missing initializer
cairo-pattern.c:54: warning: (near initialization for ‘cairo_pattern_nil.color’)
cairo-pattern.c:63: warning: missing initializer
cairo-pattern.c:63: warning: (near initialization for ‘cairo_pattern_nil_null_pointer.color’)
cairo-pattern.c:72: warning: missing initializer
cairo-pattern.c:72: warning: (near initialization for ‘cairo_pattern_nil_file_not_found.color’)
cairo-pattern.c:81: warning: missing initializer
cairo-pattern.c:81: warning: (near initialization for ‘cairo_pattern_nil_read_error.color’)
cairo-pen.c
gcc -o cairo-pen.o -c -fvisibility=hidden -DMOZILLA_INTERNAL_API -DOSTYPE=\"Linux2.6\" -DOSARCH=\"Linux\" -DBUILD_ID=0000000000  -I. -I./../../libpixman/src -I../../../../dist/include/png -I../../../../dist/include/zlib -I../../../../dist/include/libpixman -I../../../../dist/include/cairo -I../../../../dist/include -I../../../../dist/include/nspr     -I../../../../dist/sdk/include    -fPIC  -Wall -W -Wno-unused -Wpointer-arith -Wcast-align -Wno-long-long -pedantic -pthread -pipe  -DNDEBUG -DTRIMMED -O   -include ../../../../mozilla-config.h -DMOZILLA_CLIENT -Wp,-MD,.deps/cairo-pen.pp cairo-pen.c
In file included from cairo-pen.c:37:
cairoint.h:142:1: warning: C++ style comments are not allowed in ISO C90
cairoint.h:142:1: warning: (this will be reported only once per input file)
In file included from cairo-pen.c:37:
cairoint.h:257: warning: ISO C forbids forward references to ‘enum’ types
cairo-polygon.c
gcc -o cairo-polygon.o -c -fvisibility=hidden -DMOZILLA_INTERNAL_API -DOSTYPE=\"Linux2.6\" -DOSARCH=\"Linux\" -DBUILD_ID=0000000000  -I. -I./../../libpixman/src -I../../../../dist/include/png -I../../../../dist/include/zlib -I../../../../dist/include/libpixman -I../../../../dist/include/cairo -I../../../../dist/include -I../../../../dist/include/nspr     -I../../../../dist/sdk/include    -fPIC  -Wall -W -Wno-unused -Wpointer-arith -Wcast-align -Wno-long-long -pedantic -pthread -pipe  -DNDEBUG -DTRIMMED -O   -include ../../../../mozilla-config.h -DMOZILLA_CLIENT -Wp,-MD,.deps/cairo-polygon.pp cairo-polygon.c
In file included from cairo-polygon.c:38:
cairoint.h:142:1: warning: C++ style comments are not allowed in ISO C90
cairoint.h:142:1: warning: (this will be reported only once per input file)
In file included from cairo-polygon.c:38:
cairoint.h:257: warning: ISO C forbids forward references to ‘enum’ types
cairo-region.c
gcc -o cairo-region.o -c -fvisibility=hidden -DMOZILLA_INTERNAL_API -DOSTYPE=\"Linux2.6\" -DOSARCH=\"Linux\" -DBUILD_ID=0000000000  -I. -I./../../libpixman/src -I../../../../dist/include/png -I../../../../dist/include/zlib -I../../../../dist/include/libpixman -I../../../../dist/include/cairo -I../../../../dist/include -I../../../../dist/include/nspr     -I../../../../dist/sdk/include    -fPIC  -Wall -W -Wno-unused -Wpointer-arith -Wcast-align -Wno-long-long -pedantic -pthread -pipe  -DNDEBUG -DTRIMMED -O   -include ../../../../mozilla-config.h -DMOZILLA_CLIENT -Wp,-MD,.deps/cairo-region.pp cairo-region.c
In file included from cairo-region.c:36:
./cairoint.h:142:1: warning: C++ style comments are not allowed in ISO C90
./cairoint.h:142:1: warning: (this will be reported only once per input file)
In file included from cairo-region.c:36:
./cairoint.h:257: warning: ISO C forbids forward references to ‘enum’ types
cairo-slope.c
gcc -o cairo-slope.o -c -fvisibility=hidden -DMOZILLA_INTERNAL_API -DOSTYPE=\"Linux2.6\" -DOSARCH=\"Linux\" -DBUILD_ID=0000000000  -I. -I./../../libpixman/src -I../../../../dist/include/png -I../../../../dist/include/zlib -I../../../../dist/include/libpixman -I../../../../dist/include/cairo -I../../../../dist/include -I../../../../dist/include/nspr     -I../../../../dist/sdk/include    -fPIC  -Wall -W -Wno-unused -Wpointer-arith -Wcast-align -Wno-long-long -pedantic -pthread -pipe  -DNDEBUG -DTRIMMED -O   -include ../../../../mozilla-config.h -DMOZILLA_CLIENT -Wp,-MD,.deps/cairo-slope.pp cairo-slope.c
In file included from cairo-slope.c:37:
cairoint.h:142:1: warning: C++ style comments are not allowed in ISO C90
cairoint.h:142:1: warning: (this will be reported only once per input file)
In file included from cairo-slope.c:37:
cairoint.h:257: warning: ISO C forbids forward references to ‘enum’ types
cairo-spline.c
gcc -o cairo-spline.o -c -fvisibility=hidden -DMOZILLA_INTERNAL_API -DOSTYPE=\"Linux2.6\" -DOSARCH=\"Linux\" -DBUILD_ID=0000000000  -I. -I./../../libpixman/src -I../../../../dist/include/png -I../../../../dist/include/zlib -I../../../../dist/include/libpixman -I../../../../dist/include/cairo -I../../../../dist/include -I../../../../dist/include/nspr     -I../../../../dist/sdk/include    -fPIC  -Wall -W -Wno-unused -Wpointer-arith -Wcast-align -Wno-long-long -pedantic -pthread -pipe  -DNDEBUG -DTRIMMED -O   -include ../../../../mozilla-config.h -DMOZILLA_CLIENT -Wp,-MD,.deps/cairo-spline.pp cairo-spline.c
In file included from cairo-spline.c:37:
cairoint.h:142:1: warning: C++ style comments are not allowed in ISO C90
cairoint.h:142:1: warning: (this will be reported only once per input file)
In file included from cairo-spline.c:37:
cairoint.h:257: warning: ISO C forbids forward references to ‘enum’ types
cairo-surface.c
gcc -o cairo-surface.o -c -fvisibility=hidden -DMOZILLA_INTERNAL_API -DOSTYPE=\"Linux2.6\" -DOSARCH=\"Linux\" -DBUILD_ID=0000000000  -I. -I./../../libpixman/src -I../../../../dist/include/png -I../../../../dist/include/zlib -I../../../../dist/include/libpixman -I../../../../dist/include/cairo -I../../../../dist/include -I../../../../dist/include/nspr     -I../../../../dist/sdk/include    -fPIC  -Wall -W -Wno-unused -Wpointer-arith -Wcast-align -Wno-long-long -pedantic -pthread -pipe  -DNDEBUG -DTRIMMED -O   -include ../../../../mozilla-config.h -DMOZILLA_CLIENT -Wp,-MD,.deps/cairo-surface.pp cairo-surface.c
In file included from cairo-surface.c:40:
cairoint.h:142:1: warning: C++ style comments are not allowed in ISO C90
cairoint.h:142:1: warning: (this will be reported only once per input file)
In file included from cairo-surface.c:40:
cairoint.h:257: warning: ISO C forbids forward references to ‘enum’ types
cairo-surface.c:57: warning: missing initializer
cairo-surface.c:57: warning: (near initialization for ‘_cairo_surface_nil.next_clip_serial’)
cairo-surface.c:73: warning: missing initializer
cairo-surface.c:73: warning: (near initialization for ‘_cairo_surface_nil_file_not_found.next_clip_serial’)
cairo-surface.c:89: warning: missing initializer
cairo-surface.c:89: warning: (near initialization for ‘_cairo_surface_nil_read_error.next_clip_serial’)
cairo-surface.c: In function ‘_moz_cairo_surface_set_user_data’:
cairo-surface.c:403: warning: comparison between signed and unsigned
cairo-traps.c
gcc -o cairo-traps.o -c -fvisibility=hidden -DMOZILLA_INTERNAL_API -DOSTYPE=\"Linux2.6\" -DOSARCH=\"Linux\" -DBUILD_ID=0000000000  -I. -I./../../libpixman/src -I../../../../dist/include/png -I../../../../dist/include/zlib -I../../../../dist/include/libpixman -I../../../../dist/include/cairo -I../../../../dist/include -I../../../../dist/include/nspr     -I../../../../dist/sdk/include    -fPIC  -Wall -W -Wno-unused -Wpointer-arith -Wcast-align -Wno-long-long -pedantic -pthread -pipe  -DNDEBUG -DTRIMMED -O   -include ../../../../mozilla-config.h -DMOZILLA_CLIENT -Wp,-MD,.deps/cairo-traps.pp cairo-traps.c
In file included from cairo-traps.c:38:
cairoint.h:142:1: warning: C++ style comments are not allowed in ISO C90
cairoint.h:142:1: warning: (this will be reported only once per input file)
In file included from cairo-traps.c:38:
cairoint.h:257: warning: ISO C forbids forward references to ‘enum’ types
cairo-unicode.c
gcc -o cairo-unicode.o -c -fvisibility=hidden -DMOZILLA_INTERNAL_API -DOSTYPE=\"Linux2.6\" -DOSARCH=\"Linux\" -DBUILD_ID=0000000000  -I. -I./../../libpixman/src -I../../../../dist/include/png -I../../../../dist/include/zlib -I../../../../dist/include/libpixman -I../../../../dist/include/cairo -I../../../../dist/include -I../../../../dist/include/nspr     -I../../../../dist/sdk/include    -fPIC  -Wall -W -Wno-unused -Wpointer-arith -Wcast-align -Wno-long-long -pedantic -pthread -pipe  -DNDEBUG -DTRIMMED -O   -include ../../../../mozilla-config.h -DMOZILLA_CLIENT -Wp,-MD,.deps/cairo-unicode.pp cairo-unicode.c
In file included from cairo-unicode.c:45:
./cairoint.h:142:1: warning: C++ style comments are not allowed in ISO C90
./cairoint.h:142:1: warning: (this will be reported only once per input file)
In file included from cairo-unicode.c:45:
./cairoint.h:257: warning: ISO C forbids forward references to ‘enum’ types
cairo-wideint.c
gcc -o cairo-wideint.o -c -fvisibility=hidden -DMOZILLA_INTERNAL_API -DOSTYPE=\"Linux2.6\" -DOSARCH=\"Linux\" -DBUILD_ID=0000000000  -I. -I./../../libpixman/src -I../../../../dist/include/png -I../../../../dist/include/zlib -I../../../../dist/include/libpixman -I../../../../dist/include/cairo -I../../../../dist/include -I../../../../dist/include/nspr     -I../../../../dist/sdk/include    -fPIC  -Wall -W -Wno-unused -Wpointer-arith -Wcast-align -Wno-long-long -pedantic -pthread -pipe  -DNDEBUG -DTRIMMED -O   -include ../../../../mozilla-config.h -DMOZILLA_CLIENT -Wp,-MD,.deps/cairo-wideint.pp cairo-wideint.c
In file included from cairo-wideint.c:37:
cairoint.h:142:1: warning: C++ style comments are not allowed in ISO C90
cairoint.h:142:1: warning: (this will be reported only once per input file)
In file included from cairo-wideint.c:37:
cairoint.h:257: warning: ISO C forbids forward references to ‘enum’ types
cairo-xlib-surface.c
gcc -o cairo-xlib-surface.o -c -fvisibility=hidden -DMOZILLA_INTERNAL_API -DOSTYPE=\"Linux2.6\" -DOSARCH=\"Linux\" -DBUILD_ID=0000000000  -I. -I./../../libpixman/src -I../../../../dist/include/png -I../../../../dist/include/zlib -I../../../../dist/include/libpixman -I../../../../dist/include/cairo -I../../../../dist/include -I../../../../dist/include/nspr     -I../../../../dist/sdk/include    -fPIC  -Wall -W -Wno-unused -Wpointer-arith -Wcast-align -Wno-long-long -pedantic -pthread -pipe  -DNDEBUG -DTRIMMED -O   -include ../../../../mozilla-config.h -DMOZILLA_CLIENT -Wp,-MD,.deps/cairo-xlib-surface.pp cairo-xlib-surface.c
In file included from cairo-xlib-surface.c:38:
cairoint.h:142:1: warning: C++ style comments are not allowed in ISO C90
cairoint.h:142:1: warning: (this will be reported only once per input file)
In file included from cairo-xlib-surface.c:38:
cairoint.h:257: warning: ISO C forbids forward references to ‘enum’ types
cairo-xlib-surface.c:1678: warning: missing initializer
cairo-xlib-surface.c:1678: warning: (near initialization for ‘cairo_xlib_surface_backend.flush’)
cairo-xlib-surface.c:2231: warning: ISO C does not allow extra ‘;’ outside of a function
cairo-xlib-screen.c
gcc -o cairo-xlib-screen.o -c -fvisibility=hidden -DMOZILLA_INTERNAL_API -DOSTYPE=\"Linux2.6\" -DOSARCH=\"Linux\" -DBUILD_ID=0000000000  -I. -I./../../libpixman/src -I../../../../dist/include/png -I../../../../dist/include/zlib -I../../../../dist/include/libpixman -I../../../../dist/include/cairo -I../../../../dist/include -I../../../../dist/include/nspr     -I../../../../dist/sdk/include    -fPIC  -Wall -W -Wno-unused -Wpointer-arith -Wcast-align -Wno-long-long -pedantic -pthread -pipe  -DNDEBUG -DTRIMMED -O   -include ../../../../mozilla-config.h -DMOZILLA_CLIENT -Wp,-MD,.deps/cairo-xlib-screen.pp cairo-xlib-screen.c
In file included from cairo-xlib-private.h:36,
                 from cairo-xlib-screen.c:57:
cairoint.h:142:1: warning: C++ style comments are not allowed in ISO C90
cairoint.h:142:1: warning: (this will be reported only once per input file)
In file included from cairo-xlib-private.h:36,
                 from cairo-xlib-screen.c:57:
cairoint.h:257: warning: ISO C forbids forward references to ‘enum’ types
cairo-xlib-screen.c:246: warning: ISO C does not allow extra ‘;’ outside of a function
cairo-ft-font.c
gcc -o cairo-ft-font.o -c -fvisibility=hidden -DMOZILLA_INTERNAL_API -DOSTYPE=\"Linux2.6\" -DOSARCH=\"Linux\" -DBUILD_ID=0000000000  -I. -I./../../libpixman/src -I../../../../dist/include/png -I../../../../dist/include/zlib -I../../../../dist/include/libpixman -I../../../../dist/include/cairo -I../../../../dist/include -I../../../../dist/include/nspr     -I../../../../dist/sdk/include    -fPIC  -Wall -W -Wno-unused -Wpointer-arith -Wcast-align -Wno-long-long -pedantic -pthread -pipe  -DNDEBUG -DTRIMMED -O   -include ../../../../mozilla-config.h -DMOZILLA_CLIENT -Wp,-MD,.deps/cairo-ft-font.pp cairo-ft-font.c
In file included from ./cairo-ft.h:47,
                 from cairo-ft-private.h:40,
                 from cairo-ft-font.c:42:
/usr/include/ft2build.h:56:38: error: freetype/config/ftheader.h: No such file or directory
In file included from cairo-ft-private.h:40,
                 from cairo-ft-font.c:42:
./cairo-ft.h:48:10: error: #include expects "FILENAME" or <FILENAME>
In file included from cairo-ft-private.h:40,
                 from cairo-ft-font.c:42:
./cairo-ft.h:60: error: expected ‘)’ before ‘face’
./cairo-ft.h:64: error: expected ‘=’, ‘,’, ‘;’, ‘asm’ or ‘__attribute__’ before ‘_moz_cairo_ft_scaled_font_lock_face’
In file included from cairo-ft-private.h:41,
                 from cairo-ft-font.c:42:
./cairoint.h:142:1: warning: C++ style comments are not allowed in ISO C90
./cairoint.h:142:1: warning: (this will be reported only once per input file)
In file included from cairo-ft-private.h:41,
                 from cairo-ft-font.c:42:
./cairoint.h:257: warning: ISO C forbids forward references to ‘enum’ types
In file included from cairo-ft-font.c:42:
cairo-ft-private.h:62: error: expected ‘=’, ‘,’, ‘;’, ‘asm’ or ‘__attribute__’ before ‘_cairo_ft_unscaled_font_lock_face’
In file included from cairo-ft-font.c:45:
/usr/include/fontconfig/fcfreetype.h:28:10: error: #include expects "FILENAME" or <FILENAME>
In file included from cairo-ft-font.c:45:
/usr/include/fontconfig/fcfreetype.h:37: error: expected ‘=’, ‘,’, ‘;’, ‘asm’ or ‘__attribute__’ before ‘FcFreeTypeCharIndex’
/usr/include/fontconfig/fcfreetype.h:40: error: expected ‘)’ before ‘face’
/usr/include/fontconfig/fcfreetype.h:43: error: expected ‘)’ before ‘face’
/usr/include/fontconfig/fcfreetype.h:46: error: expected declaration specifiers or ‘...’ before ‘FT_Face’
/usr/include/fontconfig/fcfreetype.h:49: error: expected ‘;’, ‘,’ or ‘)’ before ‘f’
/usr/include/fontconfig/fcfreetype.h:52: error: expected ‘;’, ‘,’ or ‘)’ before ‘face’
cairo-ft-font.c:48:10: error: #include expects "FILENAME" or <FILENAME>
cairo-ft-font.c:49:10: error: #include expects "FILENAME" or <FILENAME>
cairo-ft-font.c:50:10: error: #include expects "FILENAME" or <FILENAME>
cairo-ft-font.c:105: error: expected specifier-qualifier-list before ‘FT_Face’
cairo-ft-font.c:150: error: expected specifier-qualifier-list before ‘FT_Library’
cairo-ft-font.c:156: warning: ISO C does not allow extra ‘;’ outside of a function
cairo-ft-font.c: In function ‘_font_map_release_face_lock_held’:
cairo-ft-font.c:162: error: ‘cairo_ft_unscaled_font_t’ has no member named ‘face’
cairo-ft-font.c:163: warning: implicit declaration of function ‘FT_Done_Face’
cairo-ft-font.c:163: error: ‘cairo_ft_unscaled_font_t’ has no member named ‘face’
cairo-ft-font.c:164: error: ‘cairo_ft_unscaled_font_t’ has no member named ‘face’
cairo-ft-font.c:165: error: ‘cairo_ft_unscaled_font_t’ has no member named ‘have_scale’
cairo-ft-font.c:167: error: ‘cairo_ft_unscaled_font_map_t’ has no member named ‘num_open_faces’
cairo-ft-font.c: In function ‘_cairo_ft_unscaled_font_map_create’:
cairo-ft-font.c:191: warning: implicit declaration of function ‘FT_Init_FreeType’
cairo-ft-font.c:191: error: ‘cairo_ft_unscaled_font_map_t’ has no member named ‘ft_library’
cairo-ft-font.c:194: error: ‘cairo_ft_unscaled_font_map_t’ has no member named ‘num_open_faces’
cairo-ft-font.c: In function ‘_cairo_ft_unscaled_font_map_destroy’:
cairo-ft-font.c:238: warning: implicit declaration of function ‘FT_Done_FreeType’
cairo-ft-font.c:238: error: ‘cairo_ft_unscaled_font_map_t’ has no member named ‘ft_library’
cairo-ft-font.c: In function ‘_cairo_ft_unscaled_font_init_key’:
cairo-ft-font.c:281: error: ‘cairo_ft_unscaled_font_t’ has no member named ‘filename’
cairo-ft-font.c:282: error: ‘cairo_ft_unscaled_font_t’ has no member named ‘id’
cairo-ft-font.c: At top level:
cairo-ft-font.c:316: error: expected declaration specifiers or ‘...’ before ‘FT_Face’
cairo-ft-font.c: In function ‘_cairo_ft_unscaled_font_init’:
cairo-ft-font.c:321: error: ‘face’ undeclared (first use in this function)
cairo-ft-font.c:321: error: (Each undeclared identifier is reported only once
cairo-ft-font.c:321: error: for each function it appears in.)
cairo-ft-font.c:323: error: ‘cairo_ft_unscaled_font_t’ has no member named ‘face’
cairo-ft-font.c:324: error: ‘cairo_ft_unscaled_font_t’ has no member named ‘filename’
cairo-ft-font.c:325: error: ‘cairo_ft_unscaled_font_t’ has no member named ‘id’
cairo-ft-font.c:330: error: ‘cairo_ft_unscaled_font_t’ has no member named ‘face’
cairo-ft-font.c:339: error: ‘cairo_ft_unscaled_font_t’ has no member named ‘have_scale’
cairo-ft-font.c:340: error: ‘cairo_ft_unscaled_font_t’ has no member named ‘lock’
cairo-ft-font.c:342: error: ‘cairo_ft_unscaled_font_t’ has no member named ‘faces’
cairo-ft-font.c: In function ‘_cairo_ft_unscaled_font_fini’:
cairo-ft-font.c:369: error: ‘cairo_ft_unscaled_font_t’ has no member named ‘filename’
cairo-ft-font.c:370: error: ‘cairo_ft_unscaled_font_t’ has no member named ‘filename’
cairo-ft-font.c:371: error: ‘cairo_ft_unscaled_font_t’ has no member named ‘filename’
cairo-ft-font.c: In function ‘_cairo_ft_unscaled_font_keys_equal’:
cairo-ft-font.c:382: error: ‘cairo_ft_unscaled_font_t’ has no member named ‘filename’
cairo-ft-font.c:382: error: ‘cairo_ft_unscaled_font_t’ has no member named ‘filename’
cairo-ft-font.c:382: error: ‘cairo_ft_unscaled_font_t’ has no member named ‘filename’
cairo-ft-font.c:382: error: ‘cairo_ft_unscaled_font_t’ has no member named ‘filename’
cairo-ft-font.c:382: error: ‘cairo_ft_unscaled_font_t’ has no member named ‘filename’
cairo-ft-font.c:382: error: ‘cairo_ft_unscaled_font_t’ has no member named ‘filename’
cairo-ft-font.c:382: error: ‘cairo_ft_unscaled_font_t’ has no member named ‘filename’
cairo-ft-font.c:382: error: ‘cairo_ft_unscaled_font_t’ has no member named ‘filename’
cairo-ft-font.c:382: error: ‘cairo_ft_unscaled_font_t’ has no member named ‘filename’
cairo-ft-font.c:382: error: ‘cairo_ft_unscaled_font_t’ has no member named ‘filename’
cairo-ft-font.c:382: error: ‘cairo_ft_unscaled_font_t’ has no member named ‘filename’
cairo-ft-font.c:382: error: ‘cairo_ft_unscaled_font_t’ has no member named ‘filename’
cairo-ft-font.c:382: error: ‘cairo_ft_unscaled_font_t’ has no member named ‘filename’
cairo-ft-font.c:382: error: ‘cairo_ft_unscaled_font_t’ has no member named ‘filename’
cairo-ft-font.c:382: error: ‘cairo_ft_unscaled_font_t’ has no member named ‘filename’
cairo-ft-font.c:382: error: ‘cairo_ft_unscaled_font_t’ has no member named ‘filename’
cairo-ft-font.c:382: error: ‘cairo_ft_unscaled_font_t’ has no member named ‘filename’
cairo-ft-font.c:382: error: ‘cairo_ft_unscaled_font_t’ has no member named ‘filename’
cairo-ft-font.c:382: error: ‘cairo_ft_unscaled_font_t’ has no member named ‘filename’
cairo-ft-font.c:382: error: ‘cairo_ft_unscaled_font_t’ has no member named ‘filename’
cairo-ft-font.c:382: error: ‘cairo_ft_unscaled_font_t’ has no member named ‘filename’
cairo-ft-font.c:382: error: ‘cairo_ft_unscaled_font_t’ has no member named ‘filename’
cairo-ft-font.c:382: error: ‘cairo_ft_unscaled_font_t’ has no member named ‘filename’
cairo-ft-font.c:382: error: ‘cairo_ft_unscaled_font_t’ has no member named ‘filename’
cairo-ft-font.c:382: error: ‘cairo_ft_unscaled_font_t’ has no member named ‘filename’
cairo-ft-font.c:382: error: ‘cairo_ft_unscaled_font_t’ has no member named ‘filename’
cairo-ft-font.c:382: error: ‘cairo_ft_unscaled_font_t’ has no member named ‘filename’
cairo-ft-font.c:382: error: ‘cairo_ft_unscaled_font_t’ has no member named ‘filename’
cairo-ft-font.c:382: error: ‘cairo_ft_unscaled_font_t’ has no member named ‘filename’
cairo-ft-font.c:382: error: ‘cairo_ft_unscaled_font_t’ has no member named ‘filename’
cairo-ft-font.c:382: error: ‘cairo_ft_unscaled_font_t’ has no member named ‘filename’
cairo-ft-font.c:382: error: ‘cairo_ft_unscaled_font_t’ has no member named ‘filename’
cairo-ft-font.c:382: error: ‘cairo_ft_unscaled_font_t’ has no member named ‘filename’
cairo-ft-font.c:382: error: ‘cairo_ft_unscaled_font_t’ has no member named ‘filename’
cairo-ft-font.c:382: error: ‘cairo_ft_unscaled_font_t’ has no member named ‘filename’
cairo-ft-font.c:382: error: ‘cairo_ft_unscaled_font_t’ has no member named ‘filename’
cairo-ft-font.c:382: error: ‘cairo_ft_unscaled_font_t’ has no member named ‘filename’
cairo-ft-font.c:382: error: ‘cairo_ft_unscaled_font_t’ has no member named ‘filename’
cairo-ft-font.c:382: error: ‘cairo_ft_unscaled_font_t’ has no member named ‘filename’
cairo-ft-font.c:382: error: ‘cairo_ft_unscaled_font_t’ has no member named ‘filename’
cairo-ft-font.c:383: error: ‘cairo_ft_unscaled_font_t’ has no member named ‘id’
cairo-ft-font.c:383: error: ‘cairo_ft_unscaled_font_t’ has no member named ‘id’
cairo-ft-font.c: In function ‘_cairo_ft_unscaled_font_create_for_pattern’:
cairo-ft-font.c:426: error: too many arguments to function ‘_cairo_ft_unscaled_font_init’
cairo-ft-font.c: At top level:
cairo-ft-font.c:450: error: expected ‘)’ before ‘face’
cairo-ft-font.c: In function ‘_cairo_ft_unscaled_font_destroy’:
cairo-ft-font.c:480: error: ‘cairo_ft_unscaled_font_t’ has no member named ‘faces’
cairo-ft-font.c:480: error: ‘cairo_ft_unscaled_font_t’ has no member named ‘faces’
cairo-ft-font.c:481: error: ‘cairo_ft_unscaled_font_t’ has no member named ‘faces’
cairo-ft-font.c: In function ‘_has_unlocked_face’:
cairo-ft-font.c:504: error: ‘cairo_ft_unscaled_font_t’ has no member named ‘lock’
cairo-ft-font.c:504: error: ‘cairo_ft_unscaled_font_t’ has no member named ‘face’
cairo-ft-font.c: At top level:
cairo-ft-font.c:514: error: expected ‘=’, ‘,’, ‘;’, ‘asm’ or ‘__attribute__’ before ‘_cairo_ft_unscaled_font_lock_face’
cairo-ft-font.c: In function ‘_cairo_ft_unscaled_font_unlock_face’:
cairo-ft-font.c:567: error: ‘cairo_ft_unscaled_font_t’ has no member named ‘lock’
cairo-ft-font.c: In function ‘_cairo_ft_unscaled_font_set_scale’:
cairo-ft-font.c:609: error: ‘FT_Matrix’ undeclared (first use in this function)
cairo-ft-font.c:609: error: expected ‘;’ before ‘mat’
cairo-ft-font.c:610: error: ‘FT_UInt’ undeclared (first use in this function)
cairo-ft-font.c:610: error: expected ‘;’ before ‘pixel_width’
cairo-ft-font.c:611: error: ‘FT_Error’ undeclared (first use in this function)
cairo-ft-font.c:611: error: expected ‘;’ before ‘error’
cairo-ft-font.c:615: error: ‘cairo_ft_unscaled_font_t’ has no member named ‘have_scale’
cairo-ft-font.c:616: error: ‘cairo_ft_unscaled_font_t’ has no member named ‘current_scale’
cairo-ft-font.c:617: error: ‘cairo_ft_unscaled_font_t’ has no member named ‘current_scale’
cairo-ft-font.c:618: error: ‘cairo_ft_unscaled_font_t’ has no member named ‘current_scale’
cairo-ft-font.c:619: error: ‘cairo_ft_unscaled_font_t’ has no member named ‘current_scale’
cairo-ft-font.c:622: error: ‘cairo_ft_unscaled_font_t’ has no member named ‘have_scale’
cairo-ft-font.c:623: error: ‘cairo_ft_unscaled_font_t’ has no member named ‘current_scale’
cairo-ft-font.c:627: error: ‘cairo_ft_unscaled_font_t’ has no member named ‘x_scale’
cairo-ft-font.c:628: error: ‘cairo_ft_unscaled_font_t’ has no member named ‘y_scale’
cairo-ft-font.c:630: error: ‘mat’ undeclared (first use in this function)
cairo-ft-font.c:630: error: ‘FT_Fixed’ undeclared (first use in this function)
cairo-ft-font.c:635: error: ‘cairo_ft_unscaled_font_t’ has no member named ‘have_shape’
cairo-ft-font.c:640: warning: implicit declaration of function ‘FT_Set_Transform’
cairo-ft-font.c:640: error: ‘cairo_ft_unscaled_font_t’ has no member named ‘face’
cairo-ft-font.c:642: error: ‘cairo_ft_unscaled_font_t’ has no member named ‘face’
cairo-ft-font.c:642: error: ‘FT_FACE_FLAG_SCALABLE’ undeclared (first use in this function)
cairo-ft-font.c:652: error: ‘pixel_width’ undeclared (first use in this function)
cairo-ft-font.c:653: error: ‘pixel_height’ undeclared (first use in this function)
cairo-ft-font.c:655: error: ‘error’ undeclared (first use in this function)
cairo-ft-font.c:655: warning: implicit declaration of function ‘FT_Set_Char_Size’
cairo-ft-font.c:655: error: ‘cairo_ft_unscaled_font_t’ has no member named ‘face’
cairo-ft-font.c:666: error: ‘cairo_ft_unscaled_font_t’ has no member named ‘face’
cairo-ft-font.c:670: error: ‘cairo_ft_unscaled_font_t’ has no member named ‘face’
cairo-ft-font.c:686: warning: implicit declaration of function ‘FT_Set_Pixel_Sizes’
cairo-ft-font.c:686: error: ‘cairo_ft_unscaled_font_t’ has no member named ‘face’
cairo-ft-font.c:687: error: ‘cairo_ft_unscaled_font_t’ has no member named ‘face’
cairo-ft-font.c:688: error: ‘cairo_ft_unscaled_font_t’ has no member named ‘face’
cairo-ft-font.c: At top level:
cairo-ft-font.c:724: error: expected declaration specifiers or ‘...’ before ‘FT_Bitmap’
cairo-ft-font.c: In function ‘_get_bitmap_surface’:
cairo-ft-font.c:733: error: ‘bitmap’ undeclared (first use in this function)
cairo-ft-font.c:743: error: ‘FT_PIXEL_MODE_MONO’ undeclared (first use in this function)
cairo-ft-font.c:787: error: ‘FT_PIXEL_MODE_LCD’ undeclared (first use in this function)
cairo-ft-font.c:788: error: ‘FT_PIXEL_MODE_LCD_V’ undeclared (first use in this function)
cairo-ft-font.c:789: error: ‘FT_PIXEL_MODE_GRAY’ undeclared (first use in this function)
cairo-ft-font.c:892: error: ‘FT_PIXEL_MODE_GRAY2’ undeclared (first use in this function)
cairo-ft-font.c:893: error: ‘FT_PIXEL_MODE_GRAY4’ undeclared (first use in this function)
cairo-ft-font.c: At top level:
cairo-ft-font.c:936: error: expected ‘)’ before ‘face’
cairo-ft-font.c:1069: error: expected ‘)’ before ‘face’
cairo-ft-font.c: In function ‘_cairo_ft_unscaled_font_create_glyph’:
cairo-ft-font.c:1219: error: ‘FT_GlyphSlot’ undeclared (first use in this function)
cairo-ft-font.c:1219: error: expected ‘;’ before ‘glyphslot’
cairo-ft-font.c:1220: error: ‘FT_Face’ undeclared (first use in this function)
cairo-ft-font.c:1220: error: expected ‘;’ before ‘face’
cairo-ft-font.c:1221: error: ‘FT_Glyph_Metrics’ undeclared (first use in this function)
cairo-ft-font.c:1221: error: ‘metrics’ undeclared (first use in this function)
cairo-ft-font.c:1222: warning: ISO C90 forbids mixed declarations and code
cairo-ft-font.c:1225: error: ‘face’ undeclared (first use in this function)
cairo-ft-font.c:1225: warning: implicit declaration of function ‘_cairo_ft_unscaled_font_lock_face’
cairo-ft-font.c:1229: error: ‘glyphslot’ undeclared (first use in this function)
cairo-ft-font.c:1234: warning: implicit declaration of function ‘FT_Load_Glyph’
cairo-ft-font.c:1246: error: ‘cairo_ft_unscaled_font_t’ has no member named ‘x_scale’
cairo-ft-font.c:1249: error: ‘cairo_ft_unscaled_font_t’ has no member named ‘x_scale’
cairo-ft-font.c:1251: error: ‘cairo_ft_unscaled_font_t’ has no member named ‘y_scale’
cairo-ft-font.c:1254: error: ‘cairo_ft_unscaled_font_t’ has no member named ‘y_scale’
cairo-ft-font.c:1268: error: ‘FT_LOAD_NO_HINTING’ undeclared (first use in this function)
cairo-ft-font.c:1269: error: ‘FT_Pos’ undeclared (first use in this function)
cairo-ft-font.c:1269: error: expected ‘;’ before ‘x1’
cairo-ft-font.c:1270: error: expected ‘;’ before ‘y1’
cairo-ft-font.c:1271: error: expected ‘;’ before ‘advance’
cairo-ft-font.c:1273: error: ‘x1’ undeclared (first use in this function)
cairo-ft-font.c:1274: error: ‘x2’ undeclared (first use in this function)
cairo-ft-font.c:1276: error: ‘y2’ undeclared (first use in this function)
cairo-ft-font.c:1278: error: ‘advance’ undeclared (first use in this function)
cairo-ft-font.c:1281: error: pointer value used where a floating point value was expected
cairo-ft-font.c:1303: error: ‘FT_GLYPH_FORMAT_OUTLINE’ undeclared (first use in this function)
cairo-ft-font.c:1304: warning: implicit declaration of function ‘_render_glyph_outline’
cairo-ft-font.c:1306: warning: implicit declaration of function ‘_render_glyph_bitmap’
cairo-ft-font.c:1309: error: ‘cairo_ft_unscaled_font_t’ has no member named ‘have_shape’
cairo-ft-font.c:1310: error: ‘cairo_ft_unscaled_font_t’ has no member named ‘face’
cairo-ft-font.c:1310: error: ‘FT_FACE_FLAG_SCALABLE’ undeclared (first use in this function)
cairo-ft-font.c: In function ‘_get_pattern_load_flags’:
cairo-ft-font.c:1359: error: ‘FT_LOAD_NO_BITMAP’ undeclared (first use in this function)
cairo-ft-font.c:1361: error: ‘FT_LOAD_MONOCHROME’ undeclared (first use in this function)
cairo-ft-font.c:1373: error: ‘FT_LOAD_NO_HINTING’ undeclared (first use in this function)
cairo-ft-font.c:1379: error: ‘FT_LOAD_TARGET_LIGHT’ undeclared (first use in this function)
cairo-ft-font.c:1382: error: ‘FT_LOAD_TARGET_NORMAL’ undeclared (first use in this function)
cairo-ft-font.c:1406: error: ‘FT_LOAD_TARGET_LCD’ undeclared (first use in this function)
cairo-ft-font.c:1410: error: ‘FT_LOAD_TARGET_LCD_V’ undeclared (first use in this function)
cairo-ft-font.c:1422: error: ‘FT_LOAD_FORCE_AUTOHINT’ undeclared (first use in this function)
cairo-ft-font.c:1429: error: ‘FT_LOAD_VERTICAL_LAYOUT’ undeclared (first use in this function)
cairo-ft-font.c: In function ‘_get_options_load_flags’:
cairo-ft-font.c:1458: error: ‘FT_LOAD_MONOCHROME’ undeclared (first use in this function)
cairo-ft-font.c:1465: error: ‘FT_LOAD_TARGET_LCD’ undeclared (first use in this function)
cairo-ft-font.c:1469: error: ‘FT_LOAD_TARGET_LCD_V’ undeclared (first use in this function)
cairo-ft-font.c:1475: error: ‘FT_LOAD_NO_BITMAP’ undeclared (first use in this function)
cairo-ft-font.c:1482: error: ‘FT_LOAD_NO_HINTING’ undeclared (first use in this function)
cairo-ft-font.c:1486: error: ‘FT_LOAD_TARGET_LIGHT’ undeclared (first use in this function)
cairo-ft-font.c:1490: error: ‘FT_LOAD_TARGET_NORMAL’ undeclared (first use in this function)
cairo-ft-font.c: In function ‘_cairo_ft_scaled_font_text_to_glyphs’:
cairo-ft-font.c:1659: error: ‘FT_Face’ undeclared (first use in this function)
cairo-ft-font.c:1659: error: expected ‘;’ before ‘face’
cairo-ft-font.c:1660: warning: ISO C90 forbids mixed declarations and code
cairo-ft-font.c:1676: error: ‘face’ undeclared (first use in this function)
cairo-ft-font.c:1676: warning: implicit declaration of function ‘_moz_cairo_ft_scaled_font_lock_face’
cairo-ft-font.c:1688: warning: comparison between signed and unsigned
cairo-ft-font.c:1690: warning: implicit declaration of function ‘FT_Get_Char_Index’
cairo-ft-font.c: In function ‘_cairo_ft_scaled_font_font_extents’:
cairo-ft-font.c:1724: error: ‘FT_Face’ undeclared (first use in this function)
cairo-ft-font.c:1724: error: expected ‘;’ before ‘face’
cairo-ft-font.c:1725: error: ‘FT_Size_Metrics’ undeclared (first use in this function)
cairo-ft-font.c:1725: error: ‘metrics’ undeclared (first use in this function)
cairo-ft-font.c:1727: error: ‘face’ undeclared (first use in this function)
cairo-ft-font.c:1743: error: ‘cairo_ft_unscaled_font_t’ has no member named ‘x_scale’
cairo-ft-font.c:1746: error: ‘cairo_ft_unscaled_font_t’ has no member named ‘x_scale’
cairo-ft-font.c:1748: error: ‘cairo_ft_unscaled_font_t’ has no member named ‘y_scale’
cairo-ft-font.c:1751: error: ‘cairo_ft_unscaled_font_t’ has no member named ‘y_scale’
cairo-ft-font.c: At top level:
cairo-ft-font.c:2084: error: expected ‘)’ before ‘*’ token
cairo-ft-font.c:2099: error: expected ‘)’ before ‘*’ token
cairo-ft-font.c:2113: error: expected ‘)’ before ‘*’ token
cairo-ft-font.c:2146: error: expected ‘)’ before ‘*’ token
cairo-ft-font.c: In function ‘_cairo_ft_scaled_font_glyph_path’:
cairo-ft-font.c:2179: error: ‘FT_GlyphSlot’ undeclared (first use in this function)
cairo-ft-font.c:2179: error: expected ‘;’ before ‘glyph’
cairo-ft-font.c:2180: error: ‘FT_Face’ undeclared (first use in this function)
cairo-ft-font.c:2180: error: expected ‘;’ before ‘face’
cairo-ft-font.c:2181: error: ‘FT_Error’ undeclared (first use in this function)
cairo-ft-font.c:2181: error: expected ‘;’ before ‘error’
cairo-ft-font.c:2182: error: ‘FT_Outline_Funcs’ undeclared (first use in this function)
cairo-ft-font.c:2182: error: expected ‘;’ before ‘outline_funcs’
cairo-ft-font.c:2191: error: ‘face’ undeclared (first use in this function)
cairo-ft-font.c:2195: error: ‘glyph’ undeclared (first use in this function)
cairo-ft-font.c:2199: error: ‘FT_Matrix’ undeclared (first use in this function)
cairo-ft-font.c:2199: error: expected ‘;’ before ‘invert_y’
cairo-ft-font.c:2204: error: ‘error’ undeclared (first use in this function)
cairo-ft-font.c:2204: error: ‘cairo_ft_unscaled_font_t’ has no member named ‘face’
cairo-ft-font.c:2205: error: ‘FT_LOAD_NO_BITMAP’ undeclared (first use in this function)
cairo-ft-font.c:2210: error: ‘ft_glyph_format_bitmap’ undeclared (first use in this function)
cairo-ft-font.c:2223: warning: implicit declaration of function ‘FT_Outline_Transform’
cairo-ft-font.c:2223: error: ‘invert_y’ undeclared (first use in this function)
cairo-ft-font.c:2224: warning: implicit declaration of function ‘FT_Outline_Translate’
cairo-ft-font.c:2225: error: ‘FT_F26Dot6’ undeclared (first use in this function)
cairo-ft-font.c:2227: warning: implicit declaration of function ‘FT_Outline_Decompose’
cairo-ft-font.c:2227: error: ‘outline_funcs’ undeclared (first use in this function)
cairo-ft-font.c: In function ‘_cairo_ft_font_face_destroy’:
cairo-ft-font.c:2289: error: ‘cairo_ft_unscaled_font_t’ has no member named ‘faces’
cairo-ft-font.c:2297: error: ‘cairo_ft_unscaled_font_t’ has no member named ‘faces’
cairo-ft-font.c: In function ‘_cairo_ft_font_face_create’:
cairo-ft-font.c:2354: error: ‘cairo_ft_unscaled_font_t’ has no member named ‘faces’
cairo-ft-font.c:2372: error: ‘cairo_ft_unscaled_font_t’ has no member named ‘faces’
cairo-ft-font.c:2373: error: ‘cairo_ft_unscaled_font_t’ has no member named ‘faces’
cairo-ft-font.c: At top level:
cairo-ft-font.c:2544: error: expected ‘)’ before ‘face’
cairo-ft-font.c:2597: error: expected ‘=’, ‘,’, ‘;’, ‘asm’ or ‘__attribute__’ before ‘_moz_cairo_ft_scaled_font_lock_face’
make[4]: *** [cairo-ft-font.o] Error 1
make[4]: Leaving directory `/root/Desktop/iceweasel/iceweasel-2.0.0.4/gfx/cairo/cairo/src'
make[3]: *** [libs] Error 2
make[3]: Leaving directory `/root/Desktop/iceweasel/iceweasel-2.0.0.4/gfx/cairo'
make[2]: *** [libs] Error 2
make[2]: Leaving directory `/root/Desktop/iceweasel/iceweasel-2.0.0.4/gfx'
make[1]: *** [tier_9] Error 2
make[1]: Leaving directory `/root/Desktop/iceweasel/iceweasel-2.0.0.4'
make: *** [default] Error 2