All pastes #568904 Raw Edit

Wikidiff2

public text v1 · immutable
·published 2007-06-15 21:39 UTC
rendered paste body
1>------ Build started: Project: Wikidiff2, Configuration: Release Win32 ------
1>Compiling...
1>dllcore.cpp
1>.\dllcore.cpp(8) : error C2146: syntax error : missing ';' before identifier 'APIENTRY'
1>.\dllcore.cpp(8) : error C4430: missing type specifier - int assumed. Note: C++ does not support default-int
1>.\dllcore.cpp(8) : error C2146: syntax error : missing ';' before identifier 'DllMain'
1>.\dllcore.cpp(8) : error C4430: missing type specifier - int assumed. Note: C++ does not support default-int
1>.\dllcore.cpp(8) : error C2065: 'HMODULE' : undeclared identifier
1>.\dllcore.cpp(8) : error C2146: syntax error : missing ')' before identifier 'hModule'
1>.\dllcore.cpp(8) : error C4430: missing type specifier - int assumed. Note: C++ does not support default-int
1>.\dllcore.cpp(11) : error C2059: syntax error : ')'
1>.\dllcore.cpp(12) : error C2143: syntax error : missing ';' before '{'
1>.\dllcore.cpp(12) : error C2447: '{' : missing function header (old-style formal list?)
1>Build log was saved at "file://c:\cygwin\usr\src\autowikibrowser\AWB\Wikidiff2\Release\BuildLog.htm"
1>Wikidiff2 - 10 error(s), 0 warning(s)
========== Build: 0 succeeded, 1 failed, 0 up-to-date, 0 skipped ==========