All pastes #568574 Raw Edit

ventonegro

public text v1 · immutable
·published 2007-06-15 16:30 UTC
rendered paste body
Machine: i686
Release: 1.0.10(0.46/3/2)
System: MINGW32_NT-5.1
checking for a usable C compiler...checking for compiler warnings.../mingw/bin/cc   -Wall -Werror -o conftest conftest.c 
ok
checking for floating point types.../mingw/bin/cc  -Wall -Werror  -o conftest conftest.c 
ok
checking __bounded__ attribute.../mingw/bin/cc  -Wall -Werror  -o conftest conftest.c 
conftest.c:1: warning: `__bounded__' attribute directive ignored

failed (0)
checking __format__ attribute.../mingw/bin/cc  -Wall -Werror  -o conftest conftest.c 
ok
checking __nonnull__ attribute.../mingw/bin/cc  -Wall -Werror -Wall -Werror -o conftest conftest.c
ok
checking for long double.../mingw/bin/cc  -Wall -Werror -o conftest conftest.c
ok
checking for cygwin environment.../mingw/bin/cc  -Wall -Werror -mcygwin -o conftest conftest.c
ok
checking for mingw environment.../mingw/bin/cc  -Wall -Werror  -o conftest conftest.c
ok
checking for <sys/types.h>.../mingw/bin/cc  -mno-cygwin -Wall -Werror  -o conftest conftest.c 
ok
checking for unsigned typedefs.../mingw/bin/cc  -mno-cygwin -Wall -Werror  -o conftest conftest.c 
conftest.c: In function `main':

conftest.c:3: error: `Uchar' undeclared (first use in this function)

conftest.c:3: error: (Each undeclared identifier is reported only once

conftest.c:3: error: for each function it appears in.)

conftest.c:3: error: syntax error before "foo"

conftest.c:4: error: `Uint' undeclared (first use in this function)

conftest.c:5: error: `Ulong' undeclared (first use in this function)

conftest.c:6: error: `foo' undeclared (first use in this function)

conftest.c:6: error: `bar' undeclared (first use in this function)

conftest.c:6: error: `baz' undeclared (first use in this function)

failed (0)
checking for BSD-style __progname.../mingw/bin/cc  -mno-cygwin -Wall -Werror -o conftest conftest.c
C:/DOCUME~1/asandro/CONFIG~1/Temp/ccgRaaaa.o:conftest.c:(.text+0x2b): undefined reference to `__progname'

collect2: ld returned 1 exit status

-> failed (0)
checking for free(NULL) is a no-op.../mingw/bin/cc  -mno-cygwin -Wall -Werror  -o conftest conftest.c 
yes
checking for the C math library.../mingw/bin/cc  -mno-cygwin -Wall -Werror  -mno-cygwin -o conftest conftest.c -lm
ok
checking for a gethostname() function.../mingw/bin/cc  -mno-cygwin -Wall -Werror -o conftest conftest.c
conftest.c: In function `main':

conftest.c:10: warning: implicit declaration of function `gethostname'

-> failed (0)
checking for a getpwuid() function.../mingw/bin/cc  -mno-cygwin -Wall -Werror -o conftest conftest.c
conftest.c:2:17: pwd.h: No such file or directory

conftest.c: In function `main':

conftest.c:8: error: `uid_t' undeclared (first use in this function)

conftest.c:8: error: (Each undeclared identifier is reported only once

conftest.c:8: error: for each function it appears in.)

conftest.c:8: error: syntax error before "uid"

conftest.c:10: warning: implicit declaration of function `getpwuid'

conftest.c:10: error: `uid' undeclared (first use in this function)

conftest.c:10: warning: assignment makes pointer from integer without a cast

-> failed (0)
checking for a getuid() function.../mingw/bin/cc  -mno-cygwin -Wall -Werror -o conftest conftest.c
conftest.c: In function `main':

conftest.c:7: error: `uid_t' undeclared (first use in this function)

conftest.c:7: error: (Each undeclared identifier is reported only once

conftest.c:7: error: for each function it appears in.)

conftest.c:7: error: syntax error before "uid"

conftest.c:9: error: `uid' undeclared (first use in this function)

conftest.c:9: warning: implicit declaration of function `getuid'

-> failed (0)
checking for a getenv() function.../mingw/bin/cc  -mno-cygwin -Wall -Werror -o conftest conftest.c
ok
checking for setenv() and unsetenv() functions.../mingw/bin/cc  -mno-cygwin -Wall -Werror -o conftest conftest.c
conftest.c: In function `main':

conftest.c:5: warning: implicit declaration of function `setenv'

conftest.c:6: warning: implicit declaration of function `unsetenv'

-> failed (0)
checking for a strsep() function.../mingw/bin/cc  -mno-cygwin -Wall -Werror -o conftest conftest.c
conftest.c: In function `main':

conftest.c:5: warning: implicit declaration of function `strsep'

-> failed (0)
checking for a strlcat() function.../mingw/bin/cc  -mno-cygwin -Wall -Werror -o conftest conftest.c
conftest.c: In function `main':

conftest.c:5: warning: implicit declaration of function `strlcat'

-> failed (0)
checking for a strlcpy() function.../mingw/bin/cc  -mno-cygwin -Wall -Werror -o conftest conftest.c
conftest.c: In function `main':

conftest.c:5: warning: implicit declaration of function `strlcpy'

-> failed (0)
checking for an asprintf() function.../mingw/bin/cc  -mno-cygwin -Wall -Werror -o conftest conftest.c
conftest.c: In function `main':

conftest.c:8: warning: implicit declaration of function `asprintf'

conftest.c:9: warning: implicit declaration of function `free'

-> failed (0)
checking for a vasprintf() function.../mingw/bin/cc  -mno-cygwin -Wall -Werror -o conftest conftest.c
conftest.c: In function `testprintf':

conftest.c:11: warning: implicit declaration of function `vasprintf'

conftest.c:16: warning: implicit declaration of function `free'

-> failed (0)
checking for a snprintf() function.../mingw/bin/cc  -mno-cygwin -Wall -Werror -o conftest conftest.c
ok
checking for a vsnprintf() function.../mingw/bin/cc  -mno-cygwin -Wall -Werror -o conftest conftest.c
ok
checking for a setlocale() function.../mingw/bin/cc  -mno-cygwin -Wall -Werror -o conftest conftest.c
ok
checking for the arc4random() random number generator.../mingw/bin/cc  -mno-cygwin -Wall -Werror -o conftest conftest.c
conftest.c: In function `main':

conftest.c:6: error: `u_int32_t' undeclared (first use in this function)

conftest.c:6: error: (Each undeclared identifier is reported only once

conftest.c:6: error: for each function it appears in.)

conftest.c:6: error: syntax error before "i"

conftest.c:8: error: `i' undeclared (first use in this function)

conftest.c:8: warning: implicit declaration of function `arc4random'

-> failed (0)
checking for MD5 functions.../mingw/bin/cc  -mno-cygwin -Wall -Werror -o conftest conftest.c
conftest.c:2:17: md5.h: No such file or directory

conftest.c: In function `main':

conftest.c:7: error: `MD5_CTX' undeclared (first use in this function)

conftest.c:7: error: (Each undeclared identifier is reported only once

conftest.c:7: error: for each function it appears in.)

conftest.c:7: error: syntax error before "md5"

conftest.c:9: warning: implicit declaration of function `MD5Init'

conftest.c:9: error: `md5' undeclared (first use in this function)

-> failed (0)
checking for SHA1 functions.../mingw/bin/cc  -mno-cygwin -Wall -Werror -o conftest conftest.c
conftest.c:2:18: sha1.h: No such file or directory

conftest.c: In function `main':

conftest.c:7: error: `SHA1_CTX' undeclared (first use in this function)

conftest.c:7: error: (Each undeclared identifier is reported only once

conftest.c:7: error: for each function it appears in.)

conftest.c:7: error: syntax error before "sha1"

conftest.c:9: warning: implicit declaration of function `SHA1Init'

conftest.c:9: error: `sha1' undeclared (first use in this function)

-> failed (0)
checking for RMD160 functions.../mingw/bin/cc  -mno-cygwin -Wall -Werror -o conftest conftest.c
conftest.c:2:20: rmd160.h: No such file or directory

conftest.c: In function `main':

conftest.c:7: error: `RMD160_CTX' undeclared (first use in this function)

conftest.c:7: error: (Each undeclared identifier is reported only once

conftest.c:7: error: for each function it appears in.)

conftest.c:7: error: syntax error before "rmd160"

conftest.c:9: warning: implicit declaration of function `RMD160Init'

conftest.c:9: error: `rmd160' undeclared (first use in this function)

-> failed (0)
checking for POSIX threads.../mingw/bin/cc  -mno-cygwin -Wall -Werror  -o conftest conftest.c -lpthread
conftest.c:1:21: pthread.h: No such file or directory

conftest.c: In function `start_routine':

conftest.c:3: error: `NULL' undeclared (first use in this function)

conftest.c:3: error: (Each undeclared identifier is reported only once

conftest.c:3: error: for each function it appears in.)

conftest.c: In function `main':

conftest.c:6: error: `pthread_mutex_t' undeclared (first use in this function)

conftest.c:6: error: syntax error before "mutex"

conftest.c:7: error: `pthread_t' undeclared (first use in this function)

conftest.c:8: warning: implicit declaration of function `pthread_mutex_init'

conftest.c:8: error: `mutex' undeclared (first use in this function)

conftest.c:8: error: `NULL' undeclared (first use in this function)

conftest.c:9: warning: implicit declaration of function `pthread_mutex_lock'

conftest.c:10: warning: implicit declaration of function `pthread_mutex_unlock'

conftest.c:11: warning: implicit declaration of function `pthread_mutex_destroy'

conftest.c:12: warning: implicit declaration of function `pthread_create'

conftest.c:12: error: `thread' undeclared (first use in this function)

failed (0)
/mingw/bin/cc  -mno-cygwin -Wall -Werror  -o conftest conftest.c -pthread
conftest.c:1:21: pthread.h: No such file or directory

conftest.c: In function `start_routine':

conftest.c:3: error: `NULL' undeclared (first use in this function)

conftest.c:3: error: (Each undeclared identifier is reported only once

conftest.c:3: error: for each function it appears in.)

conftest.c: In function `main':

conftest.c:6: error: `pthread_mutex_t' undeclared (first use in this function)

conftest.c:6: error: syntax error before "mutex"

conftest.c:7: error: `pthread_t' undeclared (first use in this function)

conftest.c:8: warning: implicit declaration of function `pthread_mutex_init'

conftest.c:8: error: `mutex' undeclared (first use in this function)

conftest.c:8: error: `NULL' undeclared (first use in this function)

conftest.c:9: warning: implicit declaration of function `pthread_mutex_lock'

conftest.c:10: warning: implicit declaration of function `pthread_mutex_unlock'

conftest.c:11: warning: implicit declaration of function `pthread_mutex_destroy'

conftest.c:12: warning: implicit declaration of function `pthread_create'

conftest.c:12: error: `thread' undeclared (first use in this function)

cc.exe: unrecognized option `-pthread'

failed (0)
checking for the X/Open Threads Extension.../mingw/bin/cc  -mno-cygwin -Wall -Werror -U_XOPEN_SOURCE -D_XOPEN_SOURCE=600 -o conftest conftest.c -lpthread
conftest.c:1:21: pthread.h: No such file or directory

conftest.c: In function `main':

conftest.c:6: error: `pthread_mutex_t' undeclared (first use in this function)

conftest.c:6: error: (Each undeclared identifier is reported only once

conftest.c:6: error: for each function it appears in.)

conftest.c:6: error: syntax error before "mutex"

conftest.c:7: error: `pthread_mutexattr_t' undeclared (first use in this function)

conftest.c:8: warning: implicit declaration of function `pthread_mutexattr_settype'

conftest.c:8: error: `mutexattr' undeclared (first use in this function)

conftest.c:8: error: `PTHREAD_MUTEX_RECURSIVE' undeclared (first use in this function)

conftest.c:9: warning: implicit declaration of function `pthread_mutex_init'

conftest.c:9: error: `mutex' undeclared (first use in this function)

failed (0)
checking for PTHREAD_MUTEX_RECURSIVE.../mingw/bin/cc  -mno-cygwin -Wall -Werror  -o conftest conftest.c -pthread
conftest.c:1:21: pthread.h: No such file or directory

conftest.c: In function `main':

conftest.c:5: error: `pthread_mutex_t' undeclared (first use in this function)

conftest.c:5: error: (Each undeclared identifier is reported only once

conftest.c:5: error: for each function it appears in.)

conftest.c:5: error: syntax error before "mutex"

conftest.c:6: error: `pthread_mutexattr_t' undeclared (first use in this function)

conftest.c:7: warning: implicit declaration of function `pthread_mutexattr_settype'

conftest.c:7: error: `mutexattr' undeclared (first use in this function)

conftest.c:7: error: `PTHREAD_MUTEX_RECURSIVE' undeclared (first use in this function)

conftest.c:8: warning: implicit declaration of function `pthread_mutex_init'

conftest.c:8: error: `mutex' undeclared (first use in this function)

cc.exe: unrecognized option `-pthread'

failed (0)
checking for PTHREAD_MUTEX_RECURSIVE_NP.../mingw/bin/cc  -mno-cygwin -Wall -Werror  -o conftest conftest.c -pthread
conftest.c:1:21: pthread.h: No such file or directory

conftest.c: In function `main':

conftest.c:5: error: `pthread_mutex_t' undeclared (first use in this function)

conftest.c:5: error: (Each undeclared identifier is reported only once

conftest.c:5: error: for each function it appears in.)

conftest.c:5: error: syntax error before "mutex"

conftest.c:6: error: `pthread_mutexattr_t' undeclared (first use in this function)

conftest.c:7: warning: implicit declaration of function `pthread_mutexattr_settype'

conftest.c:7: error: `mutexattr' undeclared (first use in this function)

conftest.c:7: error: `PTHREAD_MUTEX_RECURSIVE_NP' undeclared (first use in this function)

conftest.c:8: warning: implicit declaration of function `pthread_mutex_init'

conftest.c:8: error: `mutex' undeclared (first use in this function)

cc.exe: unrecognized option `-pthread'

failed (0)
checking for SDL (http://www.libsdl.org)...yes
checking whether SDL works.../mingw/bin/cc  -mno-cygwin -I/c/downloads/GUI/agar/agar-1.2 -Wall -Werror -I/c/devtools/include/SDL -D_GNU_SOURCE=1 -Dmain=SDL_main -o conftest conftest.c -L/c/devtools/lib -lSDLmain -lSDL -mwindows
/mingw/lib/libmingw32.a(main.o):main.c:(.text+0x106): undefined reference to `WinMain@16'

collect2: ld returned 1 exit status

failed (0)
checking for SDL cpuinfo functions.../mingw/bin/cc  -mno-cygwin -I/c/downloads/GUI/agar/agar-1.2 -Wall -Werror -I/c/devtools/include/SDL -D_GNU_SOURCE=1 -Dmain=SDL_main -o conftest conftest.c -L/c/devtools/lib -lSDLmain -lSDL -mwindows
/mingw/lib/libmingw32.a(main.o):main.c:(.text+0x106): undefined reference to `WinMain@16'

collect2: ld returned 1 exit status

failed (0)