All pastes #56685 Raw Edit

Someone

public text v1 · immutable
#56685 ·published 2006-05-17 21:15 UTC
rendered paste body
This file contains any messages produced by compilers while
running configure, to aid debugging if configure makes a mistake.

It was created by configure, which was
generated by GNU Autoconf 2.59.  Invocation command line was

  $ ./configure 

## --------- ##
## Platform. ##
## --------- ##

hostname = c-69-253-236-235
uname -m = i686
uname -r = 2.6.15-1-486
uname -s = Linux
uname -v = #2 Mon Mar 6 15:19:16 UTC 2006

/usr/bin/uname -p = unknown
/bin/uname -X     = unknown

/bin/arch              = i686
/usr/bin/arch -k       = unknown
/usr/convex/getsysinfo = unknown
hostinfo               = unknown
/bin/machine           = unknown
/usr/bin/oslevel       = unknown
/bin/universe          = unknown

PATH: /usr/local/bin
PATH: /usr/bin
PATH: /bin
PATH: /usr/bin/X11
PATH: /usr/games


## ----------- ##
## Core tests. ##
## ----------- ##

configure:1564: checking build system type
configure:1582: result: i686-pc-linux-gnu
configure:1590: checking host system type
configure:1604: result: i686-pc-linux-gnu
configure:1612: checking target system type
configure:1626: result: i686-pc-linux-gnu
configure:1654: checking for a BSD-compatible install
configure:1709: result: /usr/bin/install -c
configure:1720: checking whether build environment is sane
configure:1763: result: yes
configure:1828: checking for gawk
configure:1857: result: no
configure:1828: checking for mawk
configure:1844: found /usr/bin/mawk
configure:1854: result: mawk
configure:1864: checking whether make sets $(MAKE)
configure:1884: result: yes
configure:2068: checking for whoami
configure:2084: found /usr/bin/whoami
configure:2095: result: yes
configure:2169: checking whether make sets $(MAKE)
configure:2189: result: yes
configure:2244: checking for gcc
configure:2260: found /usr/bin/gcc
configure:2270: result: gcc
configure:2514: checking for C compiler version
configure:2517: gcc --version </dev/null >&5
gcc (GCC) 4.0.3 (Debian 4.0.3-1)
Copyright (C) 2006 Free Software Foundation, Inc.
This is free software; see the source for copying conditions.  There is NO
warranty; not even for MERCHANTABILITY or FITNESS FOR A PARTICULAR PURPOSE.

configure:2520: $? = 0
configure:2522: gcc -v </dev/null >&5
Using built-in specs.
Target: i486-linux-gnu
Configured with: ../src/configure -v --enable-languages=c,c++,java,f95,objc,ada,treelang --prefix=/usr --enable-shared --with-system-zlib --libexecdir=/usr/lib --without-included-gettext --enable-threads=posix --enable-nls --program-suffix=-4.0 --enable-__cxa_atexit --enable-clocale=gnu --enable-libstdcxx-debug --enable-java-awt=gtk-default --enable-gtk-cairo --with-java-home=/usr/lib/jvm/java-1.4.2-gcj-4.0-1.4.2.0/jre --enable-mpfr --disable-werror --with-tune=i686 --enable-checking=release i486-linux-gnu
Thread model: posix
gcc version 4.0.3 (Debian 4.0.3-1)
configure:2525: $? = 0
configure:2527: gcc -V </dev/null >&5
gcc: '-V' option must have argument
configure:2530: $? = 1
configure:2553: checking for C compiler default output file name
configure:2556: gcc   -lpthread conftest.c  >&5
configure:2559: $? = 0
configure:2605: result: a.out
configure:2610: checking whether the C compiler works
configure:2616: ./a.out
configure:2619: $? = 0
configure:2636: result: yes
configure:2643: checking whether we are cross compiling
configure:2645: result: no
configure:2648: checking for suffix of executables
configure:2650: gcc -o conftest   -lpthread conftest.c  >&5
configure:2653: $? = 0
configure:2678: result: 
configure:2684: checking for suffix of object files
configure:2705: gcc -c   conftest.c >&5
configure:2708: $? = 0
configure:2730: result: o
configure:2734: checking whether we are using the GNU C compiler
configure:2758: gcc -c   conftest.c >&5
configure:2764: $? = 0
configure:2767: test -z 			 || test ! -s conftest.err
configure:2770: $? = 0
configure:2773: test -s conftest.o
configure:2776: $? = 0
configure:2789: result: yes
configure:2795: checking whether gcc accepts -g
configure:2816: gcc -c -g  conftest.c >&5
configure:2822: $? = 0
configure:2825: test -z 			 || test ! -s conftest.err
configure:2828: $? = 0
configure:2831: test -s conftest.o
configure:2834: $? = 0
configure:2845: result: yes
configure:2862: checking for gcc option to accept ANSI C
configure:2932: gcc  -c -g -O2  conftest.c >&5
configure:2938: $? = 0
configure:2941: test -z 			 || test ! -s conftest.err
configure:2944: $? = 0
configure:2947: test -s conftest.o
configure:2950: $? = 0
configure:2968: result: none needed
configure:2986: gcc -c -g -O2  conftest.c >&5
conftest.c:2: error: syntax error before 'me'
configure:2992: $? = 1
configure: failed program was:
| #ifndef __cplusplus
|   choke me
| #endif
configure:3133: checking for style of include used by make
configure:3161: result: GNU
configure:3189: checking dependency style of gcc
configure:3279: result: gcc3
configure:3348: checking for g++
configure:3377: result: no
configure:3348: checking for c++
configure:3377: result: no
configure:3348: checking for gpp
configure:3377: result: no
configure:3348: checking for aCC
configure:3377: result: no
configure:3348: checking for CC
configure:3377: result: no
configure:3348: checking for cxx
configure:3377: result: no
configure:3348: checking for cc++
configure:3377: result: no
configure:3348: checking for cl
configure:3377: result: no
configure:3348: checking for FCC
configure:3377: result: no
configure:3348: checking for KCC
configure:3377: result: no
configure:3348: checking for RCC
configure:3377: result: no
configure:3348: checking for xlC_r
configure:3377: result: no
configure:3348: checking for xlC
configure:3377: result: no
configure:3390: checking for C++ compiler version
configure:3393: g++ --version </dev/null >&5
./configure: line 3394: g++: command not found
configure:3396: $? = 127
configure:3398: g++ -v </dev/null >&5
./configure: line 3399: g++: command not found
configure:3401: $? = 127
configure:3403: g++ -V </dev/null >&5
./configure: line 3404: g++: command not found
configure:3406: $? = 127
configure:3409: checking whether we are using the GNU C++ compiler
configure:3433: g++ -c   conftest.cc >&5
./configure: line 3434: g++: command not found
configure:3439: $? = 127
configure: failed program was:
| /* confdefs.h.  */
| 
| #define PACKAGE_NAME ""
| #define PACKAGE_TARNAME ""
| #define PACKAGE_VERSION ""
| #define PACKAGE_STRING ""
| #define PACKAGE_BUGREPORT ""
| #define PACKAGE "bzflag"
| #define VERSION "2.0.8"
| #define BZ_BUILD_OS "linux-gnu"
| #define BZ_BUILD_USER "tropican8"
| #define BUILD_REGEX 1
| /* end confdefs.h.  */
| 
| int
| main ()
| {
| #ifndef __GNUC__
|        choke me
| #endif
| 
|   ;
|   return 0;
| }
configure:3464: result: no
configure:3470: checking whether g++ accepts -g
configure:3491: g++ -c -g  conftest.cc >&5
./configure: line 3492: g++: command not found
configure:3497: $? = 127
configure: failed program was:
| /* confdefs.h.  */
| 
| #define PACKAGE_NAME ""
| #define PACKAGE_TARNAME ""
| #define PACKAGE_VERSION ""
| #define PACKAGE_STRING ""
| #define PACKAGE_BUGREPORT ""
| #define PACKAGE "bzflag"
| #define VERSION "2.0.8"
| #define BZ_BUILD_OS "linux-gnu"
| #define BZ_BUILD_USER "tropican8"
| #define BUILD_REGEX 1
| /* end confdefs.h.  */
| 
| int
| main ()
| {
| 
|   ;
|   return 0;
| }
configure:3520: result: no
configure:3562: g++ -c   conftest.cc >&5
./configure: line 3563: g++: command not found
configure:3568: $? = 127
configure: failed program was:
| /* confdefs.h.  */
| 
| #define PACKAGE_NAME ""
| #define PACKAGE_TARNAME ""
| #define PACKAGE_VERSION ""
| #define PACKAGE_STRING ""
| #define PACKAGE_BUGREPORT ""
| #define PACKAGE "bzflag"
| #define VERSION "2.0.8"
| #define BZ_BUILD_OS "linux-gnu"
| #define BZ_BUILD_USER "tropican8"
| #define BUILD_REGEX 1
| /* end confdefs.h.  */
| 
| #include <stdlib.h>
| int
| main ()
| {
| exit (42);
|   ;
|   return 0;
| }
configure:3562: g++ -c   conftest.cc >&5
./configure: line 3563: g++: command not found
configure:3568: $? = 127
configure: failed program was:
| /* confdefs.h.  */
| 
| #define PACKAGE_NAME ""
| #define PACKAGE_TARNAME ""
| #define PACKAGE_VERSION ""
| #define PACKAGE_STRING ""
| #define PACKAGE_BUGREPORT ""
| #define PACKAGE "bzflag"
| #define VERSION "2.0.8"
| #define BZ_BUILD_OS "linux-gnu"
| #define BZ_BUILD_USER "tropican8"
| #define BUILD_REGEX 1
| /* end confdefs.h.  */
| extern "C" void std::exit (int) throw (); using std::exit;
| #include <stdlib.h>
| int
| main ()
| {
| exit (42);
|   ;
|   return 0;
| }
configure:3562: g++ -c   conftest.cc >&5
./configure: line 3563: g++: command not found
configure:3568: $? = 127
configure: failed program was:
| /* confdefs.h.  */
| 
| #define PACKAGE_NAME ""
| #define PACKAGE_TARNAME ""
| #define PACKAGE_VERSION ""
| #define PACKAGE_STRING ""
| #define PACKAGE_BUGREPORT ""
| #define PACKAGE "bzflag"
| #define VERSION "2.0.8"
| #define BZ_BUILD_OS "linux-gnu"
| #define BZ_BUILD_USER "tropican8"
| #define BUILD_REGEX 1
| /* end confdefs.h.  */
| extern "C" void std::exit (int); using std::exit;
| #include <stdlib.h>
| int
| main ()
| {
| exit (42);
|   ;
|   return 0;
| }
configure:3562: g++ -c   conftest.cc >&5
./configure: line 3563: g++: command not found
configure:3568: $? = 127
configure: failed program was:
| /* confdefs.h.  */
| 
| #define PACKAGE_NAME ""
| #define PACKAGE_TARNAME ""
| #define PACKAGE_VERSION ""
| #define PACKAGE_STRING ""
| #define PACKAGE_BUGREPORT ""
| #define PACKAGE "bzflag"
| #define VERSION "2.0.8"
| #define BZ_BUILD_OS "linux-gnu"
| #define BZ_BUILD_USER "tropican8"
| #define BUILD_REGEX 1
| /* end confdefs.h.  */
| extern "C" void exit (int) throw ();
| #include <stdlib.h>
| int
| main ()
| {
| exit (42);
|   ;
|   return 0;
| }
configure:3562: g++ -c   conftest.cc >&5
./configure: line 3563: g++: command not found
configure:3568: $? = 127
configure: failed program was:
| /* confdefs.h.  */
| 
| #define PACKAGE_NAME ""
| #define PACKAGE_TARNAME ""
| #define PACKAGE_VERSION ""
| #define PACKAGE_STRING ""
| #define PACKAGE_BUGREPORT ""
| #define PACKAGE "bzflag"
| #define VERSION "2.0.8"
| #define BZ_BUILD_OS "linux-gnu"
| #define BZ_BUILD_USER "tropican8"
| #define BUILD_REGEX 1
| /* end confdefs.h.  */
| extern "C" void exit (int);
| #include <stdlib.h>
| int
| main ()
| {
| exit (42);
|   ;
|   return 0;
| }
configure:3562: g++ -c   conftest.cc >&5
./configure: line 3563: g++: command not found
configure:3568: $? = 127
configure: failed program was:
| /* confdefs.h.  */
| 
| #define PACKAGE_NAME ""
| #define PACKAGE_TARNAME ""
| #define PACKAGE_VERSION ""
| #define PACKAGE_STRING ""
| #define PACKAGE_BUGREPORT ""
| #define PACKAGE "bzflag"
| #define VERSION "2.0.8"
| #define BZ_BUILD_OS "linux-gnu"
| #define BZ_BUILD_USER "tropican8"
| #define BUILD_REGEX 1
| /* end confdefs.h.  */
| void exit (int);
| #include <stdlib.h>
| int
| main ()
| {
| exit (42);
|   ;
|   return 0;
| }
configure:3649: checking dependency style of g++
configure:3739: result: none
configure:3759: checking for ccache
configure:3792: result: no
configure:3843: checking for windres
configure:3870: result: :
configure:3940: checking whether ln -s works
configure:3944: result: yes
configure:3992: checking for ranlib
configure:4008: found /usr/bin/ranlib
configure:4019: result: ranlib
configure:4132: checking for a sed that does not truncate output
configure:4186: result: /bin/sed
configure:4189: checking for egrep
configure:4199: result: grep -E
configure:4215: checking for ld used by gcc
configure:4282: result: /usr/bin/ld
configure:4291: checking if the linker (/usr/bin/ld) is GNU ld
configure:4306: result: yes
configure:4311: checking for /usr/bin/ld option to reload object files
configure:4318: result: -r
configure:4336: checking for BSD-compatible nm
configure:4385: result: /usr/bin/nm -B
configure:4389: checking how to recognise dependent libraries
configure:4565: result: pass_all
configure:4800: checking how to run the C preprocessor
configure:4835: gcc -E  conftest.c
configure:4841: $? = 0
configure:4873: gcc -E  conftest.c
conftest.c:17:28: error: ac_nonexistent.h: No such file or directory
configure:4879: $? = 1
configure: failed program was:
| /* confdefs.h.  */
| 
| #define PACKAGE_NAME ""
| #define PACKAGE_TARNAME ""
| #define PACKAGE_VERSION ""
| #define PACKAGE_STRING ""
| #define PACKAGE_BUGREPORT ""
| #define PACKAGE "bzflag"
| #define VERSION "2.0.8"
| #define BZ_BUILD_OS "linux-gnu"
| #define BZ_BUILD_USER "tropican8"
| #define BUILD_REGEX 1
| #ifdef __cplusplus
| void exit (int);
| #endif
| /* end confdefs.h.  */
| #include <ac_nonexistent.h>
configure:4918: result: gcc -E
configure:4942: gcc -E  conftest.c
configure:4948: $? = 0
configure:4980: gcc -E  conftest.c
conftest.c:17:28: error: ac_nonexistent.h: No such file or directory
configure:4986: $? = 1
configure: failed program was:
| /* confdefs.h.  */
| 
| #define PACKAGE_NAME ""
| #define PACKAGE_TARNAME ""
| #define PACKAGE_VERSION ""
| #define PACKAGE_STRING ""
| #define PACKAGE_BUGREPORT ""
| #define PACKAGE "bzflag"
| #define VERSION "2.0.8"
| #define BZ_BUILD_OS "linux-gnu"
| #define BZ_BUILD_USER "tropican8"
| #define BUILD_REGEX 1
| #ifdef __cplusplus
| void exit (int);
| #endif
| /* end confdefs.h.  */
| #include <ac_nonexistent.h>
configure:5030: checking for ANSI C header files
configure:5055: gcc -c -g -O2  conftest.c >&5
configure:5061: $? = 0
configure:5064: test -z 			 || test ! -s conftest.err
configure:5067: $? = 0
configure:5070: test -s conftest.o
configure:5073: $? = 0
configure:5162: gcc -o conftest -g -O2  -lpthread conftest.c  >&5
conftest.c: In function 'main':
conftest.c:34: warning: incompatible implicit declaration of built-in function 'exit'
configure:5165: $? = 0
configure:5167: ./conftest
configure:5170: $? = 0
configure:5185: result: yes
configure:5209: checking for sys/types.h
configure:5225: gcc -c -g -O2  conftest.c >&5
configure:5231: $? = 0
configure:5234: test -z 			 || test ! -s conftest.err
configure:5237: $? = 0
configure:5240: test -s conftest.o
configure:5243: $? = 0
configure:5254: result: yes
configure:5209: checking for sys/stat.h
configure:5225: gcc -c -g -O2  conftest.c >&5
configure:5231: $? = 0
configure:5234: test -z 			 || test ! -s conftest.err
configure:5237: $? = 0
configure:5240: test -s conftest.o
configure:5243: $? = 0
configure:5254: result: yes
configure:5209: checking for stdlib.h
configure:5225: gcc -c -g -O2  conftest.c >&5
configure:5231: $? = 0
configure:5234: test -z 			 || test ! -s conftest.err
configure:5237: $? = 0
configure:5240: test -s conftest.o
configure:5243: $? = 0
configure:5254: result: yes
configure:5209: checking for string.h
configure:5225: gcc -c -g -O2  conftest.c >&5
configure:5231: $? = 0
configure:5234: test -z 			 || test ! -s conftest.err
configure:5237: $? = 0
configure:5240: test -s conftest.o
configure:5243: $? = 0
configure:5254: result: yes
configure:5209: checking for memory.h
configure:5225: gcc -c -g -O2  conftest.c >&5
configure:5231: $? = 0
configure:5234: test -z 			 || test ! -s conftest.err
configure:5237: $? = 0
configure:5240: test -s conftest.o
configure:5243: $? = 0
configure:5254: result: yes
configure:5209: checking for strings.h
configure:5225: gcc -c -g -O2  conftest.c >&5
configure:5231: $? = 0
configure:5234: test -z 			 || test ! -s conftest.err
configure:5237: $? = 0
configure:5240: test -s conftest.o
configure:5243: $? = 0
configure:5254: result: yes
configure:5209: checking for inttypes.h
configure:5225: gcc -c -g -O2  conftest.c >&5
configure:5231: $? = 0
configure:5234: test -z 			 || test ! -s conftest.err
configure:5237: $? = 0
configure:5240: test -s conftest.o
configure:5243: $? = 0
configure:5254: result: yes
configure:5209: checking for stdint.h
configure:5225: gcc -c -g -O2  conftest.c >&5
configure:5231: $? = 0
configure:5234: test -z 			 || test ! -s conftest.err
configure:5237: $? = 0
configure:5240: test -s conftest.o
configure:5243: $? = 0
configure:5254: result: yes
configure:5209: checking for unistd.h
configure:5225: gcc -c -g -O2  conftest.c >&5
configure:5231: $? = 0
configure:5234: test -z 			 || test ! -s conftest.err
configure:5237: $? = 0
configure:5240: test -s conftest.o
configure:5243: $? = 0
configure:5254: result: yes
configure:5280: checking dlfcn.h usability
configure:5292: gcc -c -g -O2  conftest.c >&5
configure:5298: $? = 0
configure:5301: test -z 			 || test ! -s conftest.err
configure:5304: $? = 0
configure:5307: test -s conftest.o
configure:5310: $? = 0
configure:5320: result: yes
configure:5324: checking dlfcn.h presence
configure:5334: gcc -E  conftest.c
configure:5340: $? = 0
configure:5360: result: yes
configure:5395: checking for dlfcn.h
configure:5402: result: yes
configure:5704: checking for g77
configure:5733: result: no
configure:5704: checking for f77
configure:5733: result: no
configure:5704: checking for xlf
configure:5733: result: no
configure:5704: checking for frt
configure:5733: result: no
configure:5704: checking for pgf77
configure:5733: result: no
configure:5704: checking for fort77
configure:5733: result: no
configure:5704: checking for fl32
configure:5733: result: no
configure:5704: checking for af77
configure:5733: result: no
configure:5704: checking for f90
configure:5733: result: no
configure:5704: checking for xlf90
configure:5733: result: no
configure:5704: checking for pgf90
configure:5733: result: no
configure:5704: checking for epcf90
configure:5733: result: no
configure:5704: checking for f95
configure:5733: result: no
configure:5704: checking for fort
configure:5733: result: no
configure:5704: checking for xlf95
configure:5733: result: no
configure:5704: checking for ifc
configure:5733: result: no
configure:5704: checking for efc
configure:5733: result: no
configure:5704: checking for pgf95
configure:5733: result: no
configure:5704: checking for lf95
configure:5733: result: no
configure:5704: checking for gfortran
configure:5733: result: no
configure:5745: checking for Fortran 77 compiler version
configure:5748:  --version </dev/null >&5
./configure: line 5749: --version: command not found
configure:5751: $? = 127
configure:5753:  -v </dev/null >&5
./configure: line 5754: -v: command not found
configure:5756: $? = 127
configure:5758:  -V </dev/null >&5
./configure: line 5759: -V: command not found
configure:5761: $? = 127
configure:5769: checking whether we are using the GNU Fortran 77 compiler
configure:5783:  -c  conftest.F >&5
./configure: line 5784: -c: command not found
configure:5789: $? = 127
configure: failed program was:
|       program main
| #ifndef __GNUC__
|        choke me
| #endif
| 
|       end
configure:5814: result: no
configure:5820: checking whether  accepts -g
configure:5832:  -c -g conftest.f >&5
./configure: line 5833: -c: command not found
configure:5838: $? = 127
configure: failed program was:
|       program main
| 
|       end
configure:5862: result: no
configure:5892: checking the maximum length of command line arguments
configure:6001: result: 32768
configure:6012: checking command to parse /usr/bin/nm -B output from gcc object
configure:6117: gcc -c -g -O2  conftest.c >&5
configure:6120: $? = 0
configure:6124: /usr/bin/nm -B conftest.o \| sed -n -e 's/^.*[ 	]\([ABCDGIRSTW][ABCDGIRSTW]*\)[ 	][ 	]*\([_A-Za-z][_A-Za-z0-9]*\)$/\1 \2 \2/p' \> conftest.nm
configure:6127: $? = 0
configure:6179: gcc -o conftest -g -O2  -lpthread conftest.c conftstm.o >&5
configure:6182: $? = 0
configure:6220: result: ok
configure:6224: checking for objdir
configure:6239: result: .libs
configure:6329: checking for ar
configure:6345: found /usr/bin/ar
configure:6356: result: ar
configure:6409: checking for ranlib
configure:6436: result: ranlib
configure:6489: checking for strip
configure:6505: found /usr/bin/strip
configure:6516: result: strip
configure:6788: checking if gcc supports -fno-rtti -fno-exceptions
configure:6806: gcc -c -g -O2  -fno-rtti -fno-exceptions conftest.c >&5
cc1: warning: command line option "-fno-rtti" is valid for C++/ObjC++ but not for C
configure:6810: $? = 0
configure:6823: result: no
configure:6838: checking for gcc option to produce PIC
configure:7048: result: -fPIC
configure:7056: checking if gcc PIC flag -fPIC works
configure:7074: gcc -c -g -O2  -fPIC -DPIC conftest.c >&5
configure:7078: $? = 0
configure:7091: result: yes
configure:7119: checking if gcc static flag -static works
configure:7147: result: yes
configure:7157: checking if gcc supports -c -o file.o
configure:7178: gcc -c -g -O2  -o out/conftest2.o conftest.c >&5
configure:7182: $? = 0
configure:7204: result: yes
configure:7230: checking whether the gcc linker (/usr/bin/ld) supports shared libraries
configure:8187: result: yes
configure:8254: checking dynamic linker characteristics
configure:8830: result: GNU/Linux ld.so
configure:8839: checking how to hardcode library paths into programs
configure:8864: result: immediate
configure:8878: checking whether stripping libraries is possible
configure:8883: result: yes
configure:9008: checking for shl_load
configure:9065: gcc -o conftest -g -O2  -lpthread conftest.c  >&5
/tmp/ccyHYI3j.o: In function `main':
/home/tropican8/bzflag-2.0.8/conftest.c:67: undefined reference to `shl_load'
/tmp/ccyHYI3j.o:(.data+0x0): undefined reference to `shl_load'
collect2: ld returned 1 exit status
configure:9071: $? = 1
configure: failed program was:
| /* confdefs.h.  */
| 
| #define PACKAGE_NAME ""
| #define PACKAGE_TARNAME ""
| #define PACKAGE_VERSION ""
| #define PACKAGE_STRING ""
| #define PACKAGE_BUGREPORT ""
| #define PACKAGE "bzflag"
| #define VERSION "2.0.8"
| #define BZ_BUILD_OS "linux-gnu"
| #define BZ_BUILD_USER "tropican8"
| #define BUILD_REGEX 1
| #ifdef __cplusplus
| void exit (int);
| #endif
| #define STDC_HEADERS 1
| #define HAVE_SYS_TYPES_H 1
| #define HAVE_SYS_STAT_H 1
| #define HAVE_STDLIB_H 1
| #define HAVE_STRING_H 1
| #define HAVE_MEMORY_H 1
| #define HAVE_STRINGS_H 1
| #define HAVE_INTTYPES_H 1
| #define HAVE_STDINT_H 1
| #define HAVE_UNISTD_H 1
| #define HAVE_DLFCN_H 1
| /* end confdefs.h.  */
| /* Define shl_load to an innocuous variant, in case <limits.h> declares shl_load.
|    For example, HP-UX 11i <limits.h> declares gettimeofday.  */
| #define shl_load innocuous_shl_load
| 
| /* System header to define __stub macros and hopefully few prototypes,
|     which can conflict with char shl_load (); below.
|     Prefer <limits.h> to <assert.h> if __STDC__ is defined, since
|     <limits.h> exists even on freestanding compilers.  */
| 
| #ifdef __STDC__
| # include <limits.h>
| #else
| # include <assert.h>
| #endif
| 
| #undef shl_load
| 
| /* Override any gcc2 internal prototype to avoid an error.  */
| #ifdef __cplusplus
| extern "C"
| {
| #endif
| /* We use char because int might match the return type of a gcc2
|    builtin and then its argument prototype would still apply.  */
| char shl_load ();
| /* The GNU C library defines this for functions which it implements
|     to always fail with ENOSYS.  Some functions are actually named
|     something starting with __ and the normal name is an alias.  */
| #if defined (__stub_shl_load) || defined (__stub___shl_load)
| choke me
| #else
| char (*f) () = shl_load;
| #endif
| #ifdef __cplusplus
| }
| #endif
| 
| int
| main ()
| {
| return f != shl_load;
|   ;
|   return 0;
| }
configure:9095: result: no
configure:9100: checking for shl_load in -ldld
configure:9130: gcc -o conftest -g -O2  -lpthread conftest.c -ldld   >&5
/usr/bin/ld: cannot find -ldld
collect2: ld returned 1 exit status
configure:9136: $? = 1
configure: failed program was:
| /* confdefs.h.  */
| 
| #define PACKAGE_NAME ""
| #define PACKAGE_TARNAME ""
| #define PACKAGE_VERSION ""
| #define PACKAGE_STRING ""
| #define PACKAGE_BUGREPORT ""
| #define PACKAGE "bzflag"
| #define VERSION "2.0.8"
| #define BZ_BUILD_OS "linux-gnu"
| #define BZ_BUILD_USER "tropican8"
| #define BUILD_REGEX 1
| #ifdef __cplusplus
| void exit (int);
| #endif
| #define STDC_HEADERS 1
| #define HAVE_SYS_TYPES_H 1
| #define HAVE_SYS_STAT_H 1
| #define HAVE_STDLIB_H 1
| #define HAVE_STRING_H 1
| #define HAVE_MEMORY_H 1
| #define HAVE_STRINGS_H 1
| #define HAVE_INTTYPES_H 1
| #define HAVE_STDINT_H 1
| #define HAVE_UNISTD_H 1
| #define HAVE_DLFCN_H 1
| /* end confdefs.h.  */
| 
| /* Override any gcc2 internal prototype to avoid an error.  */
| #ifdef __cplusplus
| extern "C"
| #endif
| /* We use char because int might match the return type of a gcc2
|    builtin and then its argument prototype would still apply.  */
| char shl_load ();
| int
| main ()
| {
| shl_load ();
|   ;
|   return 0;
| }
configure:9161: result: no
configure:9166: checking for dlopen
configure:9223: gcc -o conftest -g -O2  -lpthread conftest.c  >&5
/tmp/ccUAO1VM.o: In function `main':
/home/tropican8/bzflag-2.0.8/conftest.c:67: undefined reference to `dlopen'
/tmp/ccUAO1VM.o:(.data+0x0): undefined reference to `dlopen'
collect2: ld returned 1 exit status
configure:9229: $? = 1
configure: failed program was:
| /* confdefs.h.  */
| 
| #define PACKAGE_NAME ""
| #define PACKAGE_TARNAME ""
| #define PACKAGE_VERSION ""
| #define PACKAGE_STRING ""
| #define PACKAGE_BUGREPORT ""
| #define PACKAGE "bzflag"
| #define VERSION "2.0.8"
| #define BZ_BUILD_OS "linux-gnu"
| #define BZ_BUILD_USER "tropican8"
| #define BUILD_REGEX 1
| #ifdef __cplusplus
| void exit (int);
| #endif
| #define STDC_HEADERS 1
| #define HAVE_SYS_TYPES_H 1
| #define HAVE_SYS_STAT_H 1
| #define HAVE_STDLIB_H 1
| #define HAVE_STRING_H 1
| #define HAVE_MEMORY_H 1
| #define HAVE_STRINGS_H 1
| #define HAVE_INTTYPES_H 1
| #define HAVE_STDINT_H 1
| #define HAVE_UNISTD_H 1
| #define HAVE_DLFCN_H 1
| /* end confdefs.h.  */
| /* Define dlopen to an innocuous variant, in case <limits.h> declares dlopen.
|    For example, HP-UX 11i <limits.h> declares gettimeofday.  */
| #define dlopen innocuous_dlopen
| 
| /* System header to define __stub macros and hopefully few prototypes,
|     which can conflict with char dlopen (); below.
|     Prefer <limits.h> to <assert.h> if __STDC__ is defined, since
|     <limits.h> exists even on freestanding compilers.  */
| 
| #ifdef __STDC__
| # include <limits.h>
| #else
| # include <assert.h>
| #endif
| 
| #undef dlopen
| 
| /* Override any gcc2 internal prototype to avoid an error.  */
| #ifdef __cplusplus
| extern "C"
| {
| #endif
| /* We use char because int might match the return type of a gcc2
|    builtin and then its argument prototype would still apply.  */
| char dlopen ();
| /* The GNU C library defines this for functions which it implements
|     to always fail with ENOSYS.  Some functions are actually named
|     something starting with __ and the normal name is an alias.  */
| #if defined (__stub_dlopen) || defined (__stub___dlopen)
| choke me
| #else
| char (*f) () = dlopen;
| #endif
| #ifdef __cplusplus
| }
| #endif
| 
| int
| main ()
| {
| return f != dlopen;
|   ;
|   return 0;
| }
configure:9253: result: no
configure:9258: checking for dlopen in -ldl
configure:9288: gcc -o conftest -g -O2  -lpthread conftest.c -ldl   >&5
configure:9294: $? = 0
configure:9297: test -z 			 || test ! -s conftest.err
configure:9300: $? = 0
configure:9303: test -s conftest
configure:9306: $? = 0
configure:9319: result: yes
configure:9492: checking whether a program can dlopen itself
configure:9566: gcc -o conftest -g -O2  -DHAVE_DLFCN_H -lpthread -Wl,--export-dynamic conftest.c -ldl  >&5
configure: In function 'main':
configure:9562: warning: incompatible implicit declaration of built-in function 'exit'
configure:9569: $? = 0
configure:9587: result: yes
configure:9592: checking whether a statically linked program can dlopen itself
configure:9666: gcc -o conftest -g -O2  -DHAVE_DLFCN_H -lpthread -Wl,--export-dynamic -static conftest.c -ldl  >&5
configure: In function 'main':
configure:9662: warning: incompatible implicit declaration of built-in function 'exit'
/tmp/ccMjqEwu.o: In function `main':
/home/tropican8/bzflag-2.0.8/configure:9650: warning: Using 'dlopen' in statically linked applications requires at runtime the shared libraries from the glibc version used for linking
configure:9669: $? = 0
/lib/: cannot read file data: Is a directory
configure:9687: result: no
configure:9710: checking if libtool supports shared libraries
configure:9712: result: yes
configure:9715: checking whether to build shared libraries
configure:9736: result: no
configure:9739: checking whether to build static libraries
configure:9743: result: yes
configure:9835: creating libtool
configure:18931: checking for pod2man
configure:18947: found /usr/bin/pod2man
configure:18958: result: yes
configure:18982: checking for ar
configure:19008: result: ar
configure:19017: checking for compress in -lz
configure:19047: gcc -o conftest -g -O2  -lpthread conftest.c -lz   >&5
configure:19053: $? = 0
configure:19056: test -z 			 || test ! -s conftest.err
configure:19059: $? = 0
configure:19062: test -s conftest
configure:19065: $? = 0
configure:19078: result: yes
configure:19107: checking for curl >= 7.10.0
configure:19117: result: 7.15.3
configure:19211: checking for artificial intelligence for bz's robots
configure:19213: result: not found
configure:19217: checking for ANSI C header files
configure:19372: result: yes
configure:19409: checking cstdlib usability
configure:19421: g++ -c   conftest.cc >&5
./configure: line 19422: g++: command not found
configure:19427: $? = 127
configure: failed program was:
| /* confdefs.h.  */
| 
| #define PACKAGE_NAME ""
| #define PACKAGE_TARNAME ""
| #define PACKAGE_VERSION ""
| #define PACKAGE_STRING ""
| #define PACKAGE_BUGREPORT ""
| #define PACKAGE "bzflag"
| #define VERSION "2.0.8"
| #define BZ_BUILD_OS "linux-gnu"
| #define BZ_BUILD_USER "tropican8"
| #define BUILD_REGEX 1
| #ifdef __cplusplus
| void exit (int);
| #endif
| #define STDC_HEADERS 1
| #define HAVE_SYS_TYPES_H 1
| #define HAVE_SYS_STAT_H 1
| #define HAVE_STDLIB_H 1
| #define HAVE_STRING_H 1
| #define HAVE_MEMORY_H 1
| #define HAVE_STRINGS_H 1
| #define HAVE_INTTYPES_H 1
| #define HAVE_STDINT_H 1
| #define HAVE_UNISTD_H 1
| #define HAVE_DLFCN_H 1
| #define STDC_HEADERS 1
| /* end confdefs.h.  */
| #include <stdio.h>
| #if HAVE_SYS_TYPES_H
| # include <sys/types.h>
| #endif
| #if HAVE_SYS_STAT_H
| # include <sys/stat.h>
| #endif
| #if STDC_HEADERS
| # include <stdlib.h>
| # include <stddef.h>
| #else
| # if HAVE_STDLIB_H
| #  include <stdlib.h>
| # endif
| #endif
| #if HAVE_STRING_H
| # if !STDC_HEADERS && HAVE_MEMORY_H
| #  include <memory.h>
| # endif
| # include <string.h>
| #endif
| #if HAVE_STRINGS_H
| # include <strings.h>
| #endif
| #if HAVE_INTTYPES_H
| # include <inttypes.h>
| #else
| # if HAVE_STDINT_H
| #  include <stdint.h>
| # endif
| #endif
| #if HAVE_UNISTD_H
| # include <unistd.h>
| #endif
| #include <cstdlib>
configure:19449: result: no
configure:19453: checking cstdlib presence
configure:19463:   conftest.cc
./configure: line 19464: conftest.cc: command not found
configure:19469: $? = 127
configure: failed program was:
| /* confdefs.h.  */
| 
| #define PACKAGE_NAME ""
| #define PACKAGE_TARNAME ""
| #define PACKAGE_VERSION ""
| #define PACKAGE_STRING ""
| #define PACKAGE_BUGREPORT ""
| #define PACKAGE "bzflag"
| #define VERSION "2.0.8"
| #define BZ_BUILD_OS "linux-gnu"
| #define BZ_BUILD_USER "tropican8"
| #define BUILD_REGEX 1
| #ifdef __cplusplus
| void exit (int);
| #endif
| #define STDC_HEADERS 1
| #define HAVE_SYS_TYPES_H 1
| #define HAVE_SYS_STAT_H 1
| #define HAVE_STDLIB_H 1
| #define HAVE_STRING_H 1
| #define HAVE_MEMORY_H 1
| #define HAVE_STRINGS_H 1
| #define HAVE_INTTYPES_H 1
| #define HAVE_STDINT_H 1
| #define HAVE_UNISTD_H 1
| #define HAVE_DLFCN_H 1
| #define STDC_HEADERS 1
| /* end confdefs.h.  */
| #include <cstdlib>
configure:19489: result: no
configure:19524: checking for cstdlib
configure:19531: result: no
configure:19409: checking cstdio usability
configure:19421: g++ -c   conftest.cc >&5
./configure: line 19422: g++: command not found
configure:19427: $? = 127
configure: failed program was:
| /* confdefs.h.  */
| 
| #define PACKAGE_NAME ""
| #define PACKAGE_TARNAME ""
| #define PACKAGE_VERSION ""
| #define PACKAGE_STRING ""
| #define PACKAGE_BUGREPORT ""
| #define PACKAGE "bzflag"
| #define VERSION "2.0.8"
| #define BZ_BUILD_OS "linux-gnu"
| #define BZ_BUILD_USER "tropican8"
| #define BUILD_REGEX 1
| #ifdef __cplusplus
| void exit (int);
| #endif
| #define STDC_HEADERS 1
| #define HAVE_SYS_TYPES_H 1
| #define HAVE_SYS_STAT_H 1
| #define HAVE_STDLIB_H 1
| #define HAVE_STRING_H 1
| #define HAVE_MEMORY_H 1
| #define HAVE_STRINGS_H 1
| #define HAVE_INTTYPES_H 1
| #define HAVE_STDINT_H 1
| #define HAVE_UNISTD_H 1
| #define HAVE_DLFCN_H 1
| #define STDC_HEADERS 1
| /* end confdefs.h.  */
| #include <stdio.h>
| #if HAVE_SYS_TYPES_H
| # include <sys/types.h>
| #endif
| #if HAVE_SYS_STAT_H
| # include <sys/stat.h>
| #endif
| #if STDC_HEADERS
| # include <stdlib.h>
| # include <stddef.h>
| #else
| # if HAVE_STDLIB_H
| #  include <stdlib.h>
| # endif
| #endif
| #if HAVE_STRING_H
| # if !STDC_HEADERS && HAVE_MEMORY_H
| #  include <memory.h>
| # endif
| # include <string.h>
| #endif
| #if HAVE_STRINGS_H
| # include <strings.h>
| #endif
| #if HAVE_INTTYPES_H
| # include <inttypes.h>
| #else
| # if HAVE_STDINT_H
| #  include <stdint.h>
| # endif
| #endif
| #if HAVE_UNISTD_H
| # include <unistd.h>
| #endif
| #include <cstdio>
configure:19449: result: no
configure:19453: checking cstdio presence
configure:19463:   conftest.cc
./configure: line 19464: conftest.cc: command not found
configure:19469: $? = 127
configure: failed program was:
| /* confdefs.h.  */
| 
| #define PACKAGE_NAME ""
| #define PACKAGE_TARNAME ""
| #define PACKAGE_VERSION ""
| #define PACKAGE_STRING ""
| #define PACKAGE_BUGREPORT ""
| #define PACKAGE "bzflag"
| #define VERSION "2.0.8"
| #define BZ_BUILD_OS "linux-gnu"
| #define BZ_BUILD_USER "tropican8"
| #define BUILD_REGEX 1
| #ifdef __cplusplus
| void exit (int);
| #endif
| #define STDC_HEADERS 1
| #define HAVE_SYS_TYPES_H 1
| #define HAVE_SYS_STAT_H 1
| #define HAVE_STDLIB_H 1
| #define HAVE_STRING_H 1
| #define HAVE_MEMORY_H 1
| #define HAVE_STRINGS_H 1
| #define HAVE_INTTYPES_H 1
| #define HAVE_STDINT_H 1
| #define HAVE_UNISTD_H 1
| #define HAVE_DLFCN_H 1
| #define STDC_HEADERS 1
| /* end confdefs.h.  */
| #include <cstdio>
configure:19489: result: no
configure:19524: checking for cstdio
configure:19531: result: no
configure:19409: checking cstring usability
configure:19421: g++ -c   conftest.cc >&5
./configure: line 19422: g++: command not found
configure:19427: $? = 127
configure: failed program was:
| /* confdefs.h.  */
| 
| #define PACKAGE_NAME ""
| #define PACKAGE_TARNAME ""
| #define PACKAGE_VERSION ""
| #define PACKAGE_STRING ""
| #define PACKAGE_BUGREPORT ""
| #define PACKAGE "bzflag"
| #define VERSION "2.0.8"
| #define BZ_BUILD_OS "linux-gnu"
| #define BZ_BUILD_USER "tropican8"
| #define BUILD_REGEX 1
| #ifdef __cplusplus
| void exit (int);
| #endif
| #define STDC_HEADERS 1
| #define HAVE_SYS_TYPES_H 1
| #define HAVE_SYS_STAT_H 1
| #define HAVE_STDLIB_H 1
| #define HAVE_STRING_H 1
| #define HAVE_MEMORY_H 1
| #define HAVE_STRINGS_H 1
| #define HAVE_INTTYPES_H 1
| #define HAVE_STDINT_H 1
| #define HAVE_UNISTD_H 1
| #define HAVE_DLFCN_H 1
| #define STDC_HEADERS 1
| /* end confdefs.h.  */
| #include <stdio.h>
| #if HAVE_SYS_TYPES_H
| # include <sys/types.h>
| #endif
| #if HAVE_SYS_STAT_H
| # include <sys/stat.h>
| #endif
| #if STDC_HEADERS
| # include <stdlib.h>
| # include <stddef.h>
| #else
| # if HAVE_STDLIB_H
| #  include <stdlib.h>
| # endif
| #endif
| #if HAVE_STRING_H
| # if !STDC_HEADERS && HAVE_MEMORY_H
| #  include <memory.h>
| # endif
| # include <string.h>
| #endif
| #if HAVE_STRINGS_H
| # include <strings.h>
| #endif
| #if HAVE_INTTYPES_H
| # include <inttypes.h>
| #else
| # if HAVE_STDINT_H
| #  include <stdint.h>
| # endif
| #endif
| #if HAVE_UNISTD_H
| # include <unistd.h>
| #endif
| #include <cstring>
configure:19449: result: no
configure:19453: checking cstring presence
configure:19463:   conftest.cc
./configure: line 19464: conftest.cc: command not found
configure:19469: $? = 127
configure: failed program was:
| /* confdefs.h.  */
| 
| #define PACKAGE_NAME ""
| #define PACKAGE_TARNAME ""
| #define PACKAGE_VERSION ""
| #define PACKAGE_STRING ""
| #define PACKAGE_BUGREPORT ""
| #define PACKAGE "bzflag"
| #define VERSION "2.0.8"
| #define BZ_BUILD_OS "linux-gnu"
| #define BZ_BUILD_USER "tropican8"
| #define BUILD_REGEX 1
| #ifdef __cplusplus
| void exit (int);
| #endif
| #define STDC_HEADERS 1
| #define HAVE_SYS_TYPES_H 1
| #define HAVE_SYS_STAT_H 1
| #define HAVE_STDLIB_H 1
| #define HAVE_STRING_H 1
| #define HAVE_MEMORY_H 1
| #define HAVE_STRINGS_H 1
| #define HAVE_INTTYPES_H 1
| #define HAVE_STDINT_H 1
| #define HAVE_UNISTD_H 1
| #define HAVE_DLFCN_H 1
| #define STDC_HEADERS 1
| /* end confdefs.h.  */
| #include <cstring>
configure:19489: result: no
configure:19524: checking for cstring
configure:19531: result: no
configure:19739: checking GL/glx.h usability
configure:19751: gcc -c -g -O2  conftest.c >&5
configure:19757: $? = 0
configure:19760: test -z 			 || test ! -s conftest.err
configure:19763: $? = 0
configure:19766: test -s conftest.o
configure:19769: $? = 0
configure:19779: result: yes
configure:19783: checking GL/glx.h presence
configure:19793: gcc -E  conftest.c
configure:19799: $? = 0
configure:19819: result: yes
configure:19854: checking for GL/glx.h
configure:19861: result: yes
configure:19739: checking SDL/SDL.h usability
configure:19751: gcc -c -g -O2  conftest.c >&5
configure:19757: $? = 0
configure:19760: test -z 			 || test ! -s conftest.err
configure:19763: $? = 0
configure:19766: test -s conftest.o
configure:19769: $? = 0
configure:19779: result: yes
configure:19783: checking SDL/SDL.h presence
configure:19793: gcc -E  conftest.c
configure:19799: $? = 0
configure:19819: result: yes
configure:19854: checking for SDL/SDL.h
configure:19861: result: yes
configure:19739: checking X11/Xlib.h usability
configure:19751: gcc -c -g -O2  conftest.c >&5
configure:19757: $? = 0
configure:19760: test -z 			 || test ! -s conftest.err
configure:19763: $? = 0
configure:19766: test -s conftest.o
configure:19769: $? = 0
configure:19779: result: yes
configure:19783: checking X11/Xlib.h presence
configure:19793: gcc -E  conftest.c
configure:19799: $? = 0
configure:19819: result: yes
configure:19854: checking for X11/Xlib.h
configure:19861: result: yes
configure:19739: checking bstring.h usability
configure:19751: gcc -c -g -O2  conftest.c >&5
conftest.c:66:21: error: bstring.h: No such file or directory
configure:19757: $? = 1
configure: failed program was:
| /* confdefs.h.  */
| 
| #define PACKAGE_NAME ""
| #define PACKAGE_TARNAME ""
| #define PACKAGE_VERSION ""
| #define PACKAGE_STRING ""
| #define PACKAGE_BUGREPORT ""
| #define PACKAGE "bzflag"
| #define VERSION "2.0.8"
| #define BZ_BUILD_OS "linux-gnu"
| #define BZ_BUILD_USER "tropican8"
| #define BUILD_REGEX 1
| #ifdef __cplusplus
| void exit (int);
| #endif
| #define STDC_HEADERS 1
| #define HAVE_SYS_TYPES_H 1
| #define HAVE_SYS_STAT_H 1
| #define HAVE_STDLIB_H 1
| #define HAVE_STRING_H 1
| #define HAVE_MEMORY_H 1
| #define HAVE_STRINGS_H 1
| #define HAVE_INTTYPES_H 1
| #define HAVE_STDINT_H 1
| #define HAVE_UNISTD_H 1
| #define HAVE_DLFCN_H 1
| #define STDC_HEADERS 1
| #define HAVE_GL_GLX_H 1
| #define HAVE_SDL_SDL_H 1
| #define HAVE_X11_XLIB_H 1
| /* end confdefs.h.  */
| #include <stdio.h>
| #if HAVE_SYS_TYPES_H
| # include <sys/types.h>
| #endif
| #if HAVE_SYS_STAT_H
| # include <sys/stat.h>
| #endif
| #if STDC_HEADERS
| # include <stdlib.h>
| # include <stddef.h>
| #else
| # if HAVE_STDLIB_H
| #  include <stdlib.h>
| # endif
| #endif
| #if HAVE_STRING_H
| # if !STDC_HEADERS && HAVE_MEMORY_H
| #  include <memory.h>
| # endif
| # include <string.h>
| #endif
| #if HAVE_STRINGS_H
| # include <strings.h>
| #endif
| #if HAVE_INTTYPES_H
| # include <inttypes.h>
| #else
| # if HAVE_STDINT_H
| #  include <stdint.h>
| # endif
| #endif
| #if HAVE_UNISTD_H
| # include <unistd.h>
| #endif
| #include <bstring.h>
configure:19779: result: no
configure:19783: checking bstring.h presence
configure:19793: gcc -E  conftest.c
conftest.c:32:21: error: bstring.h: No such file or directory
configure:19799: $? = 1
configure: failed program was:
| /* confdefs.h.  */
| 
| #define PACKAGE_NAME ""
| #define PACKAGE_TARNAME ""
| #define PACKAGE_VERSION ""
| #define PACKAGE_STRING ""
| #define PACKAGE_BUGREPORT ""
| #define PACKAGE "bzflag"
| #define VERSION "2.0.8"
| #define BZ_BUILD_OS "linux-gnu"
| #define BZ_BUILD_USER "tropican8"
| #define BUILD_REGEX 1
| #ifdef __cplusplus
| void exit (int);
| #endif
| #define STDC_HEADERS 1
| #define HAVE_SYS_TYPES_H 1
| #define HAVE_SYS_STAT_H 1
| #define HAVE_STDLIB_H 1
| #define HAVE_STRING_H 1
| #define HAVE_MEMORY_H 1
| #define HAVE_STRINGS_H 1
| #define HAVE_INTTYPES_H 1
| #define HAVE_STDINT_H 1
| #define HAVE_UNISTD_H 1
| #define HAVE_DLFCN_H 1
| #define STDC_HEADERS 1
| #define HAVE_GL_GLX_H 1
| #define HAVE_SDL_SDL_H 1
| #define HAVE_X11_XLIB_H 1
| /* end confdefs.h.  */
| #include <bstring.h>
configure:19819: result: no
configure:19854: checking for bstring.h
configure:19861: result: no
configure:19739: checking linux/input.h usability
configure:19751: gcc -c -g -O2  conftest.c >&5
configure:19757: $? = 0
configure:19760: test -z 			 || test ! -s conftest.err
configure:19763: $? = 0
configure:19766: test -s conftest.o
configure:19769: $? = 0
configure:19779: result: yes
configure:19783: checking linux/input.h presence
configure:19793: gcc -E  conftest.c
configure:19799: $? = 0
configure:19819: result: yes
configure:19854: checking for linux/input.h
configure:19861: result: yes
configure:19730: checking for stdint.h
configure:19735: result: yes
configure:19739: checking sys/param.h usability
configure:19751: gcc -c -g -O2  conftest.c >&5
configure:19757: $? = 0
configure:19760: test -z 			 || test ! -s conftest.err
configure:19763: $? = 0
configure:19766: test -s conftest.o
configure:19769: $? = 0
configure:19779: result: yes
configure:19783: checking sys/param.h presence
configure:19793: gcc -E  conftest.c
configure:19799: $? = 0
configure:19819: result: yes
configure:19854: checking for sys/param.h
configure:19861: result: yes
configure:19730: checking for unistd.h
configure:19735: result: yes
configure:19739: checking values.h usability
configure:19751: gcc -c -g -O2  conftest.c >&5
configure:19757: $? = 0
configure:19760: test -z 			 || test ! -s conftest.err
configure:19763: $? = 0
configure:19766: test -s conftest.o
configure:19769: $? = 0
configure:19779: result: yes
configure:19783: checking values.h presence
configure:19793: gcc -E  conftest.c
configure:19799: $? = 0
configure:19819: result: yes
configure:19854: checking for values.h
configure:19861: result: yes
configure:19739: checking dsound.h usability
configure:19751: gcc -c -g -O2  conftest.c >&5
conftest.c:71:20: error: dsound.h: No such file or directory
configure:19757: $? = 1
configure: failed program was:
| /* confdefs.h.  */
| 
| #define PACKAGE_NAME ""
| #define PACKAGE_TARNAME ""
| #define PACKAGE_VERSION ""
| #define PACKAGE_STRING ""
| #define PACKAGE_BUGREPORT ""
| #define PACKAGE "bzflag"
| #define VERSION "2.0.8"
| #define BZ_BUILD_OS "linux-gnu"
| #define BZ_BUILD_USER "tropican8"
| #define BUILD_REGEX 1
| #ifdef __cplusplus
| void exit (int);
| #endif
| #define STDC_HEADERS 1
| #define HAVE_SYS_TYPES_H 1
| #define HAVE_SYS_STAT_H 1
| #define HAVE_STDLIB_H 1
| #define HAVE_STRING_H 1
| #define HAVE_MEMORY_H 1
| #define HAVE_STRINGS_H 1
| #define HAVE_INTTYPES_H 1
| #define HAVE_STDINT_H 1
| #define HAVE_UNISTD_H 1
| #define HAVE_DLFCN_H 1
| #define STDC_HEADERS 1
| #define HAVE_GL_GLX_H 1
| #define HAVE_SDL_SDL_H 1
| #define HAVE_X11_XLIB_H 1
| #define HAVE_LINUX_INPUT_H 1
| #define HAVE_STDINT_H 1
| #define HAVE_SYS_PARAM_H 1
| #define HAVE_UNISTD_H 1
| #define HAVE_VALUES_H 1
| /* end confdefs.h.  */
| #include <stdio.h>
| #if HAVE_SYS_TYPES_H
| # include <sys/types.h>
| #endif
| #if HAVE_SYS_STAT_H
| # include <sys/stat.h>
| #endif
| #if STDC_HEADERS
| # include <stdlib.h>
| # include <stddef.h>
| #else
| # if HAVE_STDLIB_H
| #  include <stdlib.h>
| # endif
| #endif
| #if HAVE_STRING_H
| # if !STDC_HEADERS && HAVE_MEMORY_H
| #  include <memory.h>
| # endif
| # include <string.h>
| #endif
| #if HAVE_STRINGS_H
| # include <strings.h>
| #endif
| #if HAVE_INTTYPES_H
| # include <inttypes.h>
| #else
| # if HAVE_STDINT_H
| #  include <stdint.h>
| # endif
| #endif
| #if HAVE_UNISTD_H
| # include <unistd.h>
| #endif
| #include <dsound.h>
configure:19779: result: no
configure:19783: checking dsound.h presence
configure:19793: gcc -E  conftest.c
conftest.c:37:20: error: dsound.h: No such file or directory
configure:19799: $? = 1
configure: failed program was:
| /* confdefs.h.  */
| 
| #define PACKAGE_NAME ""
| #define PACKAGE_TARNAME ""
| #define PACKAGE_VERSION ""
| #define PACKAGE_STRING ""
| #define PACKAGE_BUGREPORT ""
| #define PACKAGE "bzflag"
| #define VERSION "2.0.8"
| #define BZ_BUILD_OS "linux-gnu"
| #define BZ_BUILD_USER "tropican8"
| #define BUILD_REGEX 1
| #ifdef __cplusplus
| void exit (int);
| #endif
| #define STDC_HEADERS 1
| #define HAVE_SYS_TYPES_H 1
| #define HAVE_SYS_STAT_H 1
| #define HAVE_STDLIB_H 1
| #define HAVE_STRING_H 1
| #define HAVE_MEMORY_H 1
| #define HAVE_STRINGS_H 1
| #define HAVE_INTTYPES_H 1
| #define HAVE_STDINT_H 1
| #define HAVE_UNISTD_H 1
| #define HAVE_DLFCN_H 1
| #define STDC_HEADERS 1
| #define HAVE_GL_GLX_H 1
| #define HAVE_SDL_SDL_H 1
| #define HAVE_X11_XLIB_H 1
| #define HAVE_LINUX_INPUT_H 1
| #define HAVE_STDINT_H 1
| #define HAVE_SYS_PARAM_H 1
| #define HAVE_UNISTD_H 1
| #define HAVE_VALUES_H 1
| /* end confdefs.h.  */
| #include <dsound.h>
configure:19819: result: no
configure:19854: checking for dsound.h
configure:19861: result: no
configure:19878: checking whether byte ordering is bigendian
configure:19905: gcc -c -g -O2  conftest.c >&5
configure:19911: $? = 0
configure:19914: test -z 			 || test ! -s conftest.err
configure:19917: $? = 0
configure:19920: test -s conftest.o
configure:19923: $? = 0
configure:19947: gcc -c -g -O2  conftest.c >&5
conftest.c: In function 'main':
conftest.c:44: error: 'not' undeclared (first use in this function)
conftest.c:44: error: (Each undeclared identifier is reported only once
conftest.c:44: error: for each function it appears in.)
conftest.c:44: error: syntax error before 'big'
configure:19953: $? = 1
configure: failed program was:
| /* confdefs.h.  */
| 
| #define PACKAGE_NAME ""
| #define PACKAGE_TARNAME ""
| #define PACKAGE_VERSION ""
| #define PACKAGE_STRING ""
| #define PACKAGE_BUGREPORT ""
| #define PACKAGE "bzflag"
| #define VERSION "2.0.8"
| #define BZ_BUILD_OS "linux-gnu"
| #define BZ_BUILD_USER "tropican8"
| #define BUILD_REGEX 1
| #ifdef __cplusplus
| void exit (int);
| #endif
| #define STDC_HEADERS 1
| #define HAVE_SYS_TYPES_H 1
| #define HAVE_SYS_STAT_H 1
| #define HAVE_STDLIB_H 1
| #define HAVE_STRING_H 1
| #define HAVE_MEMORY_H 1
| #define HAVE_STRINGS_H 1
| #define HAVE_INTTYPES_H 1
| #define HAVE_STDINT_H 1
| #define HAVE_UNISTD_H 1
| #define HAVE_DLFCN_H 1
| #define STDC_HEADERS 1
| #define HAVE_GL_GLX_H 1
| #define HAVE_SDL_SDL_H 1
| #define HAVE_X11_XLIB_H 1
| #define HAVE_LINUX_INPUT_H 1
| #define HAVE_STDINT_H 1
| #define HAVE_SYS_PARAM_H 1
| #define HAVE_UNISTD_H 1
| #define HAVE_VALUES_H 1
| /* end confdefs.h.  */
| #include <sys/types.h>
| #include <sys/param.h>
| 
| int
| main ()
| {
| #if BYTE_ORDER != BIG_ENDIAN
|  not big endian
| #endif
| 
|   ;
|   return 0;
| }
configure:20086: result: no
configure:20105: checking for an ANSI C-conforming const
configure:20172: gcc -c -g -O2  conftest.c >&5
configure:20178: $? = 0
configure:20181: test -z 			 || test ! -s conftest.err
configure:20184: $? = 0
configure:20187: test -s conftest.o
configure:20190: $? = 0
configure:20201: result: yes
configure:20212: checking for socklen_t type
configure:20231: gcc -c -g -O2  conftest.c >&5
configure:20237: $? = 0
configure:20240: test -z 			 || test ! -s conftest.err
configure:20243: $? = 0
configure:20246: test -s conftest.o
configure:20249: $? = 0
configure:20272: result: yes
configure:20276: checking for linux rumble joystick support
configure:20294: gcc -c -g -O2  conftest.c >&5
configure:20300: $? = 0
configure:20303: test -z 			 || test ! -s conftest.err
configure:20306: $? = 0
configure:20309: test -s conftest.o
configure:20312: $? = 0
configure:20329: result: yes
configure:20333: checking for linux force feedback joystick support
configure:20351: gcc -c -g -O2  conftest.c >&5
configure:20357: $? = 0
configure:20360: test -z 			 || test ! -s conftest.err
configure:20363: $? = 0
configure:20366: test -s conftest.o
configure:20369: $? = 0
configure:20386: result: yes
configure:20519: checking for X
configure:20753: result: libraries /usr/X11R6/lib, headers /usr/X11R6/include
configure:20924: gcc -o conftest -g -O2  -lpthread conftest.c -L/usr/lib -lcurl -L/usr/lib -lgssapi_krb5 -lkrb5 -lk5crypto -lkrb5support -lcom_err -lresolv -lidn -lssl -lcrypto -ldl -lssl -lcrypto -lz   -L/usr/X11R6/lib -lX11 >&5
configure:20930: $? = 0
configure:20933: test -z 			 || test ! -s conftest.err
configure:20936: $? = 0
configure:20939: test -s conftest
configure:20942: $? = 0
configure:21098: checking for gethostbyname
configure:21155: gcc -o conftest -g -O2  -lpthread conftest.c -L/usr/lib -lcurl -L/usr/lib -lgssapi_krb5 -lkrb5 -lk5crypto -lkrb5support -lcom_err -lresolv -lidn -lssl -lcrypto -ldl -lssl -lcrypto -lz  >&5
configure:21161: $? = 0
configure:21164: test -z 			 || test ! -s conftest.err
configure:21167: $? = 0
configure:21170: test -s conftest
configure:21173: $? = 0
configure:21185: result: yes
configure:21334: checking for connect
configure:21391: gcc -o conftest -g -O2  -lpthread conftest.c -L/usr/lib -lcurl -L/usr/lib -lgssapi_krb5 -lkrb5 -lk5crypto -lkrb5support -lcom_err -lresolv -lidn -lssl -lcrypto -ldl -lssl -lcrypto -lz  >&5
configure:21397: $? = 0
configure:21400: test -z 			 || test ! -s conftest.err
configure:21403: $? = 0
configure:21406: test -s conftest
configure:21409: $? = 0
configure:21421: result: yes
configure:21495: checking for remove
configure:21552: gcc -o conftest -g -O2  -lpthread conftest.c -L/usr/lib -lcurl -L/usr/lib -lgssapi_krb5 -lkrb5 -lk5crypto -lkrb5support -lcom_err -lresolv -lidn -lssl -lcrypto -ldl -lssl -lcrypto -lz  >&5
configure:21558: $? = 0
configure:21561: test -z 			 || test ! -s conftest.err
configure:21564: $? = 0
configure:21567: test -s conftest
configure:21570: $? = 0
configure:21582: result: yes
configure:21656: checking for shmat
configure:21713: gcc -o conftest -g -O2  -lpthread conftest.c -L/usr/lib -lcurl -L/usr/lib -lgssapi_krb5 -lkrb5 -lk5crypto -lkrb5support -lcom_err -lresolv -lidn -lssl -lcrypto -ldl -lssl -lcrypto -lz  >&5
configure:21719: $? = 0
configure:21722: test -z 			 || test ! -s conftest.err
configure:21725: $? = 0
configure:21728: test -s conftest
configure:21731: $? = 0
configure:21743: result: yes
configure:21826: checking for IceConnectionNumber in -lICE
configure:21856: gcc -o conftest -g -O2  -lpthread -L/usr/X11R6/lib conftest.c -lICE  -L/usr/lib -lcurl -L/usr/lib -lgssapi_krb5 -lkrb5 -lk5crypto -lkrb5support -lcom_err -lresolv -lidn -lssl -lcrypto -ldl -lssl -lcrypto -lz  >&5
configure:21862: $? = 0
configure:21865: test -z 			 || test ! -s conftest.err
configure:21868: $? = 0
configure:21871: test -s conftest
configure:21874: $? = 0
configure:21887: result: yes
configure:21921: checking for sqrtf in -lm
configure:21951: gcc -o conftest -g -O2   -I/usr/X11R6/include -lpthread  -L/usr/X11R6/lib conftest.c -lm  -L/usr/lib -lcurl -L/usr/lib -lgssapi_krb5 -lkrb5 -lk5crypto -lkrb5support -lcom_err -lresolv -lidn -lssl -lcrypto -ldl -lssl -lcrypto -lz  >&5
conftest.c:47: warning: conflicting types for built-in function 'sqrtf'
configure:21957: $? = 0
configure:21960: test -z 			 || test ! -s conftest.err
configure:21963: $? = 0
configure:21966: test -s conftest
configure:21969: $? = 0
configure:21982: result: yes
configure:21996: checking for socket in -lsocket
configure:22026: gcc -o conftest -g -O2   -I/usr/X11R6/include -lpthread  -L/usr/X11R6/lib conftest.c -lsocket  -lm -L/usr/lib -lcurl -L/usr/lib -lgssapi_krb5 -lkrb5 -lk5crypto -lkrb5support -lcom_err -lresolv -lidn -lssl -lcrypto -ldl -lssl -lcrypto -lz  >&5
/usr/bin/ld: cannot find -lsocket
collect2: ld returned 1 exit status
configure:22032: $? = 1
configure: failed program was:
| /* confdefs.h.  */
| 
| #define PACKAGE_NAME ""
| #define PACKAGE_TARNAME ""
| #define PACKAGE_VERSION ""
| #define PACKAGE_STRING ""
| #define PACKAGE_BUGREPORT ""
| #define PACKAGE "bzflag"
| #define VERSION "2.0.8"
| #define BZ_BUILD_OS "linux-gnu"
| #define BZ_BUILD_USER "tropican8"
| #define BUILD_REGEX 1
| #ifdef __cplusplus
| void exit (int);
| #endif
| #define STDC_HEADERS 1
| #define HAVE_SYS_TYPES_H 1
| #define HAVE_SYS_STAT_H 1
| #define HAVE_STDLIB_H 1
| #define HAVE_STRING_H 1
| #define HAVE_MEMORY_H 1
| #define HAVE_STRINGS_H 1
| #define HAVE_INTTYPES_H 1
| #define HAVE_STDINT_H 1
| #define HAVE_UNISTD_H 1
| #define HAVE_DLFCN_H 1
| #define STDC_HEADERS 1
| #define HAVE_GL_GLX_H 1
| #define HAVE_SDL_SDL_H 1
| #define HAVE_X11_XLIB_H 1
| #define HAVE_LINUX_INPUT_H 1
| #define HAVE_STDINT_H 1
| #define HAVE_SYS_PARAM_H 1
| #define HAVE_UNISTD_H 1
| #define HAVE_VALUES_H 1
| #define HAVE_SOCKLEN_T 1
| #define HAVE_FF_EFFECT_RUMBLE 1
| #define HAVE_FF_EFFECT_DIRECTIONAL 1
| #define HAVE_LIBM 1
| /* end confdefs.h.  */
| 
| /* Override any gcc2 internal prototype to avoid an error.  */
| #ifdef __cplusplus
| extern "C"
| #endif
| /* We use char because int might match the return type of a gcc2
|    builtin and then its argument prototype would still apply.  */
| char socket ();
| int
| main ()
| {
| socket ();
|   ;
|   return 0;
| }
configure:22057: result: no
configure:22069: checking for gethostent in -lsocket
configure:22099: gcc -o conftest -g -O2   -I/usr/X11R6/include -lpthread  -L/usr/X11R6/lib conftest.c -lsocket  -lm -L/usr/lib -lcurl -L/usr/lib -lgssapi_krb5 -lkrb5 -lk5crypto -lkrb5support -lcom_err -lresolv -lidn -lssl -lcrypto -ldl -lssl -lcrypto -lz  >&5
/usr/bin/ld: cannot find -lsocket
collect2: ld returned 1 exit status
configure:22105: $? = 1
configure: failed program was:
| /* confdefs.h.  */
| 
| #define PACKAGE_NAME ""
| #define PACKAGE_TARNAME ""
| #define PACKAGE_VERSION ""
| #define PACKAGE_STRING ""
| #define PACKAGE_BUGREPORT ""
| #define PACKAGE "bzflag"
| #define VERSION "2.0.8"
| #define BZ_BUILD_OS "linux-gnu"
| #define BZ_BUILD_USER "tropican8"
| #define BUILD_REGEX 1
| #ifdef __cplusplus
| void exit (int);
| #endif
| #define STDC_HEADERS 1
| #define HAVE_SYS_TYPES_H 1
| #define HAVE_SYS_STAT_H 1
| #define HAVE_STDLIB_H 1
| #define HAVE_STRING_H 1
| #define HAVE_MEMORY_H 1
| #define HAVE_STRINGS_H 1
| #define HAVE_INTTYPES_H 1
| #define HAVE_STDINT_H 1
| #define HAVE_UNISTD_H 1
| #define HAVE_DLFCN_H 1
| #define STDC_HEADERS 1
| #define HAVE_GL_GLX_H 1
| #define HAVE_SDL_SDL_H 1
| #define HAVE_X11_XLIB_H 1
| #define HAVE_LINUX_INPUT_H 1
| #define HAVE_STDINT_H 1
| #define HAVE_SYS_PARAM_H 1
| #define HAVE_UNISTD_H 1
| #define HAVE_VALUES_H 1
| #define HAVE_SOCKLEN_T 1
| #define HAVE_FF_EFFECT_RUMBLE 1
| #define HAVE_FF_EFFECT_DIRECTIONAL 1
| #define HAVE_LIBM 1
| /* end confdefs.h.  */
| 
| /* Override any gcc2 internal prototype to avoid an error.  */
| #ifdef __cplusplus
| extern "C"
| #endif
| /* We use char because int might match the return type of a gcc2
|    builtin and then its argument prototype would still apply.  */
| char gethostent ();
| int
| main ()
| {
| gethostent ();
|   ;
|   return 0;
| }
configure:22130: result: no
configure:22141: checking for gethostent in -lbind
configure:22171: gcc -o conftest -g -O2   -I/usr/X11R6/include -lpthread  -L/usr/X11R6/lib conftest.c -lbind  -lm -L/usr/lib -lcurl -L/usr/lib -lgssapi_krb5 -lkrb5 -lk5crypto -lkrb5support -lcom_err -lresolv -lidn -lssl -lcrypto -ldl -lssl -lcrypto -lz  >&5
/usr/bin/ld: cannot find -lbind
collect2: ld returned 1 exit status
configure:22177: $? = 1
configure: failed program was:
| /* confdefs.h.  */
| 
| #define PACKAGE_NAME ""
| #define PACKAGE_TARNAME ""
| #define PACKAGE_VERSION ""
| #define PACKAGE_STRING ""
| #define PACKAGE_BUGREPORT ""
| #define PACKAGE "bzflag"
| #define VERSION "2.0.8"
| #define BZ_BUILD_OS "linux-gnu"
| #define BZ_BUILD_USER "tropican8"
| #define BUILD_REGEX 1
| #ifdef __cplusplus
| void exit (int);
| #endif
| #define STDC_HEADERS 1
| #define HAVE_SYS_TYPES_H 1
| #define HAVE_SYS_STAT_H 1
| #define HAVE_STDLIB_H 1
| #define HAVE_STRING_H 1
| #define HAVE_MEMORY_H 1
| #define HAVE_STRINGS_H 1
| #define HAVE_INTTYPES_H 1
| #define HAVE_STDINT_H 1
| #define HAVE_UNISTD_H 1
| #define HAVE_DLFCN_H 1
| #define STDC_HEADERS 1
| #define HAVE_GL_GLX_H 1
| #define HAVE_SDL_SDL_H 1
| #define HAVE_X11_XLIB_H 1
| #define HAVE_LINUX_INPUT_H 1
| #define HAVE_STDINT_H 1
| #define HAVE_SYS_PARAM_H 1
| #define HAVE_UNISTD_H 1
| #define HAVE_VALUES_H 1
| #define HAVE_SOCKLEN_T 1
| #define HAVE_FF_EFFECT_RUMBLE 1
| #define HAVE_FF_EFFECT_DIRECTIONAL 1
| #define HAVE_LIBM 1
| /* end confdefs.h.  */
| 
| /* Override any gcc2 internal prototype to avoid an error.  */
| #ifdef __cplusplus
| extern "C"
| #endif
| /* We use char because int might match the return type of a gcc2
|    builtin and then its argument prototype would still apply.  */
| char gethostent ();
| int
| main ()
| {
| gethostent ();
|   ;
|   return 0;
| }
configure:22202: result: no
configure:22217: checking for acosf in -lm
configure:22247: gcc -o conftest -g -O2   -I/usr/X11R6/include -lpthread  -L/usr/X11R6/lib conftest.c -lm  -lm -L/usr/lib -lcurl -L/usr/lib -lgssapi_krb5 -lkrb5 -lk5crypto -lkrb5support -lcom_err -lresolv -lidn -lssl -lcrypto -ldl -lssl -lcrypto -lz  >&5
conftest.c:48: warning: conflicting types for built-in function 'acosf'
configure:22253: $? = 0
configure:22256: test -z 			 || test ! -s conftest.err
configure:22259: $? = 0
configure:22262: test -s conftest
configure:22265: $? = 0
configure:22278: result: yes
configure:22288: checking for asinf in -lm
configure:22318: gcc -o conftest -g -O2   -I/usr/X11R6/include -lpthread  -L/usr/X11R6/lib conftest.c -lm  -lm -L/usr/lib -lcurl -L/usr/lib -lgssapi_krb5 -lkrb5 -lk5crypto -lkrb5support -lcom_err -lresolv -lidn -lssl -lcrypto -ldl -lssl -lcrypto -lz  >&5
conftest.c:49: warning: conflicting types for built-in function 'asinf'
configure:22324: $? = 0
configure:22327: test -z 			 || test ! -s conftest.err
configure:22330: $? = 0
configure:22333: test -s conftest
configure:22336: $? = 0
configure:22349: result: yes
configure:22359: checking for atan2f in -lm
configure:22389: gcc -o conftest -g -O2   -I/usr/X11R6/include -lpthread  -L/usr/X11R6/lib conftest.c -lm  -lm -L/usr/lib -lcurl -L/usr/lib -lgssapi_krb5 -lkrb5 -lk5crypto -lkrb5support -lcom_err -lresolv -lidn -lssl -lcrypto -ldl -lssl -lcrypto -lz  >&5
conftest.c:50: warning: conflicting types for built-in function 'atan2f'
configure:22395: $? = 0
configure:22398: test -z 			 || test ! -s conftest.err
configure:22401: $? = 0
configure:22404: test -s conftest
configure:22407: $? = 0
configure:22420: result: yes
configure:22430: checking for atanf in -lm
configure:22460: gcc -o conftest -g -O2   -I/usr/X11R6/include -lpthread  -L/usr/X11R6/lib conftest.c -lm  -lm -L/usr/lib -lcurl -L/usr/lib -lgssapi_krb5 -lkrb5 -lk5crypto -lkrb5support -lcom_err -lresolv -lidn -lssl -lcrypto -ldl -lssl -lcrypto -lz  >&5
conftest.c:51: warning: conflicting types for built-in function 'atanf'
configure:22466: $? = 0
configure:22469: test -z 			 || test ! -s conftest.err
configure:22472: $? = 0
configure:22475: test -s conftest
configure:22478: $? = 0
configure:22491: result: yes
configure:22501: checking for cosf in -lm
configure:22531: gcc -o conftest -g -O2   -I/usr/X11R6/include -lpthread  -L/usr/X11R6/lib conftest.c -lm  -lm -L/usr/lib -lcurl -L/usr/lib -lgssapi_krb5 -lkrb5 -lk5crypto -lkrb5support -lcom_err -lresolv -lidn -lssl -lcrypto -ldl -lssl -lcrypto -lz  >&5
conftest.c:52: warning: conflicting types for built-in function 'cosf'
configure:22537: $? = 0
configure:22540: test -z 			 || test ! -s conftest.err
configure:22543: $? = 0
configure:22546: test -s conftest
configure:22549: $? = 0
configure:22562: result: yes
configure:22572: checking for expf in -lm
configure:22602: gcc -o conftest -g -O2   -I/usr/X11R6/include -lpthread  -L/usr/X11R6/lib conftest.c -lm  -lm -L/usr/lib -lcurl -L/usr/lib -lgssapi_krb5 -lkrb5 -lk5crypto -lkrb5support -lcom_err -lresolv -lidn -lssl -lcrypto -ldl -lssl -lcrypto -lz  >&5
conftest.c:53: warning: conflicting types for built-in function 'expf'
configure:22608: $? = 0
configure:22611: test -z 			 || test ! -s conftest.err
configure:22614: $? = 0
configure:22617: test -s conftest
configure:22620: $? = 0
configure:22633: result: yes
configure:22643: checking for fabsf in -lm
configure:22673: gcc -o conftest -g -O2   -I/usr/X11R6/include -lpthread  -L/usr/X11R6/lib conftest.c -lm  -lm -L/usr/lib -lcurl -L/usr/lib -lgssapi_krb5 -lkrb5 -lk5crypto -lkrb5support -lcom_err -lresolv -lidn -lssl -lcrypto -ldl -lssl -lcrypto -lz  >&5
conftest.c:54: warning: conflicting types for built-in function 'fabsf'
configure:22679: $? = 0
configure:22682: test -z 			 || test ! -s conftest.err
configure:22685: $? = 0
configure:22688: test -s conftest
configure:22691: $? = 0
configure:22704: result: yes
configure:22714: checking for floorf in -lm
configure:22744: gcc -o conftest -g -O2   -I/usr/X11R6/include -lpthread  -L/usr/X11R6/lib conftest.c -lm  -lm -L/usr/lib -lcurl -L/usr/lib -lgssapi_krb5 -lkrb5 -lk5crypto -lkrb5support -lcom_err -lresolv -lidn -lssl -lcrypto -ldl -lssl -lcrypto -lz  >&5
conftest.c:55: warning: conflicting types for built-in function 'floorf'
configure:22750: $? = 0
configure:22753: test -z 			 || test ! -s conftest.err
configure:22756: $? = 0
configure:22759: test -s conftest
configure:22762: $? = 0
configure:22775: result: yes
configure:22785: checking for fmodf in -lm
configure:22815: gcc -o conftest -g -O2   -I/usr/X11R6/include -lpthread  -L/usr/X11R6/lib conftest.c -lm  -lm -L/usr/lib -lcurl -L/usr/lib -lgssapi_krb5 -lkrb5 -lk5crypto -lkrb5support -lcom_err -lresolv -lidn -lssl -lcrypto -ldl -lssl -lcrypto -lz  >&5
conftest.c:56: warning: conflicting types for built-in function 'fmodf'
configure:22821: $? = 0
configure:22824: test -z 			 || test ! -s conftest.err
configure:22827: $? = 0
configure:22830: test -s conftest
configure:22833: $? = 0
configure:22846: result: yes
configure:22856: checking for hypotf in -lm
configure:22886: gcc -o conftest -g -O2   -I/usr/X11R6/include -lpthread  -L/usr/X11R6/lib conftest.c -lm  -lm -L/usr/lib -lcurl -L/usr/lib -lgssapi_krb5 -lkrb5 -lk5crypto -lkrb5support -lcom_err -lresolv -lidn -lssl -lcrypto -ldl -lssl -lcrypto -lz  >&5
conftest.c:57: warning: conflicting types for built-in function 'hypotf'
configure:22892: $? = 0
configure:22895: test -z 			 || test ! -s conftest.err
configure:22898: $? = 0
configure:22901: test -s conftest
configure:22904: $? = 0
configure:22917: result: yes
configure:22927: checking for logf in -lm
configure:22957: gcc -o conftest -g -O2   -I/usr/X11R6/include -lpthread  -L/usr/X11R6/lib conftest.c -lm  -lm -L/usr/lib -lcurl -L/usr/lib -lgssapi_krb5 -lkrb5 -lk5crypto -lkrb5support -lcom_err -lresolv -lidn -lssl -lcrypto -ldl -lssl -lcrypto -lz  >&5
conftest.c:58: warning: conflicting types for built-in function 'logf'
configure:22963: $? = 0
configure:22966: test -z 			 || test ! -s conftest.err
configure:22969: $? = 0
configure:22972: test -s conftest
configure:22975: $? = 0
configure:22988: result: yes
configure:22998: checking for log10f in -lm
configure:23028: gcc -o conftest -g -O2   -I/usr/X11R6/include -lpthread  -L/usr/X11R6/lib conftest.c -lm  -lm -L/usr/lib -lcurl -L/usr/lib -lgssapi_krb5 -lkrb5 -lk5crypto -lkrb5support -lcom_err -lresolv -lidn -lssl -lcrypto -ldl -lssl -lcrypto -lz  >&5
conftest.c:59: warning: conflicting types for built-in function 'log10f'
configure:23034: $? = 0
configure:23037: test -z 			 || test ! -s conftest.err
configure:23040: $? = 0
configure:23043: test -s conftest
configure:23046: $? = 0
configure:23059: result: yes
configure:23069: checking for powf in -lm
configure:23099: gcc -o conftest -g -O2   -I/usr/X11R6/include -lpthread  -L/usr/X11R6/lib conftest.c -lm  -lm -L/usr/lib -lcurl -L/usr/lib -lgssapi_krb5 -lkrb5 -lk5crypto -lkrb5support -lcom_err -lresolv -lidn -lssl -lcrypto -ldl -lssl -lcrypto -lz  >&5
conftest.c:60: warning: conflicting types for built-in function 'powf'
configure:23105: $? = 0
configure:23108: test -z 			 || test ! -s conftest.err
configure:23111: $? = 0
configure:23114: test -s conftest
configure:23117: $? = 0
configure:23130: result: yes
configure:23140: checking for sinf in -lm
configure:23170: gcc -o conftest -g -O2   -I/usr/X11R6/include -lpthread  -L/usr/X11R6/lib conftest.c -lm  -lm -L/usr/lib -lcurl -L/usr/lib -lgssapi_krb5 -lkrb5 -lk5crypto -lkrb5support -lcom_err -lresolv -lidn -lssl -lcrypto -ldl -lssl -lcrypto -lz  >&5
conftest.c:61: warning: conflicting types for built-in function 'sinf'
configure:23176: $? = 0
configure:23179: test -z 			 || test ! -s conftest.err
configure:23182: $? = 0
configure:23185: test -s conftest
configure:23188: $? = 0
configure:23201: result: yes
configure:23211: checking for sqrtf in -lm
configure:23272: result: yes
configure:23282: checking for tanf in -lm
configure:23312: gcc -o conftest -g -O2   -I/usr/X11R6/include -lpthread  -L/usr/X11R6/lib conftest.c -lm  -lm -L/usr/lib -lcurl -L/usr/lib -lgssapi_krb5 -lkrb5 -lk5crypto -lkrb5support -lcom_err -lresolv -lidn -lssl -lcrypto -ldl -lssl -lcrypto -lz  >&5
conftest.c:63: warning: conflicting types for built-in function 'tanf'
configure:23318: $? = 0
configure:23321: test -z 			 || test ! -s conftest.err
configure:23324: $? = 0
configure:23327: test -s conftest
configure:23330: $? = 0
configure:23343: result: yes
configure:23365: checking for XextAddDisplay in -lXext
configure:23395: gcc -o conftest -g -O2   -I/usr/X11R6/include -lpthread  -L/usr/X11R6/lib conftest.c -lXext  -lSM -lICE -lX11   -lm -L/usr/lib -lcurl -L/usr/lib -lgssapi_krb5 -lkrb5 -lk5crypto -lkrb5support -lcom_err -lresolv -lidn -lssl -lcrypto -ldl -lssl -lcrypto -lz  >&5
configure:23401: $? = 0
configure:23404: test -z 			 || test ! -s conftest.err
configure:23407: $? = 0
configure:23410: test -s conftest
configure:23413: $? = 0
configure:23426: result: yes
configure:23434: checking for XF86VidModeGetAllModeLines in -lXxf86vm
configure:23464: gcc -o conftest -g -O2   -I/usr/X11R6/include -lpthread  -L/usr/X11R6/lib conftest.c -lXxf86vm -lXext  -lSM -lICE -lX11   -lm -L/usr/lib -lcurl -L/usr/lib -lgssapi_krb5 -lkrb5 -lk5crypto -lkrb5support -lcom_err -lresolv -lidn -lssl -lcrypto -ldl -lssl -lcrypto -lz  >&5
/usr/bin/ld: cannot find -lXxf86vm
collect2: ld returned 1 exit status
configure:23470: $? = 1
configure: failed program was:
| /* confdefs.h.  */
| 
| #define PACKAGE_NAME ""
| #define PACKAGE_TARNAME ""
| #define PACKAGE_VERSION ""
| #define PACKAGE_STRING ""
| #define PACKAGE_BUGREPORT ""
| #define PACKAGE "bzflag"
| #define VERSION "2.0.8"
| #define BZ_BUILD_OS "linux-gnu"
| #define BZ_BUILD_USER "tropican8"
| #define BUILD_REGEX 1
| #ifdef __cplusplus
| void exit (int);
| #endif
| #define STDC_HEADERS 1
| #define HAVE_SYS_TYPES_H 1
| #define HAVE_SYS_STAT_H 1
| #define HAVE_STDLIB_H 1
| #define HAVE_STRING_H 1
| #define HAVE_MEMORY_H 1
| #define HAVE_STRINGS_H 1
| #define HAVE_INTTYPES_H 1
| #define HAVE_STDINT_H 1
| #define HAVE_UNISTD_H 1
| #define HAVE_DLFCN_H 1
| #define STDC_HEADERS 1
| #define HAVE_GL_GLX_H 1
| #define HAVE_SDL_SDL_H 1
| #define HAVE_X11_XLIB_H 1
| #define HAVE_LINUX_INPUT_H 1
| #define HAVE_STDINT_H 1
| #define HAVE_SYS_PARAM_H 1
| #define HAVE_UNISTD_H 1
| #define HAVE_VALUES_H 1
| #define HAVE_SOCKLEN_T 1
| #define HAVE_FF_EFFECT_RUMBLE 1
| #define HAVE_FF_EFFECT_DIRECTIONAL 1
| #define HAVE_LIBM 1
| #define HAVE_ACOSF 1
| #define HAVE_ASINF 1
| #define HAVE_ATAN2F 1
| #define HAVE_ATANF 1
| #define HAVE_COSF 1
| #define HAVE_EXPF 1
| #define HAVE_FABSF 1
| #define HAVE_FLOORF 1
| #define HAVE_FMODF 1
| #define HAVE_HYPOTF 1
| #define HAVE_LOGF 1
| #define HAVE_LOG10F 1
| #define HAVE_POWF 1
| #define HAVE_SINF 1
| #define HAVE_SQRTF 1
| #define HAVE_TANF 1
| /* end confdefs.h.  */
| 
| /* Override any gcc2 internal prototype to avoid an error.  */
| #ifdef __cplusplus
| extern "C"
| #endif
| /* We use char because int might match the return type of a gcc2
|    builtin and then its argument prototype would still apply.  */
| char XF86VidModeGetAllModeLines ();
| int
| main ()
| {
| XF86VidModeGetAllModeLines ();
|   ;
|   return 0;
| }
configure:23495: result: no
configure:23501: checking for XListInputDevices in -lXi
configure:23531: gcc -o conftest -g -O2   -I/usr/X11R6/include -lpthread  -L/usr/X11R6/lib conftest.c -lXi -lXext  -lSM -lICE -lX11   -lm -L/usr/lib -lcurl -L/usr/lib -lgssapi_krb5 -lkrb5 -lk5crypto -lkrb5support -lcom_err -lresolv -lidn -lssl -lcrypto -ldl -lssl -lcrypto -lz  >&5
configure:23537: $? = 0
configure:23540: test -z 			 || test ! -s conftest.err
configure:23543: $? = 0
configure:23546: test -s conftest
configure:23549: $? = 0
configure:23562: result: yes
configure:23601: g++ -o conftest    -I/usr/X11R6/include -lpthread  -L/usr/X11R6/lib conftest.cc -lm -L/usr/lib -lcurl -L/usr/lib -lgssapi_krb5 -lkrb5 -lk5crypto -lkrb5support -lcom_err -lresolv -lidn -lssl -lcrypto -ldl -lssl -lcrypto -lz  >&5
./configure: line 23602: g++: command not found
configure:23607: $? = 127
configure: failed program was:
| /* confdefs.h.  */
| 
| #define PACKAGE_NAME ""
| #define PACKAGE_TARNAME ""
| #define PACKAGE_VERSION ""
| #define PACKAGE_STRING ""
| #define PACKAGE_BUGREPORT ""
| #define PACKAGE "bzflag"
| #define VERSION "2.0.8"
| #define BZ_BUILD_OS "linux-gnu"
| #define BZ_BUILD_USER "tropican8"
| #define BUILD_REGEX 1
| #ifdef __cplusplus
| void exit (int);
| #endif
| #define STDC_HEADERS 1
| #define HAVE_SYS_TYPES_H 1
| #define HAVE_SYS_STAT_H 1
| #define HAVE_STDLIB_H 1
| #define HAVE_STRING_H 1
| #define HAVE_MEMORY_H 1
| #define HAVE_STRINGS_H 1
| #define HAVE_INTTYPES_H 1
| #define HAVE_STDINT_H 1
| #define HAVE_UNISTD_H 1
| #define HAVE_DLFCN_H 1
| #define STDC_HEADERS 1
| #define HAVE_GL_GLX_H 1
| #define HAVE_SDL_SDL_H 1
| #define HAVE_X11_XLIB_H 1
| #define HAVE_LINUX_INPUT_H 1
| #define HAVE_STDINT_H 1
| #define HAVE_SYS_PARAM_H 1
| #define HAVE_UNISTD_H 1
| #define HAVE_VALUES_H 1
| #define HAVE_SOCKLEN_T 1
| #define HAVE_FF_EFFECT_RUMBLE 1
| #define HAVE_FF_EFFECT_DIRECTIONAL 1
| #define HAVE_LIBM 1
| #define HAVE_ACOSF 1
| #define HAVE_ASINF 1
| #define HAVE_ATAN2F 1
| #define HAVE_ATANF 1
| #define HAVE_COSF 1
| #define HAVE_EXPF 1
| #define HAVE_FABSF 1
| #define HAVE_FLOORF 1
| #define HAVE_FMODF 1
| #define HAVE_HYPOTF 1
| #define HAVE_LOGF 1
| #define HAVE_LOG10F 1
| #define HAVE_POWF 1
| #define HAVE_SINF 1
| #define HAVE_SQRTF 1
| #define HAVE_TANF 1
| /* end confdefs.h.  */
| 
| #include <sys/types.h>
| #include <regex.h>
| 
| int
| main ()
| {
| 
| regcomp(0, 0, 0);
| regexec(0, 0, 0, 0, 0);
| 
|   ;
|   return 0;
| }
configure:23655: g++ -o conftest    -I/usr/X11R6/include -lpthread  -L/usr/X11R6/lib conftest.cc -framework OpenGL -lXi -lXext  -lSM -lICE -lX11   -lm -L/usr/lib -lcurl -L/usr/lib -lgssapi_krb5 -lkrb5 -lk5crypto -lkrb5support -lcom_err -lresolv -lidn -lssl -lcrypto -ldl -lssl -lcrypto -lz  >&5
./configure: line 23656: g++: command not found
configure:23661: $? = 127
configure: failed program was:
| /* confdefs.h.  */
| 
| #define PACKAGE_NAME ""
| #define PACKAGE_TARNAME ""
| #define PACKAGE_VERSION ""
| #define PACKAGE_STRING ""
| #define PACKAGE_BUGREPORT ""
| #define PACKAGE "bzflag"
| #define VERSION "2.0.8"
| #define BZ_BUILD_OS "linux-gnu"
| #define BZ_BUILD_USER "tropican8"
| #define BUILD_REGEX 1
| #ifdef __cplusplus
| void exit (int);
| #endif
| #define STDC_HEADERS 1
| #define HAVE_SYS_TYPES_H 1
| #define HAVE_SYS_STAT_H 1
| #define HAVE_STDLIB_H 1
| #define HAVE_STRING_H 1
| #define HAVE_MEMORY_H 1
| #define HAVE_STRINGS_H 1
| #define HAVE_INTTYPES_H 1
| #define HAVE_STDINT_H 1
| #define HAVE_UNISTD_H 1
| #define HAVE_DLFCN_H 1
| #define STDC_HEADERS 1
| #define HAVE_GL_GLX_H 1
| #define HAVE_SDL_SDL_H 1
| #define HAVE_X11_XLIB_H 1
| #define HAVE_LINUX_INPUT_H 1
| #define HAVE_STDINT_H 1
| #define HAVE_SYS_PARAM_H 1
| #define HAVE_UNISTD_H 1
| #define HAVE_VALUES_H 1
| #define HAVE_SOCKLEN_T 1
| #define HAVE_FF_EFFECT_RUMBLE 1
| #define HAVE_FF_EFFECT_DIRECTIONAL 1
| #define HAVE_LIBM 1
| #define HAVE_ACOSF 1
| #define HAVE_ASINF 1
| #define HAVE_ATAN2F 1
| #define HAVE_ATANF 1
| #define HAVE_COSF 1
| #define HAVE_EXPF 1
| #define HAVE_FABSF 1
| #define HAVE_FLOORF 1
| #define HAVE_FMODF 1
| #define HAVE_HYPOTF 1
| #define HAVE_LOGF 1
| #define HAVE_LOG10F 1
| #define HAVE_POWF 1
| #define HAVE_SINF 1
| #define HAVE_SQRTF 1
| #define HAVE_TANF 1
| /* end confdefs.h.  */
| #include <OpenGL/gl.h>
| int
| main ()
| {
| glBegin(GL_POINTS)
|   ;
|   return 0;
| }
configure:23701: g++ -o conftest    -I/usr/X11R6/include -lpthread  -L/usr/X11R6/lib conftest.cc -lopengl32 -lXi -lXext  -lSM -lICE -lX11   -lm -L/usr/lib -lcurl -L/usr/lib -lgssapi_krb5 -lkrb5 -lk5crypto -lkrb5support -lcom_err -lresolv -lidn -lssl -lcrypto -ldl -lssl -lcrypto -lz  >&5
./configure: line 23702: g++: command not found
configure:23707: $? = 127
configure: failed program was:
| /* confdefs.h.  */
| 
| #define PACKAGE_NAME ""
| #define PACKAGE_TARNAME ""
| #define PACKAGE_VERSION ""
| #define PACKAGE_STRING ""
| #define PACKAGE_BUGREPORT ""
| #define PACKAGE "bzflag"
| #define VERSION "2.0.8"
| #define BZ_BUILD_OS "linux-gnu"
| #define BZ_BUILD_USER "tropican8"
| #define BUILD_REGEX 1
| #ifdef __cplusplus
| void exit (int);
| #endif
| #define STDC_HEADERS 1
| #define HAVE_SYS_TYPES_H 1
| #define HAVE_SYS_STAT_H 1
| #define HAVE_STDLIB_H 1
| #define HAVE_STRING_H 1
| #define HAVE_MEMORY_H 1
| #define HAVE_STRINGS_H 1
| #define HAVE_INTTYPES_H 1
| #define HAVE_STDINT_H 1
| #define HAVE_UNISTD_H 1
| #define HAVE_DLFCN_H 1
| #define STDC_HEADERS 1
| #define HAVE_GL_GLX_H 1
| #define HAVE_SDL_SDL_H 1
| #define HAVE_X11_XLIB_H 1
| #define HAVE_LINUX_INPUT_H 1
| #define HAVE_STDINT_H 1
| #define HAVE_SYS_PARAM_H 1
| #define HAVE_UNISTD_H 1
| #define HAVE_VALUES_H 1
| #define HAVE_SOCKLEN_T 1
| #define HAVE_FF_EFFECT_RUMBLE 1
| #define HAVE_FF_EFFECT_DIRECTIONAL 1
| #define HAVE_LIBM 1
| #define HAVE_ACOSF 1
| #define HAVE_ASINF 1
| #define HAVE_ATAN2F 1
| #define HAVE_ATANF 1
| #define HAVE_COSF 1
| #define HAVE_EXPF 1
| #define HAVE_FABSF 1
| #define HAVE_FLOORF 1
| #define HAVE_FMODF 1
| #define HAVE_HYPOTF 1
| #define HAVE_LOGF 1
| #define HAVE_LOG10F 1
| #define HAVE_POWF 1
| #define HAVE_SINF 1
| #define HAVE_SQRTF 1
| #define HAVE_TANF 1
| /* end confdefs.h.  */
| #include <GL/gl.h>
| int
| main ()
| {
| glBegin(GL_POINTS)
|   ;
|   return 0;
| }
configure:23701: g++ -o conftest    -I/usr/X11R6/include -lpthread  -L/usr/X11R6/lib conftest.cc -lGL -lXi -lXext  -lSM -lICE -lX11   -lm -L/usr/lib -lcurl -L/usr/lib -lgssapi_krb5 -lkrb5 -lk5crypto -lkrb5support -lcom_err -lresolv -lidn -lssl -lcrypto -ldl -lssl -lcrypto -lz  >&5
./configure: line 23702: g++: command not found
configure:23707: $? = 127
configure: failed program was:
| /* confdefs.h.  */
| 
| #define PACKAGE_NAME ""
| #define PACKAGE_TARNAME ""
| #define PACKAGE_VERSION ""
| #define PACKAGE_STRING ""
| #define PACKAGE_BUGREPORT ""
| #define PACKAGE "bzflag"
| #define VERSION "2.0.8"
| #define BZ_BUILD_OS "linux-gnu"
| #define BZ_BUILD_USER "tropican8"
| #define BUILD_REGEX 1
| #ifdef __cplusplus
| void exit (int);
| #endif
| #define STDC_HEADERS 1
| #define HAVE_SYS_TYPES_H 1
| #define HAVE_SYS_STAT_H 1
| #define HAVE_STDLIB_H 1
| #define HAVE_STRING_H 1
| #define HAVE_MEMORY_H 1
| #define HAVE_STRINGS_H 1
| #define HAVE_INTTYPES_H 1
| #define HAVE_STDINT_H 1
| #define HAVE_UNISTD_H 1
| #define HAVE_DLFCN_H 1
| #define STDC_HEADERS 1
| #define HAVE_GL_GLX_H 1
| #define HAVE_SDL_SDL_H 1
| #define HAVE_X11_XLIB_H 1
| #define HAVE_LINUX_INPUT_H 1
| #define HAVE_STDINT_H 1
| #define HAVE_SYS_PARAM_H 1
| #define HAVE_UNISTD_H 1
| #define HAVE_VALUES_H 1
| #define HAVE_SOCKLEN_T 1
| #define HAVE_FF_EFFECT_RUMBLE 1
| #define HAVE_FF_EFFECT_DIRECTIONAL 1
| #define HAVE_LIBM 1
| #define HAVE_ACOSF 1
| #define HAVE_ASINF 1
| #define HAVE_ATAN2F 1
| #define HAVE_ATANF 1
| #define HAVE_COSF 1
| #define HAVE_EXPF 1
| #define HAVE_FABSF 1
| #define HAVE_FLOORF 1
| #define HAVE_FMODF 1
| #define HAVE_HYPOTF 1
| #define HAVE_LOGF 1
| #define HAVE_LOG10F 1
| #define HAVE_POWF 1
| #define HAVE_SINF 1
| #define HAVE_SQRTF 1
| #define HAVE_TANF 1
| /* end confdefs.h.  */
| #include <GL/gl.h>
| int
| main ()
| {
| glBegin(GL_POINTS)
|   ;
|   return 0;
| }
configure:23701: g++ -o conftest    -I/usr/X11R6/include -lpthread  -L/usr/X11R6/lib conftest.cc -lGL2 -lXi -lXext  -lSM -lICE -lX11   -lm -L/usr/lib -lcurl -L/usr/lib -lgssapi_krb5 -lkrb5 -lk5crypto -lkrb5support -lcom_err -lresolv -lidn -lssl -lcrypto -ldl -lssl -lcrypto -lz  >&5
./configure: line 23702: g++: command not found
configure:23707: $? = 127
configure: failed program was:
| /* confdefs.h.  */
| 
| #define PACKAGE_NAME ""
| #define PACKAGE_TARNAME ""
| #define PACKAGE_VERSION ""
| #define PACKAGE_STRING ""
| #define PACKAGE_BUGREPORT ""
| #define PACKAGE "bzflag"
| #define VERSION "2.0.8"
| #define BZ_BUILD_OS "linux-gnu"
| #define BZ_BUILD_USER "tropican8"
| #define BUILD_REGEX 1
| #ifdef __cplusplus
| void exit (int);
| #endif
| #define STDC_HEADERS 1
| #define HAVE_SYS_TYPES_H 1
| #define HAVE_SYS_STAT_H 1
| #define HAVE_STDLIB_H 1
| #define HAVE_STRING_H 1
| #define HAVE_MEMORY_H 1
| #define HAVE_STRINGS_H 1
| #define HAVE_INTTYPES_H 1
| #define HAVE_STDINT_H 1
| #define HAVE_UNISTD_H 1
| #define HAVE_DLFCN_H 1
| #define STDC_HEADERS 1
| #define HAVE_GL_GLX_H 1
| #define HAVE_SDL_SDL_H 1
| #define HAVE_X11_XLIB_H 1
| #define HAVE_LINUX_INPUT_H 1
| #define HAVE_STDINT_H 1
| #define HAVE_SYS_PARAM_H 1
| #define HAVE_UNISTD_H 1
| #define HAVE_VALUES_H 1
| #define HAVE_SOCKLEN_T 1
| #define HAVE_FF_EFFECT_RUMBLE 1
| #define HAVE_FF_EFFECT_DIRECTIONAL 1
| #define HAVE_LIBM 1
| #define HAVE_ACOSF 1
| #define HAVE_ASINF 1
| #define HAVE_ATAN2F 1
| #define HAVE_ATANF 1
| #define HAVE_COSF 1
| #define HAVE_EXPF 1
| #define HAVE_FABSF 1
| #define HAVE_FLOORF 1
| #define HAVE_FMODF 1
| #define HAVE_HYPOTF 1
| #define HAVE_LOGF 1
| #define HAVE_LOG10F 1
| #define HAVE_POWF 1
| #define HAVE_SINF 1
| #define HAVE_SQRTF 1
| #define HAVE_TANF 1
| /* end confdefs.h.  */
| #include <GL/gl.h>
| int
| main ()
| {
| glBegin(GL_POINTS)
|   ;
|   return 0;
| }
configure:23843: checking for GLEW library
configure:23864: g++ -o conftest    -I/usr/X11R6/include -lpthread  -L/usr/X11R6/lib conftest.cc -lGLEW >&5
./configure: line 23865: g++: command not found
configure:23870: $? = 127
configure: failed program was:
| /* confdefs.h.  */
| 
| #define PACKAGE_NAME ""
| #define PACKAGE_TARNAME ""
| #define PACKAGE_VERSION ""
| #define PACKAGE_STRING ""
| #define PACKAGE_BUGREPORT ""
| #define PACKAGE "bzflag"
| #define VERSION "2.0.8"
| #define BZ_BUILD_OS "linux-gnu"
| #define BZ_BUILD_USER "tropican8"
| #define BUILD_REGEX 1
| #ifdef __cplusplus
| void exit (int);
| #endif
| #define STDC_HEADERS 1
| #define HAVE_SYS_TYPES_H 1
| #define HAVE_SYS_STAT_H 1
| #define HAVE_STDLIB_H 1
| #define HAVE_STRING_H 1
| #define HAVE_MEMORY_H 1
| #define HAVE_STRINGS_H 1
| #define HAVE_INTTYPES_H 1
| #define HAVE_STDINT_H 1
| #define HAVE_UNISTD_H 1
| #define HAVE_DLFCN_H 1
| #define STDC_HEADERS 1
| #define HAVE_GL_GLX_H 1
| #define HAVE_SDL_SDL_H 1
| #define HAVE_X11_XLIB_H 1
| #define HAVE_LINUX_INPUT_H 1
| #define HAVE_STDINT_H 1
| #define HAVE_SYS_PARAM_H 1
| #define HAVE_UNISTD_H 1
| #define HAVE_VALUES_H 1
| #define HAVE_SOCKLEN_T 1
| #define HAVE_FF_EFFECT_RUMBLE 1
| #define HAVE_FF_EFFECT_DIRECTIONAL 1
| #define HAVE_LIBM 1
| #define HAVE_ACOSF 1
| #define HAVE_ASINF 1
| #define HAVE_ATAN2F 1
| #define HAVE_ATANF 1
| #define HAVE_COSF 1
| #define HAVE_EXPF 1
| #define HAVE_FABSF 1
| #define HAVE_FLOORF 1
| #define HAVE_FMODF 1
| #define HAVE_HYPOTF 1
| #define HAVE_LOGF 1
| #define HAVE_LOG10F 1
| #define HAVE_POWF 1
| #define HAVE_SINF 1
| #define HAVE_SQRTF 1
| #define HAVE_TANF 1
| /* end confdefs.h.  */
| #include <GL/glew.h>
| int
| main ()
| {
| glewInit()
|   ;
|   return 0;
| }
configure:23902: result: no
configure:24166: checking for ares_init in -lcares
configure:24196: g++ -o conftest    -I/usr/X11R6/include -lpthread  -L/usr/X11R6/lib conftest.cc -lcares  -lm -L/usr/lib -lcurl -L/usr/lib -lgssapi_krb5 -lkrb5 -lk5crypto -lkrb5support -lcom_err -lresolv -lidn -lssl -lcrypto -ldl -lssl -lcrypto -lz  >&5
./configure: line 24197: g++: command not found
configure:24202: $? = 127
configure: failed program was:
| /* confdefs.h.  */
| 
| #define PACKAGE_NAME ""
| #define PACKAGE_TARNAME ""
| #define PACKAGE_VERSION ""
| #define PACKAGE_STRING ""
| #define PACKAGE_BUGREPORT ""
| #define PACKAGE "bzflag"
| #define VERSION "2.0.8"
| #define BZ_BUILD_OS "linux-gnu"
| #define BZ_BUILD_USER "tropican8"
| #define BUILD_REGEX 1
| #ifdef __cplusplus
| void exit (int);
| #endif
| #define STDC_HEADERS 1
| #define HAVE_SYS_TYPES_H 1
| #define HAVE_SYS_STAT_H 1
| #define HAVE_STDLIB_H 1
| #define HAVE_STRING_H 1
| #define HAVE_MEMORY_H 1
| #define HAVE_STRINGS_H 1
| #define HAVE_INTTYPES_H 1
| #define HAVE_STDINT_H 1
| #define HAVE_UNISTD_H 1
| #define HAVE_DLFCN_H 1
| #define STDC_HEADERS 1
| #define HAVE_GL_GLX_H 1
| #define HAVE_SDL_SDL_H 1
| #define HAVE_X11_XLIB_H 1
| #define HAVE_LINUX_INPUT_H 1
| #define HAVE_STDINT_H 1
| #define HAVE_SYS_PARAM_H 1
| #define HAVE_UNISTD_H 1
| #define HAVE_VALUES_H 1
| #define HAVE_SOCKLEN_T 1
| #define HAVE_FF_EFFECT_RUMBLE 1
| #define HAVE_FF_EFFECT_DIRECTIONAL 1
| #define HAVE_LIBM 1
| #define HAVE_ACOSF 1
| #define HAVE_ASINF 1
| #define HAVE_ATAN2F 1
| #define HAVE_ATANF 1
| #define HAVE_COSF 1
| #define HAVE_EXPF 1
| #define HAVE_FABSF 1
| #define HAVE_FLOORF 1
| #define HAVE_FMODF 1
| #define HAVE_HYPOTF 1
| #define HAVE_LOGF 1
| #define HAVE_LOG10F 1
| #define HAVE_POWF 1
| #define HAVE_SINF 1
| #define HAVE_SQRTF 1
| #define HAVE_TANF 1
| /* end confdefs.h.  */
| 
| /* Override any gcc2 internal prototype to avoid an error.  */
| #ifdef __cplusplus
| extern "C"
| #endif
| /* We use char because int might match the return type of a gcc2
|    builtin and then its argument prototype would still apply.  */
| char ares_init ();
| int
| main ()
| {
| ares_init ();
|   ;
|   return 0;
| }
configure:24227: result: no
configure:24246: WARNING: using an internal c-ares lib.
configure:24248: WARNING: Consider installing an updated library at system level
configure:24250: WARNING: link is http://daniel.haxx.se/projects/c-ares/
configure:24271: checking for working ncurses
configure:24296: g++ -o conftest    -I/usr/X11R6/include -lpthread  -L/usr/X11R6/lib conftest.cc -lm -L/usr/lib -lcurl -L/usr/lib -lgssapi_krb5 -lkrb5 -lk5crypto -lkrb5support -lcom_err -lresolv -lidn -lssl -lcrypto -ldl -lssl -lcrypto -lz  -lncurses >&5
./configure: line 24297: g++: command not found
configure:24302: $? = 127
configure: failed program was:
| 
| 	/* confdefs.h.  */
| 
| #define PACKAGE_NAME ""
| #define PACKAGE_TARNAME ""
| #define PACKAGE_VERSION ""
| #define PACKAGE_STRING ""
| #define PACKAGE_BUGREPORT ""
| #define PACKAGE "bzflag"
| #define VERSION "2.0.8"
| #define BZ_BUILD_OS "linux-gnu"
| #define BZ_BUILD_USER "tropican8"
| #define BUILD_REGEX 1
| #ifdef __cplusplus
| void exit (int);
| #endif
| #define STDC_HEADERS 1
| #define HAVE_SYS_TYPES_H 1
| #define HAVE_SYS_STAT_H 1
| #define HAVE_STDLIB_H 1
| #define HAVE_STRING_H 1
| #define HAVE_MEMORY_H 1
| #define HAVE_STRINGS_H 1
| #define HAVE_INTTYPES_H 1
| #define HAVE_STDINT_H 1
| #define HAVE_UNISTD_H 1
| #define HAVE_DLFCN_H 1
| #define STDC_HEADERS 1
| #define HAVE_GL_GLX_H 1
| #define HAVE_SDL_SDL_H 1
| #define HAVE_X11_XLIB_H 1
| #define HAVE_LINUX_INPUT_H 1
| #define HAVE_STDINT_H 1
| #define HAVE_SYS_PARAM_H 1
| #define HAVE_UNISTD_H 1
| #define HAVE_VALUES_H 1
| #define HAVE_SOCKLEN_T 1
| #define HAVE_FF_EFFECT_RUMBLE 1
| #define HAVE_FF_EFFECT_DIRECTIONAL 1
| #define HAVE_LIBM 1
| #define HAVE_ACOSF 1
| #define HAVE_ASINF 1
| #define HAVE_ATAN2F 1
| #define HAVE_ATANF 1
| #define HAVE_COSF 1
| #define HAVE_EXPF 1
| #define HAVE_FABSF 1
| #define HAVE_FLOORF 1
| #define HAVE_FMODF 1
| #define HAVE_HYPOTF 1
| #define HAVE_LOGF 1
| #define HAVE_LOG10F 1
| #define HAVE_POWF 1
| #define HAVE_SINF 1
| #define HAVE_SQRTF 1
| #define HAVE_TANF 1
| /* end confdefs.h.  */
| #include <ncurses.h>
| 
| int
| main ()
| {
| chtype a; int b=A_STANDOUT, c=KEY_LEFT; initscr();
| 
|   ;
|   return 0;
| }
configure:24326: result: no
configure:24340: checking for working curses
configure:24365: g++ -o conftest    -I/usr/X11R6/include -lpthread  -L/usr/X11R6/lib conftest.cc -lm -L/usr/lib -lcurl -L/usr/lib -lgssapi_krb5 -lkrb5 -lk5crypto -lkrb5support -lcom_err -lresolv -lidn -lssl -lcrypto -ldl -lssl -lcrypto -lz  -lcurses >&5
./configure: line 24366: g++: command not found
configure:24371: $? = 127
configure: failed program was:
| 
| 	/* confdefs.h.  */
| 
| #define PACKAGE_NAME ""
| #define PACKAGE_TARNAME ""
| #define PACKAGE_VERSION ""
| #define PACKAGE_STRING ""
| #define PACKAGE_BUGREPORT ""
| #define PACKAGE "bzflag"
| #define VERSION "2.0.8"
| #define BZ_BUILD_OS "linux-gnu"
| #define BZ_BUILD_USER "tropican8"
| #define BUILD_REGEX 1
| #ifdef __cplusplus
| void exit (int);
| #endif
| #define STDC_HEADERS 1
| #define HAVE_SYS_TYPES_H 1
| #define HAVE_SYS_STAT_H 1
| #define HAVE_STDLIB_H 1
| #define HAVE_STRING_H 1
| #define HAVE_MEMORY_H 1
| #define HAVE_STRINGS_H 1
| #define HAVE_INTTYPES_H 1
| #define HAVE_STDINT_H 1
| #define HAVE_UNISTD_H 1
| #define HAVE_DLFCN_H 1
| #define STDC_HEADERS 1
| #define HAVE_GL_GLX_H 1
| #define HAVE_SDL_SDL_H 1
| #define HAVE_X11_XLIB_H 1
| #define HAVE_LINUX_INPUT_H 1
| #define HAVE_STDINT_H 1
| #define HAVE_SYS_PARAM_H 1
| #define HAVE_UNISTD_H 1
| #define HAVE_VALUES_H 1
| #define HAVE_SOCKLEN_T 1
| #define HAVE_FF_EFFECT_RUMBLE 1
| #define HAVE_FF_EFFECT_DIRECTIONAL 1
| #define HAVE_LIBM 1
| #define HAVE_ACOSF 1
| #define HAVE_ASINF 1
| #define HAVE_ATAN2F 1
| #define HAVE_ATANF 1
| #define HAVE_COSF 1
| #define HAVE_EXPF 1
| #define HAVE_FABSF 1
| #define HAVE_FLOORF 1
| #define HAVE_FMODF 1
| #define HAVE_HYPOTF 1
| #define HAVE_LOGF 1
| #define HAVE_LOG10F 1
| #define HAVE_POWF 1
| #define HAVE_SINF 1
| #define HAVE_SQRTF 1
| #define HAVE_TANF 1
| /* end confdefs.h.  */
| #include <curses.h>
| 
| int
| main ()
| {
| chtype a; int b=A_STANDOUT, c=KEY_LEFT; initscr();
| 
|   ;
|   return 0;
| }
configure:24395: result: no
configure:24409: checking for working PDcurses
configure:24434: g++ -o conftest    -I/usr/X11R6/include -lpthread  -L/usr/X11R6/lib conftest.cc -lm -L/usr/lib -lcurl -L/usr/lib -lgssapi_krb5 -lkrb5 -lk5crypto -lkrb5support -lcom_err -lresolv -lidn -lssl -lcrypto -ldl -lssl -lcrypto -lz  -lpdcurses >&5
./configure: line 24435: g++: command not found
configure:24440: $? = 127
configure: failed program was:
| 
| 	/* confdefs.h.  */
| 
| #define PACKAGE_NAME ""
| #define PACKAGE_TARNAME ""
| #define PACKAGE_VERSION ""
| #define PACKAGE_STRING ""
| #define PACKAGE_BUGREPORT ""
| #define PACKAGE "bzflag"
| #define VERSION "2.0.8"
| #define BZ_BUILD_OS "linux-gnu"
| #define BZ_BUILD_USER "tropican8"
| #define BUILD_REGEX 1
| #ifdef __cplusplus
| void exit (int);
| #endif
| #define STDC_HEADERS 1
| #define HAVE_SYS_TYPES_H 1
| #define HAVE_SYS_STAT_H 1
| #define HAVE_STDLIB_H 1
| #define HAVE_STRING_H 1
| #define HAVE_MEMORY_H 1
| #define HAVE_STRINGS_H 1
| #define HAVE_INTTYPES_H 1
| #define HAVE_STDINT_H 1
| #define HAVE_UNISTD_H 1
| #define HAVE_DLFCN_H 1
| #define STDC_HEADERS 1
| #define HAVE_GL_GLX_H 1
| #define HAVE_SDL_SDL_H 1
| #define HAVE_X11_XLIB_H 1
| #define HAVE_LINUX_INPUT_H 1
| #define HAVE_STDINT_H 1
| #define HAVE_SYS_PARAM_H 1
| #define HAVE_UNISTD_H 1
| #define HAVE_VALUES_H 1
| #define HAVE_SOCKLEN_T 1
| #define HAVE_FF_EFFECT_RUMBLE 1
| #define HAVE_FF_EFFECT_DIRECTIONAL 1
| #define HAVE_LIBM 1
| #define HAVE_ACOSF 1
| #define HAVE_ASINF 1
| #define HAVE_ATAN2F 1
| #define HAVE_ATANF 1
| #define HAVE_COSF 1
| #define HAVE_EXPF 1
| #define HAVE_FABSF 1
| #define HAVE_FLOORF 1
| #define HAVE_FMODF 1
| #define HAVE_HYPOTF 1
| #define HAVE_LOGF 1
| #define HAVE_LOG10F 1
| #define HAVE_POWF 1
| #define HAVE_SINF 1
| #define HAVE_SQRTF 1
| #define HAVE_TANF 1
| /* end confdefs.h.  */
| #include <curses.h>
| 
| int
| main ()
| {
| chtype a; int b=A_STANDOUT, c=KEY_LEFT; initscr();
| 
|   ;
|   return 0;
| }
configure:24464: result: no
configure:24479: checking for working XCurses
configure:24504: g++ -o conftest    -I/usr/X11R6/include -lpthread  -L/usr/X11R6/lib conftest.cc -lm -L/usr/lib -lcurl -L/usr/lib -lgssapi_krb5 -lkrb5 -lk5crypto -lkrb5support -lcom_err -lresolv -lidn -lssl -lcrypto -ldl -lssl -lcrypto -lz  -lXCurses -L/usr/X11R6/lib -lXaw -lXmu -lXt -lX11 -lSM -lICE -lXext >&5
./configure: line 24505: g++: command not found
configure:24510: $? = 127
configure: failed program was:
| 
| 	/* confdefs.h.  */
| 
| #define PACKAGE_NAME ""
| #define PACKAGE_TARNAME ""
| #define PACKAGE_VERSION ""
| #define PACKAGE_STRING ""
| #define PACKAGE_BUGREPORT ""
| #define PACKAGE "bzflag"
| #define VERSION "2.0.8"
| #define BZ_BUILD_OS "linux-gnu"
| #define BZ_BUILD_USER "tropican8"
| #define BUILD_REGEX 1
| #ifdef __cplusplus
| void exit (int);
| #endif
| #define STDC_HEADERS 1
| #define HAVE_SYS_TYPES_H 1
| #define HAVE_SYS_STAT_H 1
| #define HAVE_STDLIB_H 1
| #define HAVE_STRING_H 1
| #define HAVE_MEMORY_H 1
| #define HAVE_STRINGS_H 1
| #define HAVE_INTTYPES_H 1
| #define HAVE_STDINT_H 1
| #define HAVE_UNISTD_H 1
| #define HAVE_DLFCN_H 1
| #define STDC_HEADERS 1
| #define HAVE_GL_GLX_H 1
| #define HAVE_SDL_SDL_H 1
| #define HAVE_X11_XLIB_H 1
| #define HAVE_LINUX_INPUT_H 1
| #define HAVE_STDINT_H 1
| #define HAVE_SYS_PARAM_H 1
| #define HAVE_UNISTD_H 1
| #define HAVE_VALUES_H 1
| #define HAVE_SOCKLEN_T 1
| #define HAVE_FF_EFFECT_RUMBLE 1
| #define HAVE_FF_EFFECT_DIRECTIONAL 1
| #define HAVE_LIBM 1
| #define HAVE_ACOSF 1
| #define HAVE_ASINF 1
| #define HAVE_ATAN2F 1
| #define HAVE_ATANF 1
| #define HAVE_COSF 1
| #define HAVE_EXPF 1
| #define HAVE_FABSF 1
| #define HAVE_FLOORF 1
| #define HAVE_FMODF 1
| #define HAVE_HYPOTF 1
| #define HAVE_LOGF 1
| #define HAVE_LOG10F 1
| #define HAVE_POWF 1
| #define HAVE_SINF 1
| #define HAVE_SQRTF 1
| #define HAVE_TANF 1
| /* end confdefs.h.  */
| #include <xcurses.h>
| 
| int
| main ()
| {
| chtype a; int b=A_STANDOUT, c=KEY_LEFT; initscr();
| 
|   ;
|   return 0;
| }
configure:24534: result: no
configure:24556: WARNING: could not find a curses library, will build bzadmin without curses
configure:24617: checking for SDL framework
configure:24638: gcc -o conftest -g -O2   -I/usr/X11R6/include -lpthread  -L/usr/X11R6/lib -framework SDL conftest.c -lXi -lXext  -lSM -lICE -lX11   -lm -L/usr/lib -lcurl -L/usr/lib -lgssapi_krb5 -lkrb5 -lk5crypto -lkrb5support -lcom_err -lresolv -lidn -lssl -lcrypto -ldl -lssl -lcrypto -lz  >&5
gcc: SDL: No such file or directory
cc1: error: unrecognized command line option "-framework"
configure:24644: $? = 1
configure: failed program was:
| /* confdefs.h.  */
| 
| #define PACKAGE_NAME ""
| #define PACKAGE_TARNAME ""
| #define PACKAGE_VERSION ""
| #define PACKAGE_STRING ""
| #define PACKAGE_BUGREPORT ""
| #define PACKAGE "bzflag"
| #define VERSION "2.0.8"
| #define BZ_BUILD_OS "linux-gnu"
| #define BZ_BUILD_USER "tropican8"
| #define BUILD_REGEX 1
| #ifdef __cplusplus
| void exit (int);
| #endif
| #define STDC_HEADERS 1
| #define HAVE_SYS_TYPES_H 1
| #define HAVE_SYS_STAT_H 1
| #define HAVE_STDLIB_H 1
| #define HAVE_STRING_H 1
| #define HAVE_MEMORY_H 1
| #define HAVE_STRINGS_H 1
| #define HAVE_INTTYPES_H 1
| #define HAVE_STDINT_H 1
| #define HAVE_UNISTD_H 1
| #define HAVE_DLFCN_H 1
| #define STDC_HEADERS 1
| #define HAVE_GL_GLX_H 1
| #define HAVE_SDL_SDL_H 1
| #define HAVE_X11_XLIB_H 1
| #define HAVE_LINUX_INPUT_H 1
| #define HAVE_STDINT_H 1
| #define HAVE_SYS_PARAM_H 1
| #define HAVE_UNISTD_H 1
| #define HAVE_VALUES_H 1
| #define HAVE_SOCKLEN_T 1
| #define HAVE_FF_EFFECT_RUMBLE 1
| #define HAVE_FF_EFFECT_DIRECTIONAL 1
| #define HAVE_LIBM 1
| #define HAVE_ACOSF 1
| #define HAVE_ASINF 1
| #define HAVE_ATAN2F 1
| #define HAVE_ATANF 1
| #define HAVE_COSF 1
| #define HAVE_EXPF 1
| #define HAVE_FABSF 1
| #define HAVE_FLOORF 1
| #define HAVE_FMODF 1
| #define HAVE_HYPOTF 1
| #define HAVE_LOGF 1
| #define HAVE_LOG10F 1
| #define HAVE_POWF 1
| #define HAVE_SINF 1
| #define HAVE_SQRTF 1
| #define HAVE_TANF 1
| /* end confdefs.h.  */
| #include <SDL/SDL_version.h>
| int
| main ()
| {
| 
|   ;
|   return 0;
| }
configure:24667: result: no
configure:24716: checking for sdl-config
configure:24734: found /usr/bin/sdl-config
configure:24747: result: /usr/bin/sdl-config
configure:24755: checking for SDL - version >= 1.2.5
configure:24847: gcc -o conftest -g -O2 -I/usr/include/SDL -D_REENTRANT   -I/usr/X11R6/include -lpthread  -L/usr/X11R6/lib conftest.c -lXi -lXext  -lSM -lICE -lX11   -lm -L/usr/lib -lcurl -L/usr/lib -lgssapi_krb5 -lkrb5 -lk5crypto -lkrb5support -lcom_err -lresolv -lidn -lssl -lcrypto -ldl -lssl -lcrypto -lz  -L/usr/lib -lSDL -lpthread >&5
configure:24850: $? = 0
configure:24852: ./conftest
configure:24855: $? = 0
configure:24874: result: yes
configure:25004: checking for SDL_image library
configure:25025: g++ -o conftest    -I/usr/X11R6/include -lpthread  -L/usr/X11R6/lib conftest.cc -lSDL_image >&5
./configure: line 25026: g++: command not found
configure:25031: $? = 127
configure: failed program was:
| /* confdefs.h.  */
| 
| #define PACKAGE_NAME ""
| #define PACKAGE_TARNAME ""
| #define PACKAGE_VERSION ""
| #define PACKAGE_STRING ""
| #define PACKAGE_BUGREPORT ""
| #define PACKAGE "bzflag"
| #define VERSION "2.0.8"
| #define BZ_BUILD_OS "linux-gnu"
| #define BZ_BUILD_USER "tropican8"
| #define BUILD_REGEX 1
| #ifdef __cplusplus
| void exit (int);
| #endif
| #define STDC_HEADERS 1
| #define HAVE_SYS_TYPES_H 1
| #define HAVE_SYS_STAT_H 1
| #define HAVE_STDLIB_H 1
| #define HAVE_STRING_H 1
| #define HAVE_MEMORY_H 1
| #define HAVE_STRINGS_H 1
| #define HAVE_INTTYPES_H 1
| #define HAVE_STDINT_H 1
| #define HAVE_UNISTD_H 1
| #define HAVE_DLFCN_H 1
| #define STDC_HEADERS 1
| #define HAVE_GL_GLX_H 1
| #define HAVE_SDL_SDL_H 1
| #define HAVE_X11_XLIB_H 1
| #define HAVE_LINUX_INPUT_H 1
| #define HAVE_STDINT_H 1
| #define HAVE_SYS_PARAM_H 1
| #define HAVE_UNISTD_H 1
| #define HAVE_VALUES_H 1
| #define HAVE_SOCKLEN_T 1
| #define HAVE_FF_EFFECT_RUMBLE 1
| #define HAVE_FF_EFFECT_DIRECTIONAL 1
| #define HAVE_LIBM 1
| #define HAVE_ACOSF 1
| #define HAVE_ASINF 1
| #define HAVE_ATAN2F 1
| #define HAVE_ATANF 1
| #define HAVE_COSF 1
| #define HAVE_EXPF 1
| #define HAVE_FABSF 1
| #define HAVE_FLOORF 1
| #define HAVE_FMODF 1
| #define HAVE_HYPOTF 1
| #define HAVE_LOGF 1
| #define HAVE_LOG10F 1
| #define HAVE_POWF 1
| #define HAVE_SINF 1
| #define HAVE_SQRTF 1
| #define HAVE_TANF 1
| #define HAVE_SDL 1
| /* end confdefs.h.  */
| #include <SDL/SDL_image.h>
| int
| main ()
| {
| IMG_Load(NULL)
|   ;
|   return 0;
| }
configure:25063: result: no
configure:25104: WARNING: Client build has been requested, but GL is not fully available (missing gl.h)
     ... disabling client generation
configure:25341: checking if the compiler understands -Wl,-search_paths_first -mdynamic-no-pic
configure:25362: g++ -o conftest  -ffast-math -fno-exceptions -fsigned-char   -I/usr/X11R6/include -Wall -W -Wshadow -mtune=i686 -lpthread  -L/usr/X11R6/lib -Wl,-search_paths_first -mdynamic-no-pic conftest.cc -lm -L/usr/lib -lcurl -L/usr/lib -lgssapi_krb5 -lkrb5 -lk5crypto -lkrb5support -lcom_err -lresolv -lidn -lssl -lcrypto -ldl -lssl -lcrypto -lz  >&5
./configure: line 25363: g++: command not found
configure:25368: $? = 127
configure: failed program was:
| /* confdefs.h.  */
| 
| #define PACKAGE_NAME ""
| #define PACKAGE_TARNAME ""
| #define PACKAGE_VERSION ""
| #define PACKAGE_STRING ""
| #define PACKAGE_BUGREPORT ""
| #define PACKAGE "bzflag"
| #define VERSION "2.0.8"
| #define BZ_BUILD_OS "linux-gnu"
| #define BZ_BUILD_USER "tropican8"
| #define BUILD_REGEX 1
| #ifdef __cplusplus
| void exit (int);
| #endif
| #define STDC_HEADERS 1
| #define HAVE_SYS_TYPES_H 1
| #define HAVE_SYS_STAT_H 1
| #define HAVE_STDLIB_H 1
| #define HAVE_STRING_H 1
| #define HAVE_MEMORY_H 1
| #define HAVE_STRINGS_H 1
| #define HAVE_INTTYPES_H 1
| #define HAVE_STDINT_H 1
| #define HAVE_UNISTD_H 1
| #define HAVE_DLFCN_H 1
| #define STDC_HEADERS 1
| #define HAVE_GL_GLX_H 1
| #define HAVE_SDL_SDL_H 1
| #define HAVE_X11_XLIB_H 1
| #define HAVE_LINUX_INPUT_H 1
| #define HAVE_STDINT_H 1
| #define HAVE_SYS_PARAM_H 1
| #define HAVE_UNISTD_H 1
| #define HAVE_VALUES_H 1
| #define HAVE_SOCKLEN_T 1
| #define HAVE_FF_EFFECT_RUMBLE 1
| #define HAVE_FF_EFFECT_DIRECTIONAL 1
| #define HAVE_LIBM 1
| #define HAVE_ACOSF 1
| #define HAVE_ASINF 1
| #define HAVE_ATAN2F 1
| #define HAVE_ATANF 1
| #define HAVE_COSF 1
| #define HAVE_EXPF 1
| #define HAVE_FABSF 1
| #define HAVE_FLOORF 1
| #define HAVE_FMODF 1
| #define HAVE_HYPOTF 1
| #define HAVE_LOGF 1
| #define HAVE_LOG10F 1
| #define HAVE_POWF 1
| #define HAVE_SINF 1
| #define HAVE_SQRTF 1
| #define HAVE_TANF 1
| #define HAVE_SDL 1
| #define ROBOT 1
| #define SNAPPING 1
| #define INSTALL_DATA_DIR "/usr/local/share/bzflag"
| #define HALF_RATE_AUDIO 1
| #define XF86VIDMODE_EXT 1
| #define NDEBUG 1
| /* end confdefs.h.  */
| 
| int
| main ()
| {
| 
|   ;
|   return 0;
| }
configure:25391: result: no
configure:25431: checking for CGLGetCurrentContext
configure:25488: g++ -o conftest  -ffast-math -fno-exceptions -fsigned-char   -I/usr/X11R6/include -Wall -W -Wshadow -mtune=i686 -lpthread  -L/usr/X11R6/lib conftest.cc -lm -L/usr/lib -lcurl -L/usr/lib -lgssapi_krb5 -lkrb5 -lk5crypto -lkrb5support -lcom_err -lresolv -lidn -lssl -lcrypto -ldl -lssl -lcrypto -lz  >&5
./configure: line 25489: g++: command not found
configure:25494: $? = 127
configure: failed program was:
| /* confdefs.h.  */
| 
| #define PACKAGE_NAME ""
| #define PACKAGE_TARNAME ""
| #define PACKAGE_VERSION ""
| #define PACKAGE_STRING ""
| #define PACKAGE_BUGREPORT ""
| #define PACKAGE "bzflag"
| #define VERSION "2.0.8"
| #define BZ_BUILD_OS "linux-gnu"
| #define BZ_BUILD_USER "tropican8"
| #define BUILD_REGEX 1
| #ifdef __cplusplus
| void exit (int);
| #endif
| #define STDC_HEADERS 1
| #define HAVE_SYS_TYPES_H 1
| #define HAVE_SYS_STAT_H 1
| #define HAVE_STDLIB_H 1
| #define HAVE_STRING_H 1
| #define HAVE_MEMORY_H 1
| #define HAVE_STRINGS_H 1
| #define HAVE_INTTYPES_H 1
| #define HAVE_STDINT_H 1
| #define HAVE_UNISTD_H 1
| #define HAVE_DLFCN_H 1
| #define STDC_HEADERS 1
| #define HAVE_GL_GLX_H 1
| #define HAVE_SDL_SDL_H 1
| #define HAVE_X11_XLIB_H 1
| #define HAVE_LINUX_INPUT_H 1
| #define HAVE_STDINT_H 1
| #define HAVE_SYS_PARAM_H 1
| #define HAVE_UNISTD_H 1
| #define HAVE_VALUES_H 1
| #define HAVE_SOCKLEN_T 1
| #define HAVE_FF_EFFECT_RUMBLE 1
| #define HAVE_FF_EFFECT_DIRECTIONAL 1
| #define HAVE_LIBM 1
| #define HAVE_ACOSF 1
| #define HAVE_ASINF 1
| #define HAVE_ATAN2F 1
| #define HAVE_ATANF 1
| #define HAVE_COSF 1
| #define HAVE_EXPF 1
| #define HAVE_FABSF 1
| #define HAVE_FLOORF 1
| #define HAVE_FMODF 1
| #define HAVE_HYPOTF 1
| #define HAVE_LOGF 1
| #define HAVE_LOG10F 1
| #define HAVE_POWF 1
| #define HAVE_SINF 1
| #define HAVE_SQRTF 1
| #define HAVE_TANF 1
| #define HAVE_SDL 1
| #define ROBOT 1
| #define SNAPPING 1
| #define INSTALL_DATA_DIR "/usr/local/share/bzflag"
| #define HALF_RATE_AUDIO 1
| #define XF86VIDMODE_EXT 1
| #define NDEBUG 1
| /* end confdefs.h.  */
| /* Define CGLGetCurrentContext to an innocuous variant, in case <limits.h> declares CGLGetCurrentContext.
|    For example, HP-UX 11i <limits.h> declares gettimeofday.  */
| #define CGLGetCurrentContext innocuous_CGLGetCurrentContext
| 
| /* System header to define __stub macros and hopefully few prototypes,
|     which can conflict with char CGLGetCurrentContext (); below.
|     Prefer <limits.h> to <assert.h> if __STDC__ is defined, since
|     <limits.h> exists even on freestanding compilers.  */
| 
| #ifdef __STDC__
| # include <limits.h>
| #else
| # include <assert.h>
| #endif
| 
| #undef CGLGetCurrentContext
| 
| /* Override any gcc2 internal prototype to avoid an error.  */
| #ifdef __cplusplus
| extern "C"
| {
| #endif
| /* We use char because int might match the return type of a gcc2
|    builtin and then its argument prototype would still apply.  */
| char CGLGetCurrentContext ();
| /* The GNU C library defines this for functions which it implements
|     to always fail with ENOSYS.  Some functions are actually named
|     something starting with __ and the normal name is an alias.  */
| #if defined (__stub_CGLGetCurrentContext) || defined (__stub___CGLGetCurrentContext)
| choke me
| #else
| char (*f) () = CGLGetCurrentContext;
| #endif
| #ifdef __cplusplus
| }
| #endif
| 
| int
| main ()
| {
| return f != CGLGetCurrentContext;
|   ;
|   return 0;
| }
configure:25518: result: no
configure:25431: checking for Sleep
configure:25488: g++ -o conftest  -ffast-math -fno-exceptions -fsigned-char   -I/usr/X11R6/include -Wall -W -Wshadow -mtune=i686 -lpthread  -L/usr/X11R6/lib conftest.cc -lm -L/usr/lib -lcurl -L/usr/lib -lgssapi_krb5 -lkrb5 -lk5crypto -lkrb5support -lcom_err -lresolv -lidn -lssl -lcrypto -ldl -lssl -lcrypto -lz  >&5
./configure: line 25489: g++: command not found
configure:25494: $? = 127
configure: failed program was:
| /* confdefs.h.  */
| 
| #define PACKAGE_NAME ""
| #define PACKAGE_TARNAME ""
| #define PACKAGE_VERSION ""
| #define PACKAGE_STRING ""
| #define PACKAGE_BUGREPORT ""
| #define PACKAGE "bzflag"
| #define VERSION "2.0.8"
| #define BZ_BUILD_OS "linux-gnu"
| #define BZ_BUILD_USER "tropican8"
| #define BUILD_REGEX 1
| #ifdef __cplusplus
| void exit (int);
| #endif
| #define STDC_HEADERS 1
| #define HAVE_SYS_TYPES_H 1
| #define HAVE_SYS_STAT_H 1
| #define HAVE_STDLIB_H 1
| #define HAVE_STRING_H 1
| #define HAVE_MEMORY_H 1
| #define HAVE_STRINGS_H 1
| #define HAVE_INTTYPES_H 1
| #define HAVE_STDINT_H 1
| #define HAVE_UNISTD_H 1
| #define HAVE_DLFCN_H 1
| #define STDC_HEADERS 1
| #define HAVE_GL_GLX_H 1
| #define HAVE_SDL_SDL_H 1
| #define HAVE_X11_XLIB_H 1
| #define HAVE_LINUX_INPUT_H 1
| #define HAVE_STDINT_H 1
| #define HAVE_SYS_PARAM_H 1
| #define HAVE_UNISTD_H 1
| #define HAVE_VALUES_H 1
| #define HAVE_SOCKLEN_T 1
| #define HAVE_FF_EFFECT_RUMBLE 1
| #define HAVE_FF_EFFECT_DIRECTIONAL 1
| #define HAVE_LIBM 1
| #define HAVE_ACOSF 1
| #define HAVE_ASINF 1
| #define HAVE_ATAN2F 1
| #define HAVE_ATANF 1
| #define HAVE_COSF 1
| #define HAVE_EXPF 1
| #define HAVE_FABSF 1
| #define HAVE_FLOORF 1
| #define HAVE_FMODF 1
| #define HAVE_HYPOTF 1
| #define HAVE_LOGF 1
| #define HAVE_LOG10F 1
| #define HAVE_POWF 1
| #define HAVE_SINF 1
| #define HAVE_SQRTF 1
| #define HAVE_TANF 1
| #define HAVE_SDL 1
| #define ROBOT 1
| #define SNAPPING 1
| #define INSTALL_DATA_DIR "/usr/local/share/bzflag"
| #define HALF_RATE_AUDIO 1
| #define XF86VIDMODE_EXT 1
| #define NDEBUG 1
| /* end confdefs.h.  */
| /* Define Sleep to an innocuous variant, in case <limits.h> declares Sleep.
|    For example, HP-UX 11i <limits.h> declares gettimeofday.  */
| #define Sleep innocuous_Sleep
| 
| /* System header to define __stub macros and hopefully few prototypes,
|     which can conflict with char Sleep (); below.
|     Prefer <limits.h> to <assert.h> if __STDC__ is defined, since
|     <limits.h> exists even on freestanding compilers.  */
| 
| #ifdef __STDC__
| # include <limits.h>
| #else
| # include <assert.h>
| #endif
| 
| #undef Sleep
| 
| /* Override any gcc2 internal prototype to avoid an error.  */
| #ifdef __cplusplus
| extern "C"
| {
| #endif
| /* We use char because int might match the return type of a gcc2
|    builtin and then its argument prototype would still apply.  */
| char Sleep ();
| /* The GNU C library defines this for functions which it implements
|     to always fail with ENOSYS.  Some functions are actually named
|     something starting with __ and the normal name is an alias.  */
| #if defined (__stub_Sleep) || defined (__stub___Sleep)
| choke me
| #else
| char (*f) () = Sleep;
| #endif
| #ifdef __cplusplus
| }
| #endif
| 
| int
| main ()
| {
| return f != Sleep;
|   ;
|   return 0;
| }
configure:25518: result: no
configure:25431: checking for WaitForSingleObject
configure:25488: g++ -o conftest  -ffast-math -fno-exceptions -fsigned-char   -I/usr/X11R6/include -Wall -W -Wshadow -mtune=i686 -lpthread  -L/usr/X11R6/lib conftest.cc -lm -L/usr/lib -lcurl -L/usr/lib -lgssapi_krb5 -lkrb5 -lk5crypto -lkrb5support -lcom_err -lresolv -lidn -lssl -lcrypto -ldl -lssl -lcrypto -lz  >&5
./configure: line 25489: g++: command not found
configure:25494: $? = 127
configure: failed program was:
| /* confdefs.h.  */
| 
| #define PACKAGE_NAME ""
| #define PACKAGE_TARNAME ""
| #define PACKAGE_VERSION ""
| #define PACKAGE_STRING ""
| #define PACKAGE_BUGREPORT ""
| #define PACKAGE "bzflag"
| #define VERSION "2.0.8"
| #define BZ_BUILD_OS "linux-gnu"
| #define BZ_BUILD_USER "tropican8"
| #define BUILD_REGEX 1
| #ifdef __cplusplus
| void exit (int);
| #endif
| #define STDC_HEADERS 1
| #define HAVE_SYS_TYPES_H 1
| #define HAVE_SYS_STAT_H 1
| #define HAVE_STDLIB_H 1
| #define HAVE_STRING_H 1
| #define HAVE_MEMORY_H 1
| #define HAVE_STRINGS_H 1
| #define HAVE_INTTYPES_H 1
| #define HAVE_STDINT_H 1
| #define HAVE_UNISTD_H 1
| #define HAVE_DLFCN_H 1
| #define STDC_HEADERS 1
| #define HAVE_GL_GLX_H 1
| #define HAVE_SDL_SDL_H 1
| #define HAVE_X11_XLIB_H 1
| #define HAVE_LINUX_INPUT_H 1
| #define HAVE_STDINT_H 1
| #define HAVE_SYS_PARAM_H 1
| #define HAVE_UNISTD_H 1
| #define HAVE_VALUES_H 1
| #define HAVE_SOCKLEN_T 1
| #define HAVE_FF_EFFECT_RUMBLE 1
| #define HAVE_FF_EFFECT_DIRECTIONAL 1
| #define HAVE_LIBM 1
| #define HAVE_ACOSF 1
| #define HAVE_ASINF 1
| #define HAVE_ATAN2F 1
| #define HAVE_ATANF 1
| #define HAVE_COSF 1
| #define HAVE_EXPF 1
| #define HAVE_FABSF 1
| #define HAVE_FLOORF 1
| #define HAVE_FMODF 1
| #define HAVE_HYPOTF 1
| #define HAVE_LOGF 1
| #define HAVE_LOG10F 1
| #define HAVE_POWF 1
| #define HAVE_SINF 1
| #define HAVE_SQRTF 1
| #define HAVE_TANF 1
| #define HAVE_SDL 1
| #define ROBOT 1
| #define SNAPPING 1
| #define INSTALL_DATA_DIR "/usr/local/share/bzflag"
| #define HALF_RATE_AUDIO 1
| #define XF86VIDMODE_EXT 1
| #define NDEBUG 1
| /* end confdefs.h.  */
| /* Define WaitForSingleObject to an innocuous variant, in case <limits.h> declares WaitForSingleObject.
|    For example, HP-UX 11i <limits.h> declares gettimeofday.  */
| #define WaitForSingleObject innocuous_WaitForSingleObject
| 
| /* System header to define __stub macros and hopefully few prototypes,
|     which can conflict with char WaitForSingleObject (); below.
|     Prefer <limits.h> to <assert.h> if __STDC__ is defined, since
|     <limits.h> exists even on freestanding compilers.  */
| 
| #ifdef __STDC__
| # include <limits.h>
| #else
| # include <assert.h>
| #endif
| 
| #undef WaitForSingleObject
| 
| /* Override any gcc2 internal prototype to avoid an error.  */
| #ifdef __cplusplus
| extern "C"
| {
| #endif
| /* We use char because int might match the return type of a gcc2
|    builtin and then its argument prototype would still apply.  */
| char WaitForSingleObject ();
| /* The GNU C library defines this for functions which it implements
|     to always fail with ENOSYS.  Some functions are actually named
|     something starting with __ and the normal name is an alias.  */
| #if defined (__stub_WaitForSingleObject) || defined (__stub___WaitForSingleObject)
| choke me
| #else
| char (*f) () = WaitForSingleObject;
| #endif
| #ifdef __cplusplus
| }
| #endif
| 
| int
| main ()
| {
| return f != WaitForSingleObject;
|   ;
|   return 0;
| }
configure:25518: result: no
configure:25431: checking for _stricmp
configure:25488: g++ -o conftest  -ffast-math -fno-exceptions -fsigned-char   -I/usr/X11R6/include -Wall -W -Wshadow -mtune=i686 -lpthread  -L/usr/X11R6/lib conftest.cc -lm -L/usr/lib -lcurl -L/usr/lib -lgssapi_krb5 -lkrb5 -lk5crypto -lkrb5support -lcom_err -lresolv -lidn -lssl -lcrypto -ldl -lssl -lcrypto -lz  >&5
./configure: line 25489: g++: command not found
configure:25494: $? = 127
configure: failed program was:
| /* confdefs.h.  */
| 
| #define PACKAGE_NAME ""
| #define PACKAGE_TARNAME ""
| #define PACKAGE_VERSION ""
| #define PACKAGE_STRING ""
| #define PACKAGE_BUGREPORT ""
| #define PACKAGE "bzflag"
| #define VERSION "2.0.8"
| #define BZ_BUILD_OS "linux-gnu"
| #define BZ_BUILD_USER "tropican8"
| #define BUILD_REGEX 1
| #ifdef __cplusplus
| void exit (int);
| #endif
| #define STDC_HEADERS 1
| #define HAVE_SYS_TYPES_H 1
| #define HAVE_SYS_STAT_H 1
| #define HAVE_STDLIB_H 1
| #define HAVE_STRING_H 1
| #define HAVE_MEMORY_H 1
| #define HAVE_STRINGS_H 1
| #define HAVE_INTTYPES_H 1
| #define HAVE_STDINT_H 1
| #define HAVE_UNISTD_H 1
| #define HAVE_DLFCN_H 1
| #define STDC_HEADERS 1
| #define HAVE_GL_GLX_H 1
| #define HAVE_SDL_SDL_H 1
| #define HAVE_X11_XLIB_H 1
| #define HAVE_LINUX_INPUT_H 1
| #define HAVE_STDINT_H 1
| #define HAVE_SYS_PARAM_H 1
| #define HAVE_UNISTD_H 1
| #define HAVE_VALUES_H 1
| #define HAVE_SOCKLEN_T 1
| #define HAVE_FF_EFFECT_RUMBLE 1
| #define HAVE_FF_EFFECT_DIRECTIONAL 1
| #define HAVE_LIBM 1
| #define HAVE_ACOSF 1
| #define HAVE_ASINF 1
| #define HAVE_ATAN2F 1
| #define HAVE_ATANF 1
| #define HAVE_COSF 1
| #define HAVE_EXPF 1
| #define HAVE_FABSF 1
| #define HAVE_FLOORF 1
| #define HAVE_FMODF 1
| #define HAVE_HYPOTF 1
| #define HAVE_LOGF 1
| #define HAVE_LOG10F 1
| #define HAVE_POWF 1
| #define HAVE_SINF 1
| #define HAVE_SQRTF 1
| #define HAVE_TANF 1
| #define HAVE_SDL 1
| #define ROBOT 1
| #define SNAPPING 1
| #define INSTALL_DATA_DIR "/usr/local/share/bzflag"
| #define HALF_RATE_AUDIO 1
| #define XF86VIDMODE_EXT 1
| #define NDEBUG 1
| /* end confdefs.h.  */
| /* Define _stricmp to an innocuous variant, in case <limits.h> declares _stricmp.
|    For example, HP-UX 11i <limits.h> declares gettimeofday.  */
| #define _stricmp innocuous__stricmp
| 
| /* System header to define __stub macros and hopefully few prototypes,
|     which can conflict with char _stricmp (); below.
|     Prefer <limits.h> to <assert.h> if __STDC__ is defined, since
|     <limits.h> exists even on freestanding compilers.  */
| 
| #ifdef __STDC__
| # include <limits.h>
| #else
| # include <assert.h>
| #endif
| 
| #undef _stricmp
| 
| /* Override any gcc2 internal prototype to avoid an error.  */
| #ifdef __cplusplus
| extern "C"
| {
| #endif
| /* We use char because int might match the return type of a gcc2
|    builtin and then its argument prototype would still apply.  */
| char _stricmp ();
| /* The GNU C library defines this for functions which it implements
|     to always fail with ENOSYS.  Some functions are actually named
|     something starting with __ and the normal name is an alias.  */
| #if defined (__stub__stricmp) || defined (__stub____stricmp)
| choke me
| #else
| char (*f) () = _stricmp;
| #endif
| #ifdef __cplusplus
| }
| #endif
| 
| int
| main ()
| {
| return f != _stricmp;
|   ;
|   return 0;
| }
configure:25518: result: no
configure:25431: checking for _strnicmp
configure:25488: g++ -o conftest  -ffast-math -fno-exceptions -fsigned-char   -I/usr/X11R6/include -Wall -W -Wshadow -mtune=i686 -lpthread  -L/usr/X11R6/lib conftest.cc -lm -L/usr/lib -lcurl -L/usr/lib -lgssapi_krb5 -lkrb5 -lk5crypto -lkrb5support -lcom_err -lresolv -lidn -lssl -lcrypto -ldl -lssl -lcrypto -lz  >&5
./configure: line 25489: g++: command not found
configure:25494: $? = 127
configure: failed program was:
| /* confdefs.h.  */
| 
| #define PACKAGE_NAME ""
| #define PACKAGE_TARNAME ""
| #define PACKAGE_VERSION ""
| #define PACKAGE_STRING ""
| #define PACKAGE_BUGREPORT ""
| #define PACKAGE "bzflag"
| #define VERSION "2.0.8"
| #define BZ_BUILD_OS "linux-gnu"
| #define BZ_BUILD_USER "tropican8"
| #define BUILD_REGEX 1
| #ifdef __cplusplus
| void exit (int);
| #endif
| #define STDC_HEADERS 1
| #define HAVE_SYS_TYPES_H 1
| #define HAVE_SYS_STAT_H 1
| #define HAVE_STDLIB_H 1
| #define HAVE_STRING_H 1
| #define HAVE_MEMORY_H 1
| #define HAVE_STRINGS_H 1
| #define HAVE_INTTYPES_H 1
| #define HAVE_STDINT_H 1
| #define HAVE_UNISTD_H 1
| #define HAVE_DLFCN_H 1
| #define STDC_HEADERS 1
| #define HAVE_GL_GLX_H 1
| #define HAVE_SDL_SDL_H 1
| #define HAVE_X11_XLIB_H 1
| #define HAVE_LINUX_INPUT_H 1
| #define HAVE_STDINT_H 1
| #define HAVE_SYS_PARAM_H 1
| #define HAVE_UNISTD_H 1
| #define HAVE_VALUES_H 1
| #define HAVE_SOCKLEN_T 1
| #define HAVE_FF_EFFECT_RUMBLE 1
| #define HAVE_FF_EFFECT_DIRECTIONAL 1
| #define HAVE_LIBM 1
| #define HAVE_ACOSF 1
| #define HAVE_ASINF 1
| #define HAVE_ATAN2F 1
| #define HAVE_ATANF 1
| #define HAVE_COSF 1
| #define HAVE_EXPF 1
| #define HAVE_FABSF 1
| #define HAVE_FLOORF 1
| #define HAVE_FMODF 1
| #define HAVE_HYPOTF 1
| #define HAVE_LOGF 1
| #define HAVE_LOG10F 1
| #define HAVE_POWF 1
| #define HAVE_SINF 1
| #define HAVE_SQRTF 1
| #define HAVE_TANF 1
| #define HAVE_SDL 1
| #define ROBOT 1
| #define SNAPPING 1
| #define INSTALL_DATA_DIR "/usr/local/share/bzflag"
| #define HALF_RATE_AUDIO 1
| #define XF86VIDMODE_EXT 1
| #define NDEBUG 1
| /* end confdefs.h.  */
| /* Define _strnicmp to an innocuous variant, in case <limits.h> declares _strnicmp.
|    For example, HP-UX 11i <limits.h> declares gettimeofday.  */
| #define _strnicmp innocuous__strnicmp
| 
| /* System header to define __stub macros and hopefully few prototypes,
|     which can conflict with char _strnicmp (); below.
|     Prefer <limits.h> to <assert.h> if __STDC__ is defined, since
|     <limits.h> exists even on freestanding compilers.  */
| 
| #ifdef __STDC__
| # include <limits.h>
| #else
| # include <assert.h>
| #endif
| 
| #undef _strnicmp
| 
| /* Override any gcc2 internal prototype to avoid an error.  */
| #ifdef __cplusplus
| extern "C"
| {
| #endif
| /* We use char because int might match the return type of a gcc2
|    builtin and then its argument prototype would still apply.  */
| char _strnicmp ();
| /* The GNU C library defines this for functions which it implements
|     to always fail with ENOSYS.  Some functions are actually named
|     something starting with __ and the normal name is an alias.  */
| #if defined (__stub__strnicmp) || defined (__stub____strnicmp)
| choke me
| #else
| char (*f) () = _strnicmp;
| #endif
| #ifdef __cplusplus
| }
| #endif
| 
| int
| main ()
| {
| return f != _strnicmp;
|   ;
|   return 0;
| }
configure:25518: result: no
configure:25431: checking for _vsnprintf
configure:25488: g++ -o conftest  -ffast-math -fno-exceptions -fsigned-char   -I/usr/X11R6/include -Wall -W -Wshadow -mtune=i686 -lpthread  -L/usr/X11R6/lib conftest.cc -lm -L/usr/lib -lcurl -L/usr/lib -lgssapi_krb5 -lkrb5 -lk5crypto -lkrb5support -lcom_err -lresolv -lidn -lssl -lcrypto -ldl -lssl -lcrypto -lz  >&5
./configure: line 25489: g++: command not found
configure:25494: $? = 127
configure: failed program was:
| /* confdefs.h.  */
| 
| #define PACKAGE_NAME ""
| #define PACKAGE_TARNAME ""
| #define PACKAGE_VERSION ""
| #define PACKAGE_STRING ""
| #define PACKAGE_BUGREPORT ""
| #define PACKAGE "bzflag"
| #define VERSION "2.0.8"
| #define BZ_BUILD_OS "linux-gnu"
| #define BZ_BUILD_USER "tropican8"
| #define BUILD_REGEX 1
| #ifdef __cplusplus
| void exit (int);
| #endif
| #define STDC_HEADERS 1
| #define HAVE_SYS_TYPES_H 1
| #define HAVE_SYS_STAT_H 1
| #define HAVE_STDLIB_H 1
| #define HAVE_STRING_H 1
| #define HAVE_MEMORY_H 1
| #define HAVE_STRINGS_H 1
| #define HAVE_INTTYPES_H 1
| #define HAVE_STDINT_H 1
| #define HAVE_UNISTD_H 1
| #define HAVE_DLFCN_H 1
| #define STDC_HEADERS 1
| #define HAVE_GL_GLX_H 1
| #define HAVE_SDL_SDL_H 1
| #define HAVE_X11_XLIB_H 1
| #define HAVE_LINUX_INPUT_H 1
| #define HAVE_STDINT_H 1
| #define HAVE_SYS_PARAM_H 1
| #define HAVE_UNISTD_H 1
| #define HAVE_VALUES_H 1
| #define HAVE_SOCKLEN_T 1
| #define HAVE_FF_EFFECT_RUMBLE 1
| #define HAVE_FF_EFFECT_DIRECTIONAL 1
| #define HAVE_LIBM 1
| #define HAVE_ACOSF 1
| #define HAVE_ASINF 1
| #define HAVE_ATAN2F 1
| #define HAVE_ATANF 1
| #define HAVE_COSF 1
| #define HAVE_EXPF 1
| #define HAVE_FABSF 1
| #define HAVE_FLOORF 1
| #define HAVE_FMODF 1
| #define HAVE_HYPOTF 1
| #define HAVE_LOGF 1
| #define HAVE_LOG10F 1
| #define HAVE_POWF 1
| #define HAVE_SINF 1
| #define HAVE_SQRTF 1
| #define HAVE_TANF 1
| #define HAVE_SDL 1
| #define ROBOT 1
| #define SNAPPING 1
| #define INSTALL_DATA_DIR "/usr/local/share/bzflag"
| #define HALF_RATE_AUDIO 1
| #define XF86VIDMODE_EXT 1
| #define NDEBUG 1
| /* end confdefs.h.  */
| /* Define _vsnprintf to an innocuous variant, in case <limits.h> declares _vsnprintf.
|    For example, HP-UX 11i <limits.h> declares gettimeofday.  */
| #define _vsnprintf innocuous__vsnprintf
| 
| /* System header to define __stub macros and hopefully few prototypes,
|     which can conflict with char _vsnprintf (); below.
|     Prefer <limits.h> to <assert.h> if __STDC__ is defined, since
|     <limits.h> exists even on freestanding compilers.  */
| 
| #ifdef __STDC__
| # include <limits.h>
| #else
| # include <assert.h>
| #endif
| 
| #undef _vsnprintf
| 
| /* Override any gcc2 internal prototype to avoid an error.  */
| #ifdef __cplusplus
| extern "C"
| {
| #endif
| /* We use char because int might match the return type of a gcc2
|    builtin and then its argument prototype would still apply.  */
| char _vsnprintf ();
| /* The GNU C library defines this for functions which it implements
|     to always fail with ENOSYS.  Some functions are actually named
|     something starting with __ and the normal name is an alias.  */
| #if defined (__stub__vsnprintf) || defined (__stub____vsnprintf)
| choke me
| #else
| char (*f) () = _vsnprintf;
| #endif
| #ifdef __cplusplus
| }
| #endif
| 
| int
| main ()
| {
| return f != _vsnprintf;
|   ;
|   return 0;
| }
configure:25518: result: no
configure:25431: checking for atexit
configure:25488: g++ -o conftest  -ffast-math -fno-exceptions -fsigned-char   -I/usr/X11R6/include -Wall -W -Wshadow -mtune=i686 -lpthread  -L/usr/X11R6/lib conftest.cc -lm -L/usr/lib -lcurl -L/usr/lib -lgssapi_krb5 -lkrb5 -lk5crypto -lkrb5support -lcom_err -lresolv -lidn -lssl -lcrypto -ldl -lssl -lcrypto -lz  >&5
./configure: line 25489: g++: command not found
configure:25494: $? = 127
configure: failed program was:
| /* confdefs.h.  */
| 
| #define PACKAGE_NAME ""
| #define PACKAGE_TARNAME ""
| #define PACKAGE_VERSION ""
| #define PACKAGE_STRING ""
| #define PACKAGE_BUGREPORT ""
| #define PACKAGE "bzflag"
| #define VERSION "2.0.8"
| #define BZ_BUILD_OS "linux-gnu"
| #define BZ_BUILD_USER "tropican8"
| #define BUILD_REGEX 1
| #ifdef __cplusplus
| void exit (int);
| #endif
| #define STDC_HEADERS 1
| #define HAVE_SYS_TYPES_H 1
| #define HAVE_SYS_STAT_H 1
| #define HAVE_STDLIB_H 1
| #define HAVE_STRING_H 1
| #define HAVE_MEMORY_H 1
| #define HAVE_STRINGS_H 1
| #define HAVE_INTTYPES_H 1
| #define HAVE_STDINT_H 1
| #define HAVE_UNISTD_H 1
| #define HAVE_DLFCN_H 1
| #define STDC_HEADERS 1
| #define HAVE_GL_GLX_H 1
| #define HAVE_SDL_SDL_H 1
| #define HAVE_X11_XLIB_H 1
| #define HAVE_LINUX_INPUT_H 1
| #define HAVE_STDINT_H 1
| #define HAVE_SYS_PARAM_H 1
| #define HAVE_UNISTD_H 1
| #define HAVE_VALUES_H 1
| #define HAVE_SOCKLEN_T 1
| #define HAVE_FF_EFFECT_RUMBLE 1
| #define HAVE_FF_EFFECT_DIRECTIONAL 1
| #define HAVE_LIBM 1
| #define HAVE_ACOSF 1
| #define HAVE_ASINF 1
| #define HAVE_ATAN2F 1
| #define HAVE_ATANF 1
| #define HAVE_COSF 1
| #define HAVE_EXPF 1
| #define HAVE_FABSF 1
| #define HAVE_FLOORF 1
| #define HAVE_FMODF 1
| #define HAVE_HYPOTF 1
| #define HAVE_LOGF 1
| #define HAVE_LOG10F 1
| #define HAVE_POWF 1
| #define HAVE_SINF 1
| #define HAVE_SQRTF 1
| #define HAVE_TANF 1
| #define HAVE_SDL 1
| #define ROBOT 1
| #define SNAPPING 1
| #define INSTALL_DATA_DIR "/usr/local/share/bzflag"
| #define HALF_RATE_AUDIO 1
| #define XF86VIDMODE_EXT 1
| #define NDEBUG 1
| /* end confdefs.h.  */
| /* Define atexit to an innocuous variant, in case <limits.h> declares atexit.
|    For example, HP-UX 11i <limits.h> declares gettimeofday.  */
| #define atexit innocuous_atexit
| 
| /* System header to define __stub macros and hopefully few prototypes,
|     which can conflict with char atexit (); below.
|     Prefer <limits.h> to <assert.h> if __STDC__ is defined, since
|     <limits.h> exists even on freestanding compilers.  */
| 
| #ifdef __STDC__
| # include <limits.h>
| #else
| # include <assert.h>
| #endif
| 
| #undef atexit
| 
| /* Override any gcc2 internal prototype to avoid an error.  */
| #ifdef __cplusplus
| extern "C"
| {
| #endif
| /* We use char because int might match the return type of a gcc2
|    builtin and then its argument prototype would still apply.  */
| char atexit ();
| /* The GNU C library defines this for functions which it implements
|     to always fail with ENOSYS.  Some functions are actually named
|     something starting with __ and the normal name is an alias.  */
| #if defined (__stub_atexit) || defined (__stub___atexit)
| choke me
| #else
| char (*f) () = atexit;
| #endif
| #ifdef __cplusplus
| }
| #endif
| 
| int
| main ()
| {
| return f != atexit;
|   ;
|   return 0;
| }
configure:25518: result: no
configure:25431: checking for getrlimit
configure:25488: g++ -o conftest  -ffast-math -fno-exceptions -fsigned-char   -I/usr/X11R6/include -Wall -W -Wshadow -mtune=i686 -lpthread  -L/usr/X11R6/lib conftest.cc -lm -L/usr/lib -lcurl -L/usr/lib -lgssapi_krb5 -lkrb5 -lk5crypto -lkrb5support -lcom_err -lresolv -lidn -lssl -lcrypto -ldl -lssl -lcrypto -lz  >&5
./configure: line 25489: g++: command not found
configure:25494: $? = 127
configure: failed program was:
| /* confdefs.h.  */
| 
| #define PACKAGE_NAME ""
| #define PACKAGE_TARNAME ""
| #define PACKAGE_VERSION ""
| #define PACKAGE_STRING ""
| #define PACKAGE_BUGREPORT ""
| #define PACKAGE "bzflag"
| #define VERSION "2.0.8"
| #define BZ_BUILD_OS "linux-gnu"
| #define BZ_BUILD_USER "tropican8"
| #define BUILD_REGEX 1
| #ifdef __cplusplus
| void exit (int);
| #endif
| #define STDC_HEADERS 1
| #define HAVE_SYS_TYPES_H 1
| #define HAVE_SYS_STAT_H 1
| #define HAVE_STDLIB_H 1
| #define HAVE_STRING_H 1
| #define HAVE_MEMORY_H 1
| #define HAVE_STRINGS_H 1
| #define HAVE_INTTYPES_H 1
| #define HAVE_STDINT_H 1
| #define HAVE_UNISTD_H 1
| #define HAVE_DLFCN_H 1
| #define STDC_HEADERS 1
| #define HAVE_GL_GLX_H 1
| #define HAVE_SDL_SDL_H 1
| #define HAVE_X11_XLIB_H 1
| #define HAVE_LINUX_INPUT_H 1
| #define HAVE_STDINT_H 1
| #define HAVE_SYS_PARAM_H 1
| #define HAVE_UNISTD_H 1
| #define HAVE_VALUES_H 1
| #define HAVE_SOCKLEN_T 1
| #define HAVE_FF_EFFECT_RUMBLE 1
| #define HAVE_FF_EFFECT_DIRECTIONAL 1
| #define HAVE_LIBM 1
| #define HAVE_ACOSF 1
| #define HAVE_ASINF 1
| #define HAVE_ATAN2F 1
| #define HAVE_ATANF 1
| #define HAVE_COSF 1
| #define HAVE_EXPF 1
| #define HAVE_FABSF 1
| #define HAVE_FLOORF 1
| #define HAVE_FMODF 1
| #define HAVE_HYPOTF 1
| #define HAVE_LOGF 1
| #define HAVE_LOG10F 1
| #define HAVE_POWF 1
| #define HAVE_SINF 1
| #define HAVE_SQRTF 1
| #define HAVE_TANF 1
| #define HAVE_SDL 1
| #define ROBOT 1
| #define SNAPPING 1
| #define INSTALL_DATA_DIR "/usr/local/share/bzflag"
| #define HALF_RATE_AUDIO 1
| #define XF86VIDMODE_EXT 1
| #define NDEBUG 1
| /* end confdefs.h.  */
| /* Define getrlimit to an innocuous variant, in case <limits.h> declares getrlimit.
|    For example, HP-UX 11i <limits.h> declares gettimeofday.  */
| #define getrlimit innocuous_getrlimit
| 
| /* System header to define __stub macros and hopefully few prototypes,
|     which can conflict with char getrlimit (); below.
|     Prefer <limits.h> to <assert.h> if __STDC__ is defined, since
|     <limits.h> exists even on freestanding compilers.  */
| 
| #ifdef __STDC__
| # include <limits.h>
| #else
| # include <assert.h>
| #endif
| 
| #undef getrlimit
| 
| /* Override any gcc2 internal prototype to avoid an error.  */
| #ifdef __cplusplus
| extern "C"
| {
| #endif
| /* We use char because int might match the return type of a gcc2
|    builtin and then its argument prototype would still apply.  */
| char getrlimit ();
| /* The GNU C library defines this for functions which it implements
|     to always fail with ENOSYS.  Some functions are actually named
|     something starting with __ and the normal name is an alias.  */
| #if defined (__stub_getrlimit) || defined (__stub___getrlimit)
| choke me
| #else
| char (*f) () = getrlimit;
| #endif
| #ifdef __cplusplus
| }
| #endif
| 
| int
| main ()
| {
| return f != getrlimit;
|   ;
|   return 0;
| }
configure:25518: result: no
configure:25431: checking for glXGetCurrentContext
configure:25488: g++ -o conftest  -ffast-math -fno-exceptions -fsigned-char   -I/usr/X11R6/include -Wall -W -Wshadow -mtune=i686 -lpthread  -L/usr/X11R6/lib conftest.cc -lm -L/usr/lib -lcurl -L/usr/lib -lgssapi_krb5 -lkrb5 -lk5crypto -lkrb5support -lcom_err -lresolv -lidn -lssl -lcrypto -ldl -lssl -lcrypto -lz  >&5
./configure: line 25489: g++: command not found
configure:25494: $? = 127
configure: failed program was:
| /* confdefs.h.  */
| 
| #define PACKAGE_NAME ""
| #define PACKAGE_TARNAME ""
| #define PACKAGE_VERSION ""
| #define PACKAGE_STRING ""
| #define PACKAGE_BUGREPORT ""
| #define PACKAGE "bzflag"
| #define VERSION "2.0.8"
| #define BZ_BUILD_OS "linux-gnu"
| #define BZ_BUILD_USER "tropican8"
| #define BUILD_REGEX 1
| #ifdef __cplusplus
| void exit (int);
| #endif
| #define STDC_HEADERS 1
| #define HAVE_SYS_TYPES_H 1
| #define HAVE_SYS_STAT_H 1
| #define HAVE_STDLIB_H 1
| #define HAVE_STRING_H 1
| #define HAVE_MEMORY_H 1
| #define HAVE_STRINGS_H 1
| #define HAVE_INTTYPES_H 1
| #define HAVE_STDINT_H 1
| #define HAVE_UNISTD_H 1
| #define HAVE_DLFCN_H 1
| #define STDC_HEADERS 1
| #define HAVE_GL_GLX_H 1
| #define HAVE_SDL_SDL_H 1
| #define HAVE_X11_XLIB_H 1
| #define HAVE_LINUX_INPUT_H 1
| #define HAVE_STDINT_H 1
| #define HAVE_SYS_PARAM_H 1
| #define HAVE_UNISTD_H 1
| #define HAVE_VALUES_H 1
| #define HAVE_SOCKLEN_T 1
| #define HAVE_FF_EFFECT_RUMBLE 1
| #define HAVE_FF_EFFECT_DIRECTIONAL 1
| #define HAVE_LIBM 1
| #define HAVE_ACOSF 1
| #define HAVE_ASINF 1
| #define HAVE_ATAN2F 1
| #define HAVE_ATANF 1
| #define HAVE_COSF 1
| #define HAVE_EXPF 1
| #define HAVE_FABSF 1
| #define HAVE_FLOORF 1
| #define HAVE_FMODF 1
| #define HAVE_HYPOTF 1
| #define HAVE_LOGF 1
| #define HAVE_LOG10F 1
| #define HAVE_POWF 1
| #define HAVE_SINF 1
| #define HAVE_SQRTF 1
| #define HAVE_TANF 1
| #define HAVE_SDL 1
| #define ROBOT 1
| #define SNAPPING 1
| #define INSTALL_DATA_DIR "/usr/local/share/bzflag"
| #define HALF_RATE_AUDIO 1
| #define XF86VIDMODE_EXT 1
| #define NDEBUG 1
| /* end confdefs.h.  */
| /* Define glXGetCurrentContext to an innocuous variant, in case <limits.h> declares glXGetCurrentContext.
|    For example, HP-UX 11i <limits.h> declares gettimeofday.  */
| #define glXGetCurrentContext innocuous_glXGetCurrentContext
| 
| /* System header to define __stub macros and hopefully few prototypes,
|     which can conflict with char glXGetCurrentContext (); below.
|     Prefer <limits.h> to <assert.h> if __STDC__ is defined, since
|     <limits.h> exists even on freestanding compilers.  */
| 
| #ifdef __STDC__
| # include <limits.h>
| #else
| # include <assert.h>
| #endif
| 
| #undef glXGetCurrentContext
| 
| /* Override any gcc2 internal prototype to avoid an error.  */
| #ifdef __cplusplus
| extern "C"
| {
| #endif
| /* We use char because int might match the return type of a gcc2
|    builtin and then its argument prototype would still apply.  */
| char glXGetCurrentContext ();
| /* The GNU C library defines this for functions which it implements
|     to always fail with ENOSYS.  Some functions are actually named
|     something starting with __ and the normal name is an alias.  */
| #if defined (__stub_glXGetCurrentContext) || defined (__stub___glXGetCurrentContext)
| choke me
| #else
| char (*f) () = glXGetCurrentContext;
| #endif
| #ifdef __cplusplus
| }
| #endif
| 
| int
| main ()
| {
| return f != glXGetCurrentContext;
|   ;
|   return 0;
| }
configure:25518: result: no
configure:25431: checking for select
configure:25488: g++ -o conftest  -ffast-math -fno-exceptions -fsigned-char   -I/usr/X11R6/include -Wall -W -Wshadow -mtune=i686 -lpthread  -L/usr/X11R6/lib conftest.cc -lm -L/usr/lib -lcurl -L/usr/lib -lgssapi_krb5 -lkrb5 -lk5crypto -lkrb5support -lcom_err -lresolv -lidn -lssl -lcrypto -ldl -lssl -lcrypto -lz  >&5
./configure: line 25489: g++: command not found
configure:25494: $? = 127
configure: failed program was:
| /* confdefs.h.  */
| 
| #define PACKAGE_NAME ""
| #define PACKAGE_TARNAME ""
| #define PACKAGE_VERSION ""
| #define PACKAGE_STRING ""
| #define PACKAGE_BUGREPORT ""
| #define PACKAGE "bzflag"
| #define VERSION "2.0.8"
| #define BZ_BUILD_OS "linux-gnu"
| #define BZ_BUILD_USER "tropican8"
| #define BUILD_REGEX 1
| #ifdef __cplusplus
| void exit (int);
| #endif
| #define STDC_HEADERS 1
| #define HAVE_SYS_TYPES_H 1
| #define HAVE_SYS_STAT_H 1
| #define HAVE_STDLIB_H 1
| #define HAVE_STRING_H 1
| #define HAVE_MEMORY_H 1
| #define HAVE_STRINGS_H 1
| #define HAVE_INTTYPES_H 1
| #define HAVE_STDINT_H 1
| #define HAVE_UNISTD_H 1
| #define HAVE_DLFCN_H 1
| #define STDC_HEADERS 1
| #define HAVE_GL_GLX_H 1
| #define HAVE_SDL_SDL_H 1
| #define HAVE_X11_XLIB_H 1
| #define HAVE_LINUX_INPUT_H 1
| #define HAVE_STDINT_H 1
| #define HAVE_SYS_PARAM_H 1
| #define HAVE_UNISTD_H 1
| #define HAVE_VALUES_H 1
| #define HAVE_SOCKLEN_T 1
| #define HAVE_FF_EFFECT_RUMBLE 1
| #define HAVE_FF_EFFECT_DIRECTIONAL 1
| #define HAVE_LIBM 1
| #define HAVE_ACOSF 1
| #define HAVE_ASINF 1
| #define HAVE_ATAN2F 1
| #define HAVE_ATANF 1
| #define HAVE_COSF 1
| #define HAVE_EXPF 1
| #define HAVE_FABSF 1
| #define HAVE_FLOORF 1
| #define HAVE_FMODF 1
| #define HAVE_HYPOTF 1
| #define HAVE_LOGF 1
| #define HAVE_LOG10F 1
| #define HAVE_POWF 1
| #define HAVE_SINF 1
| #define HAVE_SQRTF 1
| #define HAVE_TANF 1
| #define HAVE_SDL 1
| #define ROBOT 1
| #define SNAPPING 1
| #define INSTALL_DATA_DIR "/usr/local/share/bzflag"
| #define HALF_RATE_AUDIO 1
| #define XF86VIDMODE_EXT 1
| #define NDEBUG 1
| /* end confdefs.h.  */
| /* Define select to an innocuous variant, in case <limits.h> declares select.
|    For example, HP-UX 11i <limits.h> declares gettimeofday.  */
| #define select innocuous_select
| 
| /* System header to define __stub macros and hopefully few prototypes,
|     which can conflict with char select (); below.
|     Prefer <limits.h> to <assert.h> if __STDC__ is defined, since
|     <limits.h> exists even on freestanding compilers.  */
| 
| #ifdef __STDC__
| # include <limits.h>
| #else
| # include <assert.h>
| #endif
| 
| #undef select
| 
| /* Override any gcc2 internal prototype to avoid an error.  */
| #ifdef __cplusplus
| extern "C"
| {
| #endif
| /* We use char because int might match the return type of a gcc2
|    builtin and then its argument prototype would still apply.  */
| char select ();
| /* The GNU C library defines this for functions which it implements
|     to always fail with ENOSYS.  Some functions are actually named
|     something starting with __ and the normal name is an alias.  */
| #if defined (__stub_select) || defined (__stub___select)
| choke me
| #else
| char (*f) () = select;
| #endif
| #ifdef __cplusplus
| }
| #endif
| 
| int
| main ()
| {
| return f != select;
|   ;
|   return 0;
| }
configure:25518: result: no
configure:25431: checking for snooze
configure:25488: g++ -o conftest  -ffast-math -fno-exceptions -fsigned-char   -I/usr/X11R6/include -Wall -W -Wshadow -mtune=i686 -lpthread  -L/usr/X11R6/lib conftest.cc -lm -L/usr/lib -lcurl -L/usr/lib -lgssapi_krb5 -lkrb5 -lk5crypto -lkrb5support -lcom_err -lresolv -lidn -lssl -lcrypto -ldl -lssl -lcrypto -lz  >&5
./configure: line 25489: g++: command not found
configure:25494: $? = 127
configure: failed program was:
| /* confdefs.h.  */
| 
| #define PACKAGE_NAME ""
| #define PACKAGE_TARNAME ""
| #define PACKAGE_VERSION ""
| #define PACKAGE_STRING ""
| #define PACKAGE_BUGREPORT ""
| #define PACKAGE "bzflag"
| #define VERSION "2.0.8"
| #define BZ_BUILD_OS "linux-gnu"
| #define BZ_BUILD_USER "tropican8"
| #define BUILD_REGEX 1
| #ifdef __cplusplus
| void exit (int);
| #endif
| #define STDC_HEADERS 1
| #define HAVE_SYS_TYPES_H 1
| #define HAVE_SYS_STAT_H 1
| #define HAVE_STDLIB_H 1
| #define HAVE_STRING_H 1
| #define HAVE_MEMORY_H 1
| #define HAVE_STRINGS_H 1
| #define HAVE_INTTYPES_H 1
| #define HAVE_STDINT_H 1
| #define HAVE_UNISTD_H 1
| #define HAVE_DLFCN_H 1
| #define STDC_HEADERS 1
| #define HAVE_GL_GLX_H 1
| #define HAVE_SDL_SDL_H 1
| #define HAVE_X11_XLIB_H 1
| #define HAVE_LINUX_INPUT_H 1
| #define HAVE_STDINT_H 1
| #define HAVE_SYS_PARAM_H 1
| #define HAVE_UNISTD_H 1
| #define HAVE_VALUES_H 1
| #define HAVE_SOCKLEN_T 1
| #define HAVE_FF_EFFECT_RUMBLE 1
| #define HAVE_FF_EFFECT_DIRECTIONAL 1
| #define HAVE_LIBM 1
| #define HAVE_ACOSF 1
| #define HAVE_ASINF 1
| #define HAVE_ATAN2F 1
| #define HAVE_ATANF 1
| #define HAVE_COSF 1
| #define HAVE_EXPF 1
| #define HAVE_FABSF 1
| #define HAVE_FLOORF 1
| #define HAVE_FMODF 1
| #define HAVE_HYPOTF 1
| #define HAVE_LOGF 1
| #define HAVE_LOG10F 1
| #define HAVE_POWF 1
| #define HAVE_SINF 1
| #define HAVE_SQRTF 1
| #define HAVE_TANF 1
| #define HAVE_SDL 1
| #define ROBOT 1
| #define SNAPPING 1
| #define INSTALL_DATA_DIR "/usr/local/share/bzflag"
| #define HALF_RATE_AUDIO 1
| #define XF86VIDMODE_EXT 1
| #define NDEBUG 1
| /* end confdefs.h.  */
| /* Define snooze to an innocuous variant, in case <limits.h> declares snooze.
|    For example, HP-UX 11i <limits.h> declares gettimeofday.  */
| #define snooze innocuous_snooze
| 
| /* System header to define __stub macros and hopefully few prototypes,
|     which can conflict with char snooze (); below.
|     Prefer <limits.h> to <assert.h> if __STDC__ is defined, since
|     <limits.h> exists even on freestanding compilers.  */
| 
| #ifdef __STDC__
| # include <limits.h>
| #else
| # include <assert.h>
| #endif
| 
| #undef snooze
| 
| /* Override any gcc2 internal prototype to avoid an error.  */
| #ifdef __cplusplus
| extern "C"
| {
| #endif
| /* We use char because int might match the return type of a gcc2
|    builtin and then its argument prototype would still apply.  */
| char snooze ();
| /* The GNU C library defines this for functions which it implements
|     to always fail with ENOSYS.  Some functions are actually named
|     something starting with __ and the normal name is an alias.  */
| #if defined (__stub_snooze) || defined (__stub___snooze)
| choke me
| #else
| char (*f) () = snooze;
| #endif
| #ifdef __cplusplus
| }
| #endif
| 
| int
| main ()
| {
| return f != snooze;
|   ;
|   return 0;
| }
configure:25518: result: no
configure:25431: checking for usleep
configure:25488: g++ -o conftest  -ffast-math -fno-exceptions -fsigned-char   -I/usr/X11R6/include -Wall -W -Wshadow -mtune=i686 -lpthread  -L/usr/X11R6/lib conftest.cc -lm -L/usr/lib -lcurl -L/usr/lib -lgssapi_krb5 -lkrb5 -lk5crypto -lkrb5support -lcom_err -lresolv -lidn -lssl -lcrypto -ldl -lssl -lcrypto -lz  >&5
./configure: line 25489: g++: command not found
configure:25494: $? = 127
configure: failed program was:
| /* confdefs.h.  */
| 
| #define PACKAGE_NAME ""
| #define PACKAGE_TARNAME ""
| #define PACKAGE_VERSION ""
| #define PACKAGE_STRING ""
| #define PACKAGE_BUGREPORT ""
| #define PACKAGE "bzflag"
| #define VERSION "2.0.8"
| #define BZ_BUILD_OS "linux-gnu"
| #define BZ_BUILD_USER "tropican8"
| #define BUILD_REGEX 1
| #ifdef __cplusplus
| void exit (int);
| #endif
| #define STDC_HEADERS 1
| #define HAVE_SYS_TYPES_H 1
| #define HAVE_SYS_STAT_H 1
| #define HAVE_STDLIB_H 1
| #define HAVE_STRING_H 1
| #define HAVE_MEMORY_H 1
| #define HAVE_STRINGS_H 1
| #define HAVE_INTTYPES_H 1
| #define HAVE_STDINT_H 1
| #define HAVE_UNISTD_H 1
| #define HAVE_DLFCN_H 1
| #define STDC_HEADERS 1
| #define HAVE_GL_GLX_H 1
| #define HAVE_SDL_SDL_H 1
| #define HAVE_X11_XLIB_H 1
| #define HAVE_LINUX_INPUT_H 1
| #define HAVE_STDINT_H 1
| #define HAVE_SYS_PARAM_H 1
| #define HAVE_UNISTD_H 1
| #define HAVE_VALUES_H 1
| #define HAVE_SOCKLEN_T 1
| #define HAVE_FF_EFFECT_RUMBLE 1
| #define HAVE_FF_EFFECT_DIRECTIONAL 1
| #define HAVE_LIBM 1
| #define HAVE_ACOSF 1
| #define HAVE_ASINF 1
| #define HAVE_ATAN2F 1
| #define HAVE_ATANF 1
| #define HAVE_COSF 1
| #define HAVE_EXPF 1
| #define HAVE_FABSF 1
| #define HAVE_FLOORF 1
| #define HAVE_FMODF 1
| #define HAVE_HYPOTF 1
| #define HAVE_LOGF 1
| #define HAVE_LOG10F 1
| #define HAVE_POWF 1
| #define HAVE_SINF 1
| #define HAVE_SQRTF 1
| #define HAVE_TANF 1
| #define HAVE_SDL 1
| #define ROBOT 1
| #define SNAPPING 1
| #define INSTALL_DATA_DIR "/usr/local/share/bzflag"
| #define HALF_RATE_AUDIO 1
| #define XF86VIDMODE_EXT 1
| #define NDEBUG 1
| /* end confdefs.h.  */
| /* Define usleep to an innocuous variant, in case <limits.h> declares usleep.
|    For example, HP-UX 11i <limits.h> declares gettimeofday.  */
| #define usleep innocuous_usleep
| 
| /* System header to define __stub macros and hopefully few prototypes,
|     which can conflict with char usleep (); below.
|     Prefer <limits.h> to <assert.h> if __STDC__ is defined, since
|     <limits.h> exists even on freestanding compilers.  */
| 
| #ifdef __STDC__
| # include <limits.h>
| #else
| # include <assert.h>
| #endif
| 
| #undef usleep
| 
| /* Override any gcc2 internal prototype to avoid an error.  */
| #ifdef __cplusplus
| extern "C"
| {
| #endif
| /* We use char because int might match the return type of a gcc2
|    builtin and then its argument prototype would still apply.  */
| char usleep ();
| /* The GNU C library defines this for functions which it implements
|     to always fail with ENOSYS.  Some functions are actually named
|     something starting with __ and the normal name is an alias.  */
| #if defined (__stub_usleep) || defined (__stub___usleep)
| choke me
| #else
| char (*f) () = usleep;
| #endif
| #ifdef __cplusplus
| }
| #endif
| 
| int
| main ()
| {
| return f != usleep;
|   ;
|   return 0;
| }
configure:25518: result: no
configure:25431: checking for vsnprintf
configure:25488: g++ -o conftest  -ffast-math -fno-exceptions -fsigned-char   -I/usr/X11R6/include -Wall -W -Wshadow -mtune=i686 -lpthread  -L/usr/X11R6/lib conftest.cc -lm -L/usr/lib -lcurl -L/usr/lib -lgssapi_krb5 -lkrb5 -lk5crypto -lkrb5support -lcom_err -lresolv -lidn -lssl -lcrypto -ldl -lssl -lcrypto -lz  >&5
./configure: line 25489: g++: command not found
configure:25494: $? = 127
configure: failed program was:
| /* confdefs.h.  */
| 
| #define PACKAGE_NAME ""
| #define PACKAGE_TARNAME ""
| #define PACKAGE_VERSION ""
| #define PACKAGE_STRING ""
| #define PACKAGE_BUGREPORT ""
| #define PACKAGE "bzflag"
| #define VERSION "2.0.8"
| #define BZ_BUILD_OS "linux-gnu"
| #define BZ_BUILD_USER "tropican8"
| #define BUILD_REGEX 1
| #ifdef __cplusplus
| void exit (int);
| #endif
| #define STDC_HEADERS 1
| #define HAVE_SYS_TYPES_H 1
| #define HAVE_SYS_STAT_H 1
| #define HAVE_STDLIB_H 1
| #define HAVE_STRING_H 1
| #define HAVE_MEMORY_H 1
| #define HAVE_STRINGS_H 1
| #define HAVE_INTTYPES_H 1
| #define HAVE_STDINT_H 1
| #define HAVE_UNISTD_H 1
| #define HAVE_DLFCN_H 1
| #define STDC_HEADERS 1
| #define HAVE_GL_GLX_H 1
| #define HAVE_SDL_SDL_H 1
| #define HAVE_X11_XLIB_H 1
| #define HAVE_LINUX_INPUT_H 1
| #define HAVE_STDINT_H 1
| #define HAVE_SYS_PARAM_H 1
| #define HAVE_UNISTD_H 1
| #define HAVE_VALUES_H 1
| #define HAVE_SOCKLEN_T 1
| #define HAVE_FF_EFFECT_RUMBLE 1
| #define HAVE_FF_EFFECT_DIRECTIONAL 1
| #define HAVE_LIBM 1
| #define HAVE_ACOSF 1
| #define HAVE_ASINF 1
| #define HAVE_ATAN2F 1
| #define HAVE_ATANF 1
| #define HAVE_COSF 1
| #define HAVE_EXPF 1
| #define HAVE_FABSF 1
| #define HAVE_FLOORF 1
| #define HAVE_FMODF 1
| #define HAVE_HYPOTF 1
| #define HAVE_LOGF 1
| #define HAVE_LOG10F 1
| #define HAVE_POWF 1
| #define HAVE_SINF 1
| #define HAVE_SQRTF 1
| #define HAVE_TANF 1
| #define HAVE_SDL 1
| #define ROBOT 1
| #define SNAPPING 1
| #define INSTALL_DATA_DIR "/usr/local/share/bzflag"
| #define HALF_RATE_AUDIO 1
| #define XF86VIDMODE_EXT 1
| #define NDEBUG 1
| /* end confdefs.h.  */
| /* Define vsnprintf to an innocuous variant, in case <limits.h> declares vsnprintf.
|    For example, HP-UX 11i <limits.h> declares gettimeofday.  */
| #define vsnprintf innocuous_vsnprintf
| 
| /* System header to define __stub macros and hopefully few prototypes,
|     which can conflict with char vsnprintf (); below.
|     Prefer <limits.h> to <assert.h> if __STDC__ is defined, since
|     <limits.h> exists even on freestanding compilers.  */
| 
| #ifdef __STDC__
| # include <limits.h>
| #else
| # include <assert.h>
| #endif
| 
| #undef vsnprintf
| 
| /* Override any gcc2 internal prototype to avoid an error.  */
| #ifdef __cplusplus
| extern "C"
| {
| #endif
| /* We use char because int might match the return type of a gcc2
|    builtin and then its argument prototype would still apply.  */
| char vsnprintf ();
| /* The GNU C library defines this for functions which it implements
|     to always fail with ENOSYS.  Some functions are actually named
|     something starting with __ and the normal name is an alias.  */
| #if defined (__stub_vsnprintf) || defined (__stub___vsnprintf)
| choke me
| #else
| char (*f) () = vsnprintf;
| #endif
| #ifdef __cplusplus
| }
| #endif
| 
| int
| main ()
| {
| return f != vsnprintf;
|   ;
|   return 0;
| }
configure:25518: result: no
configure:25431: checking for wglGetCurrentContext
configure:25488: g++ -o conftest  -ffast-math -fno-exceptions -fsigned-char   -I/usr/X11R6/include -Wall -W -Wshadow -mtune=i686 -lpthread  -L/usr/X11R6/lib conftest.cc -lm -L/usr/lib -lcurl -L/usr/lib -lgssapi_krb5 -lkrb5 -lk5crypto -lkrb5support -lcom_err -lresolv -lidn -lssl -lcrypto -ldl -lssl -lcrypto -lz  >&5
./configure: line 25489: g++: command not found
configure:25494: $? = 127
configure: failed program was:
| /* confdefs.h.  */
| 
| #define PACKAGE_NAME ""
| #define PACKAGE_TARNAME ""
| #define PACKAGE_VERSION ""
| #define PACKAGE_STRING ""
| #define PACKAGE_BUGREPORT ""
| #define PACKAGE "bzflag"
| #define VERSION "2.0.8"
| #define BZ_BUILD_OS "linux-gnu"
| #define BZ_BUILD_USER "tropican8"
| #define BUILD_REGEX 1
| #ifdef __cplusplus
| void exit (int);
| #endif
| #define STDC_HEADERS 1
| #define HAVE_SYS_TYPES_H 1
| #define HAVE_SYS_STAT_H 1
| #define HAVE_STDLIB_H 1
| #define HAVE_STRING_H 1
| #define HAVE_MEMORY_H 1
| #define HAVE_STRINGS_H 1
| #define HAVE_INTTYPES_H 1
| #define HAVE_STDINT_H 1
| #define HAVE_UNISTD_H 1
| #define HAVE_DLFCN_H 1
| #define STDC_HEADERS 1
| #define HAVE_GL_GLX_H 1
| #define HAVE_SDL_SDL_H 1
| #define HAVE_X11_XLIB_H 1
| #define HAVE_LINUX_INPUT_H 1
| #define HAVE_STDINT_H 1
| #define HAVE_SYS_PARAM_H 1
| #define HAVE_UNISTD_H 1
| #define HAVE_VALUES_H 1
| #define HAVE_SOCKLEN_T 1
| #define HAVE_FF_EFFECT_RUMBLE 1
| #define HAVE_FF_EFFECT_DIRECTIONAL 1
| #define HAVE_LIBM 1
| #define HAVE_ACOSF 1
| #define HAVE_ASINF 1
| #define HAVE_ATAN2F 1
| #define HAVE_ATANF 1
| #define HAVE_COSF 1
| #define HAVE_EXPF 1
| #define HAVE_FABSF 1
| #define HAVE_FLOORF 1
| #define HAVE_FMODF 1
| #define HAVE_HYPOTF 1
| #define HAVE_LOGF 1
| #define HAVE_LOG10F 1
| #define HAVE_POWF 1
| #define HAVE_SINF 1
| #define HAVE_SQRTF 1
| #define HAVE_TANF 1
| #define HAVE_SDL 1
| #define ROBOT 1
| #define SNAPPING 1
| #define INSTALL_DATA_DIR "/usr/local/share/bzflag"
| #define HALF_RATE_AUDIO 1
| #define XF86VIDMODE_EXT 1
| #define NDEBUG 1
| /* end confdefs.h.  */
| /* Define wglGetCurrentContext to an innocuous variant, in case <limits.h> declares wglGetCurrentContext.
|    For example, HP-UX 11i <limits.h> declares gettimeofday.  */
| #define wglGetCurrentContext innocuous_wglGetCurrentContext
| 
| /* System header to define __stub macros and hopefully few prototypes,
|     which can conflict with char wglGetCurrentContext (); below.
|     Prefer <limits.h> to <assert.h> if __STDC__ is defined, since
|     <limits.h> exists even on freestanding compilers.  */
| 
| #ifdef __STDC__
| # include <limits.h>
| #else
| # include <assert.h>
| #endif
| 
| #undef wglGetCurrentContext
| 
| /* Override any gcc2 internal prototype to avoid an error.  */
| #ifdef __cplusplus
| extern "C"
| {
| #endif
| /* We use char because int might match the return type of a gcc2
|    builtin and then its argument prototype would still apply.  */
| char wglGetCurrentContext ();
| /* The GNU C library defines this for functions which it implements
|     to always fail with ENOSYS.  Some functions are actually named
|     something starting with __ and the normal name is an alias.  */
| #if defined (__stub_wglGetCurrentContext) || defined (__stub___wglGetCurrentContext)
| choke me
| #else
| char (*f) () = wglGetCurrentContext;
| #endif
| #ifdef __cplusplus
| }
| #endif
| 
| int
| main ()
| {
| return f != wglGetCurrentContext;
|   ;
|   return 0;
| }
configure:25518: result: no
configure:25537: checking for isnan
configure:25564: g++ -c  -ffast-math -fno-exceptions -fsigned-char   -I/usr/X11R6/include -Wall -W -Wshadow -mtune=i686 conftest.cc >&5
./configure: line 25565: g++: command not found
configure:25570: $? = 127
configure: failed program was:
| /* confdefs.h.  */
| 
| #define PACKAGE_NAME ""
| #define PACKAGE_TARNAME ""
| #define PACKAGE_VERSION ""
| #define PACKAGE_STRING ""
| #define PACKAGE_BUGREPORT ""
| #define PACKAGE "bzflag"
| #define VERSION "2.0.8"
| #define BZ_BUILD_OS "linux-gnu"
| #define BZ_BUILD_USER "tropican8"
| #define BUILD_REGEX 1
| #ifdef __cplusplus
| void exit (int);
| #endif
| #define STDC_HEADERS 1
| #define HAVE_SYS_TYPES_H 1
| #define HAVE_SYS_STAT_H 1
| #define HAVE_STDLIB_H 1
| #define HAVE_STRING_H 1
| #define HAVE_MEMORY_H 1
| #define HAVE_STRINGS_H 1
| #define HAVE_INTTYPES_H 1
| #define HAVE_STDINT_H 1
| #define HAVE_UNISTD_H 1
| #define HAVE_DLFCN_H 1
| #define STDC_HEADERS 1
| #define HAVE_GL_GLX_H 1
| #define HAVE_SDL_SDL_H 1
| #define HAVE_X11_XLIB_H 1
| #define HAVE_LINUX_INPUT_H 1
| #define HAVE_STDINT_H 1
| #define HAVE_SYS_PARAM_H 1
| #define HAVE_UNISTD_H 1
| #define HAVE_VALUES_H 1
| #define HAVE_SOCKLEN_T 1
| #define HAVE_FF_EFFECT_RUMBLE 1
| #define HAVE_FF_EFFECT_DIRECTIONAL 1
| #define HAVE_LIBM 1
| #define HAVE_ACOSF 1
| #define HAVE_ASINF 1
| #define HAVE_ATAN2F 1
| #define HAVE_ATANF 1
| #define HAVE_COSF 1
| #define HAVE_EXPF 1
| #define HAVE_FABSF 1
| #define HAVE_FLOORF 1
| #define HAVE_FMODF 1
| #define HAVE_HYPOTF 1
| #define HAVE_LOGF 1
| #define HAVE_LOG10F 1
| #define HAVE_POWF 1
| #define HAVE_SINF 1
| #define HAVE_SQRTF 1
| #define HAVE_TANF 1
| #define HAVE_SDL 1
| #define ROBOT 1
| #define SNAPPING 1
| #define INSTALL_DATA_DIR "/usr/local/share/bzflag"
| #define HALF_RATE_AUDIO 1
| #define XF86VIDMODE_EXT 1
| #define NDEBUG 1
| /* end confdefs.h.  */
| 
| #ifdef HAVE_CMATH
| #  include <cmath>
| #endif
| 
| int
| main ()
| {
| 
| float f = 0.0f;
| std::isnan(f);
| 
|   ;
|   return 0;
| }
configure:25621: g++ -c  -ffast-math -fno-exceptions -fsigned-char   -I/usr/X11R6/include -Wall -W -Wshadow -mtune=i686 conftest.cc >&5
./configure: line 25622: g++: command not found
configure:25627: $? = 127
configure: failed program was:
| /* confdefs.h.  */
| 
| #define PACKAGE_NAME ""
| #define PACKAGE_TARNAME ""
| #define PACKAGE_VERSION ""
| #define PACKAGE_STRING ""
| #define PACKAGE_BUGREPORT ""
| #define PACKAGE "bzflag"
| #define VERSION "2.0.8"
| #define BZ_BUILD_OS "linux-gnu"
| #define BZ_BUILD_USER "tropican8"
| #define BUILD_REGEX 1
| #ifdef __cplusplus
| void exit (int);
| #endif
| #define STDC_HEADERS 1
| #define HAVE_SYS_TYPES_H 1
| #define HAVE_SYS_STAT_H 1
| #define HAVE_STDLIB_H 1
| #define HAVE_STRING_H 1
| #define HAVE_MEMORY_H 1
| #define HAVE_STRINGS_H 1
| #define HAVE_INTTYPES_H 1
| #define HAVE_STDINT_H 1
| #define HAVE_UNISTD_H 1
| #define HAVE_DLFCN_H 1
| #define STDC_HEADERS 1
| #define HAVE_GL_GLX_H 1
| #define HAVE_SDL_SDL_H 1
| #define HAVE_X11_XLIB_H 1
| #define HAVE_LINUX_INPUT_H 1
| #define HAVE_STDINT_H 1
| #define HAVE_SYS_PARAM_H 1
| #define HAVE_UNISTD_H 1
| #define HAVE_VALUES_H 1
| #define HAVE_SOCKLEN_T 1
| #define HAVE_FF_EFFECT_RUMBLE 1
| #define HAVE_FF_EFFECT_DIRECTIONAL 1
| #define HAVE_LIBM 1
| #define HAVE_ACOSF 1
| #define HAVE_ASINF 1
| #define HAVE_ATAN2F 1
| #define HAVE_ATANF 1
| #define HAVE_COSF 1
| #define HAVE_EXPF 1
| #define HAVE_FABSF 1
| #define HAVE_FLOORF 1
| #define HAVE_FMODF 1
| #define HAVE_HYPOTF 1
| #define HAVE_LOGF 1
| #define HAVE_LOG10F 1
| #define HAVE_POWF 1
| #define HAVE_SINF 1
| #define HAVE_SQRTF 1
| #define HAVE_TANF 1
| #define HAVE_SDL 1
| #define ROBOT 1
| #define SNAPPING 1
| #define INSTALL_DATA_DIR "/usr/local/share/bzflag"
| #define HALF_RATE_AUDIO 1
| #define XF86VIDMODE_EXT 1
| #define NDEBUG 1
| /* end confdefs.h.  */
| 
| #include <cmath>
| #include <math.h>
| 
| int
| main ()
| {
| 
| float f = 0.0f;
| isnan(f);
| 
|   ;
|   return 0;
| }
configure:25657: result: no
configure:25688: g++ -c  -ffast-math -fno-exceptions -fsigned-char   -I/usr/X11R6/include -Wall -W -Wshadow -mtune=i686 conftest.cc >&5
./configure: line 25689: g++: command not found
configure:25694: $? = 127
configure: failed program was:
| /* confdefs.h.  */
| 
| #define PACKAGE_NAME ""
| #define PACKAGE_TARNAME ""
| #define PACKAGE_VERSION ""
| #define PACKAGE_STRING ""
| #define PACKAGE_BUGREPORT ""
| #define PACKAGE "bzflag"
| #define VERSION "2.0.8"
| #define BZ_BUILD_OS "linux-gnu"
| #define BZ_BUILD_USER "tropican8"
| #define BUILD_REGEX 1
| #ifdef __cplusplus
| void exit (int);
| #endif
| #define STDC_HEADERS 1
| #define HAVE_SYS_TYPES_H 1
| #define HAVE_SYS_STAT_H 1
| #define HAVE_STDLIB_H 1
| #define HAVE_STRING_H 1
| #define HAVE_MEMORY_H 1
| #define HAVE_STRINGS_H 1
| #define HAVE_INTTYPES_H 1
| #define HAVE_STDINT_H 1
| #define HAVE_UNISTD_H 1
| #define HAVE_DLFCN_H 1
| #define STDC_HEADERS 1
| #define HAVE_GL_GLX_H 1
| #define HAVE_SDL_SDL_H 1
| #define HAVE_X11_XLIB_H 1
| #define HAVE_LINUX_INPUT_H 1
| #define HAVE_STDINT_H 1
| #define HAVE_SYS_PARAM_H 1
| #define HAVE_UNISTD_H 1
| #define HAVE_VALUES_H 1
| #define HAVE_SOCKLEN_T 1
| #define HAVE_FF_EFFECT_RUMBLE 1
| #define HAVE_FF_EFFECT_DIRECTIONAL 1
| #define HAVE_LIBM 1
| #define HAVE_ACOSF 1
| #define HAVE_ASINF 1
| #define HAVE_ATAN2F 1
| #define HAVE_ATANF 1
| #define HAVE_COSF 1
| #define HAVE_EXPF 1
| #define HAVE_FABSF 1
| #define HAVE_FLOORF 1
| #define HAVE_FMODF 1
| #define HAVE_HYPOTF 1
| #define HAVE_LOGF 1
| #define HAVE_LOG10F 1
| #define HAVE_POWF 1
| #define HAVE_SINF 1
| #define HAVE_SQRTF 1
| #define HAVE_TANF 1
| #define HAVE_SDL 1
| #define ROBOT 1
| #define SNAPPING 1
| #define INSTALL_DATA_DIR "/usr/local/share/bzflag"
| #define HALF_RATE_AUDIO 1
| #define XF86VIDMODE_EXT 1
| #define NDEBUG 1
| /* end confdefs.h.  */
| 
| #include <algorithm>
| 
| int
| main ()
| {
| 
| int i = std::min(0, 1); i = i;
| 
|   ;
|   return 0;
| }
configure:25740: g++ -c  -ffast-math -fno-exceptions -fsigned-char   -I/usr/X11R6/include -Wall -W -Wshadow -mtune=i686 conftest.cc >&5
./configure: line 25741: g++: command not found
configure:25746: $? = 127
configure: failed program was:
| /* confdefs.h.  */
| 
| #define PACKAGE_NAME ""
| #define PACKAGE_TARNAME ""
| #define PACKAGE_VERSION ""
| #define PACKAGE_STRING ""
| #define PACKAGE_BUGREPORT ""
| #define PACKAGE "bzflag"
| #define VERSION "2.0.8"
| #define BZ_BUILD_OS "linux-gnu"
| #define BZ_BUILD_USER "tropican8"
| #define BUILD_REGEX 1
| #ifdef __cplusplus
| void exit (int);
| #endif
| #define STDC_HEADERS 1
| #define HAVE_SYS_TYPES_H 1
| #define HAVE_SYS_STAT_H 1
| #define HAVE_STDLIB_H 1
| #define HAVE_STRING_H 1
| #define HAVE_MEMORY_H 1
| #define HAVE_STRINGS_H 1
| #define HAVE_INTTYPES_H 1
| #define HAVE_STDINT_H 1
| #define HAVE_UNISTD_H 1
| #define HAVE_DLFCN_H 1
| #define STDC_HEADERS 1
| #define HAVE_GL_GLX_H 1
| #define HAVE_SDL_SDL_H 1
| #define HAVE_X11_XLIB_H 1
| #define HAVE_LINUX_INPUT_H 1
| #define HAVE_STDINT_H 1
| #define HAVE_SYS_PARAM_H 1
| #define HAVE_UNISTD_H 1
| #define HAVE_VALUES_H 1
| #define HAVE_SOCKLEN_T 1
| #define HAVE_FF_EFFECT_RUMBLE 1
| #define HAVE_FF_EFFECT_DIRECTIONAL 1
| #define HAVE_LIBM 1
| #define HAVE_ACOSF 1
| #define HAVE_ASINF 1
| #define HAVE_ATAN2F 1
| #define HAVE_ATANF 1
| #define HAVE_COSF 1
| #define HAVE_EXPF 1
| #define HAVE_FABSF 1
| #define HAVE_FLOORF 1
| #define HAVE_FMODF 1
| #define HAVE_HYPOTF 1
| #define HAVE_LOGF 1
| #define HAVE_LOG10F 1
| #define HAVE_POWF 1
| #define HAVE_SINF 1
| #define HAVE_SQRTF 1
| #define HAVE_TANF 1
| #define HAVE_SDL 1
| #define ROBOT 1
| #define SNAPPING 1
| #define INSTALL_DATA_DIR "/usr/local/share/bzflag"
| #define HALF_RATE_AUDIO 1
| #define XF86VIDMODE_EXT 1
| #define NDEBUG 1
| /* end confdefs.h.  */
| 
| #include <algorithm>
| 
| int
| main ()
| {
| 
| int i = std::max(0, 1); i = i;
| 
|   ;
|   return 0;
| }
configure:25793: g++ -c  -ffast-math -fno-exceptions -fsigned-char   -I/usr/X11R6/include -Wall -W -Wshadow -mtune=i686 conftest.cc >&5
./configure: line 25794: g++: command not found
configure:25799: $? = 127
configure: failed program was:
| /* confdefs.h.  */
| 
| #define PACKAGE_NAME ""
| #define PACKAGE_TARNAME ""
| #define PACKAGE_VERSION ""
| #define PACKAGE_STRING ""
| #define PACKAGE_BUGREPORT ""
| #define PACKAGE "bzflag"
| #define VERSION "2.0.8"
| #define BZ_BUILD_OS "linux-gnu"
| #define BZ_BUILD_USER "tropican8"
| #define BUILD_REGEX 1
| #ifdef __cplusplus
| void exit (int);
| #endif
| #define STDC_HEADERS 1
| #define HAVE_SYS_TYPES_H 1
| #define HAVE_SYS_STAT_H 1
| #define HAVE_STDLIB_H 1
| #define HAVE_STRING_H 1
| #define HAVE_MEMORY_H 1
| #define HAVE_STRINGS_H 1
| #define HAVE_INTTYPES_H 1
| #define HAVE_STDINT_H 1
| #define HAVE_UNISTD_H 1
| #define HAVE_DLFCN_H 1
| #define STDC_HEADERS 1
| #define HAVE_GL_GLX_H 1
| #define HAVE_SDL_SDL_H 1
| #define HAVE_X11_XLIB_H 1
| #define HAVE_LINUX_INPUT_H 1
| #define HAVE_STDINT_H 1
| #define HAVE_SYS_PARAM_H 1
| #define HAVE_UNISTD_H 1
| #define HAVE_VALUES_H 1
| #define HAVE_SOCKLEN_T 1
| #define HAVE_FF_EFFECT_RUMBLE 1
| #define HAVE_FF_EFFECT_DIRECTIONAL 1
| #define HAVE_LIBM 1
| #define HAVE_ACOSF 1
| #define HAVE_ASINF 1
| #define HAVE_ATAN2F 1
| #define HAVE_ATANF 1
| #define HAVE_COSF 1
| #define HAVE_EXPF 1
| #define HAVE_FABSF 1
| #define HAVE_FLOORF 1
| #define HAVE_FMODF 1
| #define HAVE_HYPOTF 1
| #define HAVE_LOGF 1
| #define HAVE_LOG10F 1
| #define HAVE_POWF 1
| #define HAVE_SINF 1
| #define HAVE_SQRTF 1
| #define HAVE_TANF 1
| #define HAVE_SDL 1
| #define ROBOT 1
| #define SNAPPING 1
| #define INSTALL_DATA_DIR "/usr/local/share/bzflag"
| #define HALF_RATE_AUDIO 1
| #define XF86VIDMODE_EXT 1
| #define NDEBUG 1
| /* end confdefs.h.  */
| 
| #include <algorithm>
| 
| int
| main ()
| {
| 
| char array[] = "test";
| int i = std::count(array, array + 5, 't'); i = i;
| 
|   ;
|   return 0;
| }
configure:26147: creating ./config.status

## ---------------------- ##
## Running config.status. ##
## ---------------------- ##

This file was extended by config.status, which was
generated by GNU Autoconf 2.59.  Invocation command line was

  CONFIG_FILES    = 
  CONFIG_HEADERS  = 
  CONFIG_LINKS    = 
  CONFIG_COMMANDS = 
  $ ./config.status 

on c-69-253-236-235

config.status:909: creating bzflag.info
config.status:909: creating BZFlag.xcode/Makefile
config.status:909: creating Dev-C++/Makefile
config.status:909: creating Makefile
config.status:909: creating bzflag.lsm
config.status:909: creating bzflag.spec
config.status:909: creating data/Makefile
config.status:909: creating data/fonts/Makefile
config.status:909: creating data/l10n/Makefile
config.status:909: creating debian/Makefile
config.status:909: creating doc/Makefile
config.status:909: creating doc/faq/Makefile
config.status:909: creating doc/guide/Commands/Makefile
config.status:909: creating doc/guide/Flags/Makefile
config.status:909: creating doc/guide/Geometry/Makefile
config.status:909: creating doc/guide/Installation/Makefile
config.status:909: creating doc/guide/Makefile
config.status:909: creating doc/guide/Tactics/Makefile
config.status:909: creating doc/howto/Makefile
config.status:909: creating doc/man/Makefile
config.status:909: creating include/Makefile
config.status:909: creating m4/Makefile
config.status:909: creating man/Makefile
config.status:909: creating man/bzadmin.6
config.status:909: creating man/bzflag.6
config.status:909: creating man/bzfs.6
config.status:909: creating man/bzw.5
config.status:909: creating misc/Makefile
config.status:909: creating package/Makefile
config.status:909: creating package/irix/Makefile
config.status:909: creating package/linux/Makefile
config.status:909: creating package/rpm/Makefile
config.status:909: creating package/win32/Makefile
config.status:909: creating package/win32/nsis/Makefile
config.status:909: creating plugins/Makefile
config.status:909: creating plugins/RogueGenocide/Makefile
config.status:909: creating plugins/SAMPLE_PLUGIN/Makefile
config.status:909: creating plugins/airspawn/Makefile
config.status:909: creating plugins/chathistory/Makefile
config.status:909: creating plugins/hiddenAdmin/Makefile
config.status:909: creating plugins/killall/Makefile
config.status:909: creating plugins/logDetail/Makefile
config.status:909: creating plugins/playHistoryTracker/Makefile
config.status:909: creating plugins/python/Makefile
config.status:909: creating plugins/recordmatch/Makefile
config.status:909: creating plugins/shockwaveDeath/Makefile
config.status:909: creating plugins/vocaliser/Makefile
config.status:909: creating plugins/HoldTheFlag/Makefile
config.status:909: creating plugins/nagware/Makefile
config.status:909: creating plugins/doc/Makefile
config.status:909: creating plugins/vc71/Makefile
config.status:909: creating src/3D/Makefile
config.status:909: creating src/Makefile
config.status:909: creating src/bzadmin/Makefile
config.status:909: creating src/bzflag/Makefile
config.status:909: creating src/bzfs/Makefile
config.status:909: creating src/c-ares/Makefile
config.status:909: creating src/common/Makefile
config.status:909: creating src/date/Makefile
config.status:909: creating src/game/Makefile
config.status:909: creating src/geometry/Makefile
config.status:909: creating src/geometry/models/Makefile
config.status:909: creating src/geometry/models/tank/Makefile
config.status:909: creating src/mediafile/Makefile
config.status:909: creating src/net/Makefile
config.status:909: creating src/obstacle/Makefile
config.status:909: creating src/ogl/Makefile
config.status:909: creating src/platform/MacOSX/BZFlag-Info.plist
config.status:909: creating src/platform/MacOSX/Makefile
config.status:909: creating src/platform/Makefile
config.status:909: creating src/regex/Makefile
config.status:909: creating src/scene/Makefile
config.status:909: creating src/zlib/Makefile
config.status:909: creating tools/Makefile
config.status:909: creating tools/TextTool-W32/Makefile
config.status:909: creating tools/TextTool-W32/res/Makefile
config.status:909: creating tools/bzwtransform/Makefile
config.status:909: creating tools/modeltool/Makefile
config.status:909: creating tools/modeltool/vc71/Makefile
config.status:909: creating win32/Makefile
config.status:909: creating win32/VC71/Makefile
config.status:909: creating win32/VC8/Makefile
config.status:975: creating include/config.h
config.status:1179: include/config.h is unchanged
config.status:1359: executing depfiles commands
configure:27622: result: 
configure:27624: result: BZFlag-2.0.8.20060517 with the following:
configure:27627: result:      no curses!
configure:27637: result:      SDL
configure:27644: result:      bzadmin
configure:27648: result:      no bzflag client binary!

## ---------------- ##
## Cache variables. ##
## ---------------- ##

ac_cv_build=i686-pc-linux-gnu
ac_cv_build_alias=i686-pc-linux-gnu
ac_cv_c_bigendian=no
ac_cv_c_compiler_gnu=yes
ac_cv_c_const=yes
ac_cv_cxx_compiler_gnu=no
ac_cv_env_CC_set=
ac_cv_env_CC_value=
ac_cv_env_CFLAGS_set=
ac_cv_env_CFLAGS_value=
ac_cv_env_CPPFLAGS_set=
ac_cv_env_CPPFLAGS_value=
ac_cv_env_CPP_set=
ac_cv_env_CPP_value=
ac_cv_env_CXXCPP_set=
ac_cv_env_CXXCPP_value=
ac_cv_env_CXXFLAGS_set=
ac_cv_env_CXXFLAGS_value=
ac_cv_env_CXX_set=
ac_cv_env_CXX_value=
ac_cv_env_F77_set=
ac_cv_env_F77_value=
ac_cv_env_FFLAGS_set=
ac_cv_env_FFLAGS_value=
ac_cv_env_LDFLAGS_set=set
ac_cv_env_LDFLAGS_value=-lpthread
ac_cv_env_build_alias_set=
ac_cv_env_build_alias_value=
ac_cv_env_host_alias_set=
ac_cv_env_host_alias_value=
ac_cv_env_target_alias_set=
ac_cv_env_target_alias_value=
ac_cv_exeext=
ac_cv_f77_compiler_gnu=no
ac_cv_func_CGLGetCurrentContext=no
ac_cv_func_Sleep=no
ac_cv_func_WaitForSingleObject=no
ac_cv_func__stricmp=no
ac_cv_func__strnicmp=no
ac_cv_func__vsnprintf=no
ac_cv_func_atexit=no
ac_cv_func_connect=yes
ac_cv_func_dlopen=no
ac_cv_func_gethostbyname=yes
ac_cv_func_getrlimit=no
ac_cv_func_glXGetCurrentContext=no
ac_cv_func_remove=yes
ac_cv_func_select=no
ac_cv_func_shl_load=no
ac_cv_func_shmat=yes
ac_cv_func_snooze=no
ac_cv_func_usleep=no
ac_cv_func_vsnprintf=no
ac_cv_func_wglGetCurrentContext=no
ac_cv_have_x='have_x=yes 		ac_x_includes=/usr/X11R6/include ac_x_libraries=/usr/X11R6/lib'
ac_cv_header_GL_glx_h=yes
ac_cv_header_SDL_SDL_h=yes
ac_cv_header_X11_Xlib_h=yes
ac_cv_header_bstring_h=no
ac_cv_header_cstdio=no
ac_cv_header_cstdlib=no
ac_cv_header_cstring=no
ac_cv_header_dlfcn_h=yes
ac_cv_header_dsound_h=no
ac_cv_header_inttypes_h=yes
ac_cv_header_linux_input_h=yes
ac_cv_header_memory_h=yes
ac_cv_header_stdc=yes
ac_cv_header_stdint_h=yes
ac_cv_header_stdlib_h=yes
ac_cv_header_string_h=yes
ac_cv_header_strings_h=yes
ac_cv_header_sys_param_h=yes
ac_cv_header_sys_stat_h=yes
ac_cv_header_sys_types_h=yes
ac_cv_header_unistd_h=yes
ac_cv_header_values_h=yes
ac_cv_host=i686-pc-linux-gnu
ac_cv_host_alias=i686-pc-linux-gnu
ac_cv_lib_ICE_IceConnectionNumber=yes
ac_cv_lib_Xext_XextAddDisplay=yes
ac_cv_lib_Xi_XListInputDevices=yes
ac_cv_lib_Xxf86vm_XF86VidModeGetAllModeLines=no
ac_cv_lib_bind_gethostent=no
ac_cv_lib_cares_ares_init=no
ac_cv_lib_dl_dlopen=yes
ac_cv_lib_dld_shl_load=no
ac_cv_lib_m_acosf=yes
ac_cv_lib_m_asinf=yes
ac_cv_lib_m_atan2f=yes
ac_cv_lib_m_atanf=yes
ac_cv_lib_m_cosf=yes
ac_cv_lib_m_expf=yes
ac_cv_lib_m_fabsf=yes
ac_cv_lib_m_floorf=yes
ac_cv_lib_m_fmodf=yes
ac_cv_lib_m_hypotf=yes
ac_cv_lib_m_log10f=yes
ac_cv_lib_m_logf=yes
ac_cv_lib_m_powf=yes
ac_cv_lib_m_sinf=yes
ac_cv_lib_m_sqrtf=yes
ac_cv_lib_m_tanf=yes
ac_cv_lib_socket_gethostent=no
ac_cv_lib_socket_socket=no
ac_cv_lib_z_compress=yes
ac_cv_objext=o
ac_cv_path_SDL_CONFIG=/usr/bin/sdl-config
ac_cv_path_install='/usr/bin/install -c'
ac_cv_prog_AR=ar
ac_cv_prog_AWK=mawk
ac_cv_prog_CPP='gcc -E'
ac_cv_prog_HASPOD2MAN=yes
ac_cv_prog_HASWHOAMI=yes
ac_cv_prog_ac_ct_AR=ar
ac_cv_prog_ac_ct_CC=gcc
ac_cv_prog_ac_ct_RANLIB=ranlib
ac_cv_prog_ac_ct_STRIP=strip
ac_cv_prog_ac_ct_WINDRES=:
ac_cv_prog_cc_g=yes
ac_cv_prog_cc_stdc=
ac_cv_prog_cxx_g=no
ac_cv_prog_egrep='grep -E'
ac_cv_prog_f77_g=no
ac_cv_prog_make_make_set=yes
ac_cv_search_glBegin=no
ac_cv_search_gluScaleImage=no
ac_cv_target=i686-pc-linux-gnu
ac_cv_target_alias=i686-pc-linux-gnu
ac_cv_type_socklen_t=yes
am_cv_CC_dependencies_compiler_type=gcc3
am_cv_CXX_dependencies_compiler_type=none
lt_cv_deplibs_check_method=pass_all
lt_cv_dlopen=dlopen
lt_cv_dlopen_libs=-ldl
lt_cv_dlopen_self=yes
lt_cv_dlopen_self_static=no
lt_cv_file_magic_cmd='$MAGIC_CMD'
lt_cv_file_magic_test_file=
lt_cv_ld_reload_flag=-r
lt_cv_objdir=.libs
lt_cv_path_LD=/usr/bin/ld
lt_cv_path_NM='/usr/bin/nm -B'
lt_cv_path_SED=/bin/sed
lt_cv_prog_compiler_c_o=yes
lt_cv_prog_compiler_rtti_exceptions=no
lt_cv_prog_gnu_ld=yes
lt_cv_sys_global_symbol_pipe='sed -n -e '\''s/^.*[ 	]\([ABCDGIRSTW][ABCDGIRSTW]*\)[ 	][ 	]*\([_A-Za-z][_A-Za-z0-9]*\)$/\1 \2 \2/p'\'''
lt_cv_sys_global_symbol_to_c_name_address='sed -n -e '\''s/^: \([^ ]*\) $/  {\"\1\", (lt_ptr) 0},/p'\'' -e '\''s/^[BCDEGRST] \([^ ]*\) \([^ ]*\)$/  {"\2", (lt_ptr) \&\2},/p'\'''
lt_cv_sys_global_symbol_to_cdecl='sed -n -e '\''s/^. .* \(.*\)$/extern int \1;/p'\'''
lt_cv_sys_max_cmd_len=32768
lt_lt_cv_prog_compiler_c_o='"yes"'
lt_lt_cv_sys_global_symbol_pipe='"sed -n -e '\''s/^.*[ 	]\\([ABCDGIRSTW][ABCDGIRSTW]*\\)[ 	][ 	]*\\([_A-Za-z][_A-Za-z0-9]*\\)\$/\\1 \\2 \\2/p'\''"'
lt_lt_cv_sys_global_symbol_to_c_name_address='"sed -n -e '\''s/^: \\([^ ]*\\) \$/  {\\\"\\1\\\", (lt_ptr) 0},/p'\'' -e '\''s/^[BCDEGRST] \\([^ ]*\\) \\([^ ]*\\)\$/  {\"\\2\", (lt_ptr) \\&\\2},/p'\''"'
lt_lt_cv_sys_global_symbol_to_cdecl='"sed -n -e '\''s/^. .* \\(.*\\)\$/extern int \\1;/p'\''"'
mp_cv_curses=no
mp_cv_ncurses=no
mp_cv_pdcurses=no
mp_cv_xcurses=no
my_cv_curl_vers=7.15.3

## ----------------- ##
## Output variables. ##
## ----------------- ##

ACLOCAL='${SHELL} /home/tropican8/bzflag-2.0.8/misc/missing --run aclocal-1.9'
AMDEPBACKSLASH='\'
AMDEP_FALSE='#'
AMDEP_TRUE=''
AMTAR='${SHELL} /home/tropican8/bzflag-2.0.8/misc/missing --run tar'
AR='ar'
AR_FLAGS='cru'
AUTOCONF='${SHELL} /home/tropican8/bzflag-2.0.8/misc/missing --run autoconf'
AUTOHEADER='${SHELL} /home/tropican8/bzflag-2.0.8/misc/missing --run autoheader'
AUTOMAKE='${SHELL} /home/tropican8/bzflag-2.0.8/misc/missing --run automake-1.9'
AWK='mawk'
BEOS_FALSE=''
BEOS_TRUE='#'
BUGGY_MIPSPRO_FALSE=''
BUGGY_MIPSPRO_TRUE='#'
BUILDCARES_FALSE='#'
BUILDCARES_TRUE=''
BUILDZLIB_FALSE=''
BUILDZLIB_TRUE='#'
BUILD_PLUGINS_FALSE=''
BUILD_PLUGINS_TRUE='#'
BUILD_REGEX_FALSE='#'
BUILD_REGEX_TRUE=''
BZADMIN_INCLUDED_FALSE='#'
BZADMIN_INCLUDED_TRUE=''
BZFLAG_DATE='2006-05-17'
BZFLAG_VERSION='2.0.8'
CC='gcc'
CCACHE=''
CCDEPMODE='depmode=gcc3'
CFLAGS='-g -O2'
CLIENT_INCLUDED_FALSE=''
CLIENT_INCLUDED_TRUE='#'
CONFIG=''
CPP='gcc -E'
CPPFLAGS='  -I/usr/X11R6/include -Wall -W -Wshadow -mtune=i686'
CURL_CFLAGS=''
CURSES_LIB=''
CXX='g++'
CXXCPP=''
CXXDEPMODE='depmode=none'
CXXFLAGS=' -ffast-math -fno-exceptions -fsigned-char'
CYGPATH_W='echo'
DEBUG_FALSE=''
DEBUG_TRUE='#'
DEFS='-DHAVE_CONFIG_H'
DEPDIR='.deps'
ECHO='echo'
ECHO_C=''
ECHO_N='-n'
ECHO_T=''
EGREP='grep -E'
EXEEXT=''
F77=''
FFLAGS=''
GLEW_LIBS=''
GLIBS='-lXi -lXext  -lSM -lICE -lX11  '
HASPOD2MAN='yes'
HASPOD2MAN_FALSE='#'
HASPOD2MAN_TRUE=''
HASWHOAMI='yes'
HAVE_CURSES_FALSE=''
HAVE_CURSES_TRUE='#'
HAVE_KRB5_FALSE=''
HAVE_KRB5_TRUE='#'
HAVE_SDL_FALSE='#'
HAVE_SDL_TRUE=''
INSTALL_DATA='${INSTALL} -m 644'
INSTALL_DATA_DIR='/usr/local/share/bzflag'
INSTALL_PROGRAM='${INSTALL}'
INSTALL_SCRIPT='${INSTALL}'
INSTALL_STRIP_PROGRAM='${SHELL} $(install_sh) -c -s'
IRIX_FALSE=''
IRIX_TRUE='#'
KRB5_CFLAGS=''
KRB5_CONFIG='no'
KRB5_LIBS=''
LDFLAGS='-lpthread  -L/usr/X11R6/lib'
LIBDIR='$(top_srcdir)/lib'
LIBOBJS=''
LIBS='-lm -L/usr/lib -lcurl -L/usr/lib -lgssapi_krb5 -lkrb5 -lk5crypto -lkrb5support -lcom_err -lresolv -lidn -lssl -lcrypto -ldl -lssl -lcrypto -lz '
LIBTOOL='$(SHELL) $(top_builddir)/libtool'
LIBTOOL_DEPS='misc/ltmain.sh'
LINUX_FALSE='#'
LINUX_TRUE=''
LN_S='ln -s'
LTLIBOBJS=''
MACOS_FALSE=''
MACOS_TRUE='#'
MAJOR_VERSION='2'
MAKEINFO='${SHELL} /home/tropican8/bzflag-2.0.8/misc/missing --run makeinfo'
MINOR_VERSION='0'
OBJEXT='o'
PACKAGE='bzflag'
PACKAGE_BUGREPORT=''
PACKAGE_NAME=''
PACKAGE_STRING=''
PACKAGE_TARNAME=''
PACKAGE_VERSION=''
PATH_SEPARATOR=':'
PC_FALSE='#'
PC_TRUE=''
PPC_FALSE=''
PPC_TRUE='#'
RANLIB='ranlib'
SDL_CFLAGS='-I/usr/include/SDL -D_REENTRANT'
SDL_CONFIG='/usr/bin/sdl-config'
SDL_IMAGE_LIBS=''
SDL_LIBS='-L/usr/lib -lSDL -lpthread'
SET_MAKE=''
SHELL='/bin/sh'
SOLARIS_FALSE=''
SOLARIS_TRUE='#'
STRIP='strip'
VERSION='2.0.8'
WIN32_FALSE=''
WIN32_TRUE='#'
WINDRES=':'
WINPORT=''
X_CFLAGS=' -I/usr/X11R6/include'
X_EXTRA_LIBS=''
X_LIBS=' -L/usr/X11R6/lib'
X_PRE_LIBS=' -lSM -lICE'
ac_ct_AR='ar'
ac_ct_CC='gcc'
ac_ct_CXX='g++'
ac_ct_F77=''
ac_ct_RANLIB='ranlib'
ac_ct_STRIP='strip'
ac_ct_WINDRES=':'
am__fastdepCC_FALSE='#'
am__fastdepCC_TRUE=''
am__fastdepCXX_FALSE=''
am__fastdepCXX_TRUE='#'
am__include='include'
am__leading_dot='.'
am__quote=''
am__tar='${AMTAR} chof - "$$tardir"'
am__untar='${AMTAR} xf -'
bindir='${exec_prefix}/bin'
build='i686-pc-linux-gnu'
build_alias=''
build_cpu='i686'
build_os='linux-gnu'
build_vendor='pc'
datadir='${prefix}/share'
desktopdir='/usr/local/share/applications'
exec_prefix='${prefix}'
host='i686-pc-linux-gnu'
host_alias=''
host_cpu='i686'
host_os='linux-gnu'
host_vendor='pc'
includedir='${prefix}/include'
infodir='${prefix}/info'
install_sh='/home/tropican8/bzflag-2.0.8/misc/install-sh'
libdir='${exec_prefix}/lib'
libexecdir='${exec_prefix}/libexec'
localstatedir='${prefix}/var'
mandir='${prefix}/man'
mkdir_p='mkdir -p --'
oldincludedir='/usr/include'
prefix='/usr/local'
program_transform_name='s,x,x,'
sbindir='${exec_prefix}/sbin'
sharedstatedir='${prefix}/com'
sysconfdir='${prefix}/etc'
target='i686-pc-linux-gnu'
target_alias=''
target_cpu='i686'
target_os='linux-gnu'
target_vendor='pc'

## ----------- ##
## confdefs.h. ##
## ----------- ##

#define BUILD_REGEX 1
#define BZ_BUILD_OS "linux-gnu"
#define BZ_BUILD_USER "tropican8"
#define HALF_RATE_AUDIO 1
#define HAVE_ACOSF 1
#define HAVE_ASINF 1
#define HAVE_ATAN2F 1
#define HAVE_ATANF 1
#define HAVE_COSF 1
#define HAVE_DLFCN_H 1
#define HAVE_EXPF 1
#define HAVE_FABSF 1
#define HAVE_FF_EFFECT_DIRECTIONAL 1
#define HAVE_FF_EFFECT_RUMBLE 1
#define HAVE_FLOORF 1
#define HAVE_FMODF 1
#define HAVE_GL_GLX_H 1
#define HAVE_HYPOTF 1
#define HAVE_INTTYPES_H 1
#define HAVE_LIBM 1
#define HAVE_LINUX_INPUT_H 1
#define HAVE_LOG10F 1
#define HAVE_LOGF 1
#define HAVE_MEMORY_H 1
#define HAVE_POWF 1
#define HAVE_SDL 1
#define HAVE_SDL_SDL_H 1
#define HAVE_SINF 1
#define HAVE_SOCKLEN_T 1
#define HAVE_SQRTF 1
#define HAVE_STDINT_H 1
#define HAVE_STDINT_H 1
#define HAVE_STDLIB_H 1
#define HAVE_STRINGS_H 1
#define HAVE_STRING_H 1
#define HAVE_SYS_PARAM_H 1
#define HAVE_SYS_STAT_H 1
#define HAVE_SYS_TYPES_H 1
#define HAVE_TANF 1
#define HAVE_UNISTD_H 1
#define HAVE_UNISTD_H 1
#define HAVE_VALUES_H 1
#define HAVE_X11_XLIB_H 1
#define INSTALL_DATA_DIR "/usr/local/share/bzflag"
#define NDEBUG 1
#define PACKAGE "bzflag"
#define PACKAGE_BUGREPORT ""
#define PACKAGE_NAME ""
#define PACKAGE_STRING ""
#define PACKAGE_TARNAME ""
#define PACKAGE_VERSION ""
#define ROBOT 1
#define SNAPPING 1
#define STDC_HEADERS 1
#define STDC_HEADERS 1
#define VERSION "2.0.8"
#define XF86VIDMODE_EXT 1
#endif
#ifdef __cplusplus
void exit (int);

configure: exit 0