This file contains any messages produced by compilers while
running configure, to aid debugging if configure makes a mistake.
configure:964: checking host system type
configure:985: checking target system type
configure:1003: checking build system type
configure:1078: checking for gawk
configure:1176: checking for nsinstall
configure:2188: checking for gcc
configure:2301: checking whether the C compiler (gcc -Wl,--as-needed) works
configure:2317: gcc -o conftest -Wl,--as-needed conftest.c 1>&5
configure:2343: checking whether the C compiler (gcc -Wl,--as-needed) is a cross-compiler
configure:2348: checking whether we are using GNU C
configure:2357: gcc -E conftest.c
configure:2376: checking whether gcc accepts -g
configure:2412: checking for c++
configure:2444: checking whether the C++ compiler (c++ -Wl,--as-needed) works
configure:2460: c++ -o conftest -Wl,--as-needed conftest.C 1>&5
configure:2486: checking whether the C++ compiler (c++ -Wl,--as-needed) is a cross-compiler
configure:2491: checking whether we are using GNU C++
configure:2500: c++ -E conftest.C
configure:2519: checking whether c++ accepts -g
configure:2568: gcc -c conftest.c 1>&5
configure:2585: gcc -c conftest.c 1>&5
configure: In function 'main':
configure:2581: warning: incompatible implicit declaration of built-in function 'exit'
configure:2604: checking for ranlib
configure:2636: checking for as
configure:2677: checking for ar
configure:2712: checking for ld
configure:2747: checking for strip
configure:2782: checking for windres
configure:3204: checking whether gcc and cc understand -c and -o together
configure:3219: gcc -c conftest.c -o conftest.o 1>&5
configure:3220: gcc -c conftest.c -o conftest.o 1>&5
configure:3225: cc -c conftest.c 1>&5
configure:3227: cc -c conftest.c -o conftest.o 1>&5
configure:3228: cc -c conftest.c -o conftest.o 1>&5
configure:3264: checking how to run the C preprocessor
configure:3285: gcc -E conftest.c >/dev/null 2>conftest.out
configure:3344: checking how to run the C++ preprocessor
configure:3362: c++ -E conftest.C >/dev/null 2>conftest.out
configure:3409: checking for a BSD compatible install
configure:3462: checking whether ln -s works
configure:3487: checking for perl5
configure:3487: checking for perl
configure:3527: checking for minimum required perl version >= 5.004
configure:3537: checking for full perl installation
configure:3550: checking for doxygen
configure:3586: checking for whoami
configure:3622: checking for autoconf
configure:3658: checking for unzip
configure:3696: checking for zip
configure:3737: checking for makedepend
configure:3772: checking for xargs
configure:4066: checking for gmake
configure:4066: checking for make
configure:4134: checking for X
configure:4201: gcc -E conftest.c >/dev/null 2>conftest.out
configure:4277: gcc -o conftest -Wl,--as-needed conftest.c -lXt 1>&5
configure:4448: checking for dnet_ntoa in -ldnet
configure:4470: gcc -o conftest -Wl,--as-needed conftest.c -ldnet 1>&5
/usr/bin/ld: cannot find -ldnet
collect2: ld returned 1 exit status
configure: failed program was:
#line 4456 "configure"
#include "confdefs.h"
/* Override any gcc2 internal prototype to avoid an error. */
#ifdef __cplusplus
extern "C"
#endif
/* We use char because int might match the return type of a gcc2
builtin and then its argument prototype would still apply. */
char dnet_ntoa();
int main() {
dnet_ntoa()
; return 0; }
configure:4492: checking for dnet_ntoa in -ldnet_stub
configure:4514: gcc -o conftest -Wl,--as-needed conftest.c -ldnet_stub 1>&5
/usr/bin/ld: cannot find -ldnet_stub
collect2: ld returned 1 exit status
configure: failed program was:
#line 4500 "configure"
#include "confdefs.h"
/* Override any gcc2 internal prototype to avoid an error. */
#ifdef __cplusplus
extern "C"
#endif
/* We use char because int might match the return type of a gcc2
builtin and then its argument prototype would still apply. */
char dnet_ntoa();
int main() {
dnet_ntoa()
; return 0; }
configure:4543: checking for gethostbyname
configure:4574: gcc -o conftest -Wl,--as-needed conftest.c 1>&5
configure:4647: checking for connect
configure:4678: gcc -o conftest -Wl,--as-needed conftest.c 1>&5
configure:4745: checking for remove
configure:4776: gcc -o conftest -Wl,--as-needed conftest.c 1>&5
configure:4843: checking for shmat
configure:4874: gcc -o conftest -Wl,--as-needed conftest.c 1>&5
configure:4950: checking for IceConnectionNumber in -lICE
configure:4972: gcc -o conftest -Wl,--as-needed conftest.c -lICE 1>&5
configure:5410: checking whether ld has archive extraction flags
configure:5434: gcc -o conftest -Wl,--whole-archive conftest.c -Wl,--no-whole-archive 1>&5
configure:5469: checking for 64-bit OS
configure:5479: gcc -o conftest -Wl,--as-needed conftest.c 1>&5
configure: failed program was:
#line 5474 "configure"
#include "confdefs.h"
int main () {
if (sizeof(long) == 8) { return 0; } return 1; }
configure:6957: checking for ANSI C header files
configure:6970: gcc -E conftest.c >/dev/null 2>conftest.out
configure:7037: gcc -o conftest -Wl,--as-needed conftest.c 1>&5
configure: In function 'main':
configure:7032: warning: incompatible implicit declaration of built-in function 'exit'
configure:7061: checking for working const
configure:7115: gcc -c conftest.c 1>&5
configure:7136: checking for mode_t
configure:7169: checking for off_t
configure:7202: checking for pid_t
configure:7235: checking for size_t
configure:7268: checking for st_blksize in struct stat
configure:7281: gcc -c conftest.c 1>&5
configure:7302: checking for siginfo_t
configure:7315: gcc -c conftest.c 1>&5
configure:7349: checking for int16_t
configure:7362: gcc -c conftest.c 1>&5
configure:7384: checking for int32_t
configure:7397: gcc -c conftest.c 1>&5
configure:7419: checking for int64_t
configure:7432: gcc -c conftest.c 1>&5
configure:7454: checking for int64
configure:7467: gcc -c conftest.c 1>&5
configure: In function 'main':
configure:7463: error: 'int64' undeclared (first use in this function)
configure:7463: error: (Each undeclared identifier is reported only once
configure:7463: error: for each function it appears in.)
configure:7463: error: expected ';' before 'foo'
configure: failed program was:
#line 7459 "configure"
#include "confdefs.h"
#include <stdio.h>
#include <sys/types.h>
int main() {
int64 foo = 0;
; return 0; }
configure:7489: checking for uint
configure:7502: gcc -c conftest.c 1>&5
configure:7524: checking for uint_t
configure:7537: gcc -c conftest.c 1>&5
configure: In function 'main':
configure:7533: error: 'uint_t' undeclared (first use in this function)
configure:7533: error: (Each undeclared identifier is reported only once
configure:7533: error: for each function it appears in.)
configure:7533: error: expected ';' before 'foo'
configure: failed program was:
#line 7529 "configure"
#include "confdefs.h"
#include <stdio.h>
#include <sys/types.h>
int main() {
uint_t foo = 0;
; return 0; }
configure:7559: checking for uint16_t
configure:7572: gcc -c conftest.c 1>&5
configure: In function 'main':
configure:7568: error: 'uint16_t' undeclared (first use in this function)
configure:7568: error: (Each undeclared identifier is reported only once
configure:7568: error: for each function it appears in.)
configure:7568: error: expected ';' before 'foo'
configure: failed program was:
#line 7564 "configure"
#include "confdefs.h"
#include <stdio.h>
#include <sys/types.h>
int main() {
uint16_t foo = 0;
; return 0; }
configure:7603: checking for uname.domainname
configure:7616: c++ -c conftest.C 1>&5
configure:7640: checking for uname.__domainname
configure:7653: c++ -c conftest.C 1>&5
configure: In function 'int main()':
configure:7649: error: 'struct utsname' has no member named '__domainname'
configure: failed program was:
#line 7645 "configure"
#include "confdefs.h"
#include <sys/utsname.h>
int main() {
struct utsname *res; char *domain;
(void)uname(res); if (res != 0) { domain = res->__domainname; }
; return 0; }
configure:7686: checking for usable wchar_t (2 bytes, unsigned)
configure:7701: gcc -o conftest -Wl,--as-needed conftest.c 1>&5
configure: failed program was:
#line 7694 "configure"
#include "confdefs.h"
#include <stddef.h>
int main () {
return (sizeof(wchar_t) != 2) ||
(wchar_t)-1 < (wchar_t) 0 ; }
configure:7736: checking for compiler -fshort-wchar option
configure:7751: c++ -o conftest -fshort-wchar -Wl,--as-needed conftest.C 1>&5
configure:7787: checking for visibility(hidden) attribute
configure:7812: checking for visibility(default) attribute
configure:7837: checking for visibility pragma support
configure:7862: checking For x86_64 gcc visibility bug with builtins (GCC bug 20297)
configure:7905: checking for dirent.h that defines DIR
configure:7918: gcc -c conftest.c 1>&5
configure:7943: checking for opendir in -ldir
configure:7962: gcc -o conftest -Wl,--as-needed conftest.c -ldir 1>&5
/usr/bin/ld: cannot find -ldir
collect2: ld returned 1 exit status
configure: failed program was:
#line 7951 "configure"
#include "confdefs.h"
/* Override any gcc2 internal prototype to avoid an error. */
/* We use char because int might match the return type of a gcc2
builtin and then its argument prototype would still apply. */
char opendir();
int main() {
opendir()
; return 0; }
configure:8035: checking for sys/byteorder.h
configure:8045: gcc -E conftest.c >/dev/null 2>conftest.out
configure:8041:27: error: sys/byteorder.h: No such file or directory
configure: failed program was:
#line 8040 "configure"
#include "confdefs.h"
#include <sys/byteorder.h>
configure:8035: checking for compat.h
configure:8045: gcc -E conftest.c >/dev/null 2>conftest.out
configure:8041:20: error: compat.h: No such file or directory
configure: failed program was:
#line 8040 "configure"
#include "confdefs.h"
#include <compat.h>
configure:8035: checking for getopt.h
configure:8045: gcc -E conftest.c >/dev/null 2>conftest.out
configure:8075: checking for sys/bitypes.h
configure:8085: gcc -E conftest.c >/dev/null 2>conftest.out
configure:8075: checking for memory.h
configure:8085: gcc -E conftest.c >/dev/null 2>conftest.out
configure:8075: checking for unistd.h
configure:8085: gcc -E conftest.c >/dev/null 2>conftest.out
configure:8115: checking for gnu/libc-version.h
configure:8125: gcc -E conftest.c >/dev/null 2>conftest.out
configure:8115: checking for nl_types.h
configure:8125: gcc -E conftest.c >/dev/null 2>conftest.out
configure:8155: checking for malloc.h
configure:8165: gcc -E conftest.c >/dev/null 2>conftest.out
configure:8195: checking for X11/XKBlib.h
configure:8205: gcc -E conftest.c >/dev/null 2>conftest.out
configure:8236: checking for sys/statvfs.h
configure:8246: gcc -E conftest.c >/dev/null 2>conftest.out
configure:8236: checking for sys/statfs.h
configure:8246: gcc -E conftest.c >/dev/null 2>conftest.out
configure:8236: checking for sys/vfs.h
configure:8246: gcc -E conftest.c >/dev/null 2>conftest.out
configure:8236: checking for sys/mount.h
configure:8246: gcc -E conftest.c >/dev/null 2>conftest.out
configure:8277: checking for mmintrin.h
configure:8287: gcc -E conftest.c >/dev/null 2>conftest.out
In file included from configure:8283:
/usr/lib/gcc/i486-linux-gnu/4.1.2/include/mmintrin.h:34:3: error: #error "MMX instruction set not enabled"
configure: failed program was:
#line 8282 "configure"
#include "confdefs.h"
#include <mmintrin.h>
configure:8324: checking for new
configure:8334: c++ -E conftest.C >/dev/null 2>conftest.out
configure:8375: checking for sys/cdefs.h
configure:8385: gcc -E conftest.c >/dev/null 2>conftest.out
configure:8419: checking for gethostbyname_r in -lc_r
configure:8438: gcc -o conftest -Wl,--as-needed conftest.c -lc_r 1>&5
/usr/bin/ld: cannot find -lc_r
collect2: ld returned 1 exit status
configure: failed program was:
#line 8427 "configure"
#include "confdefs.h"
/* Override any gcc2 internal prototype to avoid an error. */
/* We use char because int might match the return type of a gcc2
builtin and then its argument prototype would still apply. */
char gethostbyname_r();
int main() {
gethostbyname_r()
; return 0; }
configure:8468: checking for atan in -lm
configure:8487: gcc -o conftest -Wl,--as-needed conftest.c -lm 1>&5
configure:8480: warning: conflicting types for built-in function 'atan'
configure:8521: checking for dlopen in -ldl
configure:8540: gcc -o conftest -Wl,--as-needed conftest.c -ldl -lm 1>&5
configure:8557: checking for dlfcn.h
configure:8567: gcc -E conftest.c >/dev/null 2>conftest.out
configure:8702: checking for socket in -lsocket
configure:8721: gcc -o conftest -Wl,--as-needed conftest.c -lsocket -ldl -lm 1>&5
/usr/bin/ld: cannot find -lsocket
collect2: ld returned 1 exit status
configure: failed program was:
#line 8710 "configure"
#include "confdefs.h"
/* Override any gcc2 internal prototype to avoid an error. */
/* We use char because int might match the return type of a gcc2
builtin and then its argument prototype would still apply. */
char socket();
int main() {
socket()
; return 0; }
configure:8766: checking for XDrawLines in -lX11
configure:8785: gcc -o conftest -Wl,--as-needed conftest.c -lX11 -lX11 -ldl -lm 1>&5
configure:8807: checking for XextAddDisplay in -lXext
configure:8826: gcc -o conftest -Wl,--as-needed conftest.c -lXext -lX11 -ldl -lm 1>&5
configure:8850: checking for XtFree in -lXt
configure:8869: gcc -o conftest -Wl,--as-needed conftest.c -lXt -ldl -lm 1>&5
configure:9023: checking for XineramaIsActive in -lXinerama
configure:9042: gcc -o conftest -Wl,--as-needed conftest.c -lXinerama -lX11 -lXext -ldl -lm 1>&5
configure:9064: checking for X11/extensions/Xinerama.h
configure:9074: gcc -E conftest.c >/dev/null 2>conftest.out
configure:9097: checking for XShmCreateImage in -lXext
configure:9116: gcc -o conftest -Wl,--as-needed conftest.c -lXext -lX11 -lXext -ldl -lm 1>&5
configure:9138: checking for X11/extensions/XShm.h
configure:9148: gcc -E conftest.c >/dev/null 2>conftest.out
configure:9178: checking for XieFloGeometry in -lXIE
configure:9197: gcc -o conftest -Wl,--as-needed conftest.c -lXIE -lX11 -lXext -ldl -lm 1>&5
/usr/bin/ld: cannot find -lXIE
collect2: ld returned 1 exit status
configure: failed program was:
#line 9186 "configure"
#include "confdefs.h"
/* Override any gcc2 internal prototype to avoid an error. */
/* We use char because int might match the return type of a gcc2
builtin and then its argument prototype would still apply. */
char XieFloGeometry();
int main() {
XieFloGeometry()
; return 0; }
configure:9219: checking for X11/extensions/XIElib.h
configure:9229: gcc -E conftest.c >/dev/null 2>conftest.out
configure:9225:35: error: X11/extensions/XIElib.h: No such file or directory
configure: failed program was:
#line 9224 "configure"
#include "confdefs.h"
#include <X11/extensions/XIElib.h>
configure:9303: checking for freetype-config
configure:9339: checking for FreeType - version >= 6.1.0
configure:9413: gcc -o conftest -I/usr/include/freetype2 -Wl,--as-needed conftest.c -lfreetype -lz -ldl -lm 1>&5
configure:9465: checking for pthread_create in -lpthreads
gcc -o dummy dummy.c -lpthreads -Wl,--as-needed -ldl -lm
dummy.c: In function 'main':
dummy.c:9: warning: incompatible implicit declaration of built-in function 'exit'
/usr/bin/ld: cannot find -lpthreads
collect2: ld returned 1 exit status
configure:9487: checking for pthread_create in -lpthread
gcc -o dummy dummy.c -lpthread -Wl,--as-needed -ldl -lm
dummy.c: In function 'main':
dummy.c:9: warning: incompatible implicit declaration of built-in function 'exit'
configure:9587: checking whether gcc accepts -pthread
configure:9732: checking whether mmap() sees write()s
configure:9775: gcc -o conftest -pthread -Wl,--as-needed conftest.c -ldl -lm 1>&5
configure:9800: checking whether gcc needs -traditional
configure:9846: checking for 8-bit clean memcmp
configure:9864: gcc -o conftest -pthread -Wl,--as-needed conftest.c -ldl -lm 1>&5
configure: In function 'main':
configure:9859: warning: incompatible implicit declaration of built-in function 'exit'
configure:9884: checking for random
configure:9912: gcc -o conftest -pthread -Wl,--as-needed conftest.c -ldl -lm 1>&5
configure:9884: checking for strerror
configure:9912: gcc -o conftest -pthread -Wl,--as-needed conftest.c -ldl -lm 1>&5
configure:9884: checking for lchown
configure:9912: gcc -o conftest -pthread -Wl,--as-needed conftest.c -ldl -lm 1>&5
configure:9884: checking for fchmod
configure:9912: gcc -o conftest -pthread -Wl,--as-needed conftest.c -ldl -lm 1>&5
configure:9884: checking for snprintf
configure:9912: gcc -o conftest -pthread -Wl,--as-needed conftest.c -ldl -lm 1>&5
configure:9896: warning: conflicting types for built-in function 'snprintf'
configure:9884: checking for statvfs
configure:9912: gcc -o conftest -pthread -Wl,--as-needed conftest.c -ldl -lm 1>&5
configure:9884: checking for memmove
configure:9912: gcc -o conftest -pthread -Wl,--as-needed conftest.c -ldl -lm 1>&5
configure:9896: warning: conflicting types for built-in function 'memmove'
configure:9884: checking for rint
configure:9912: gcc -o conftest -pthread -Wl,--as-needed conftest.c -ldl -lm 1>&5
configure:9896: warning: conflicting types for built-in function 'rint'
configure:9884: checking for stat64
configure:9912: gcc -o conftest -pthread -Wl,--as-needed conftest.c -ldl -lm 1>&5
configure:9884: checking for lstat64
configure:9912: gcc -o conftest -pthread -Wl,--as-needed conftest.c -ldl -lm 1>&5
configure:9939: checking for flockfile
configure:9967: gcc -o conftest -pthread -Wl,--as-needed conftest.c -ldl -lm 1>&5
configure:9939: checking for getpagesize
configure:9967: gcc -o conftest -pthread -Wl,--as-needed conftest.c -ldl -lm 1>&5
configure:9996: checking for localtime_r
configure:10024: gcc -o conftest -pthread -Wl,--as-needed conftest.c -ldl -lm 1>&5
configure:9996: checking for strtok_r
configure:10024: gcc -o conftest -pthread -Wl,--as-needed conftest.c -ldl -lm 1>&5
configure:10060: checking for wcrtomb
configure:10072: c++ -o conftest -fshort-wchar -pthread -Wl,--as-needed conftest.C -ldl -lm 1>&5
configure:10092: checking for mbrtowc
configure:10104: c++ -o conftest -fshort-wchar -pthread -Wl,--as-needed conftest.C -ldl -lm 1>&5
configure:10133: checking for res_ninit()
configure:10150: gcc -o conftest -pthread -Wl,--as-needed conftest.c -ldl -lm 1>&5
configure:10180: checking for gnu_get_libc_version()
configure:10196: c++ -o conftest -fshort-wchar -pthread -Wl,--as-needed conftest.C -ldl -lm 1>&5
configure:10225: checking for iconv in -lc
configure:10247: c++ -o conftest -fshort-wchar -pthread -Wl,--as-needed conftest.C -lc -ldl -lm 1>&5
configure:10356: checking for iconv()
configure:10375: c++ -o conftest -fshort-wchar -pthread -Wl,--as-needed conftest.C -ldl -lm 1>&5
configure:10399: checking for iconv() with const input
configure:10419: c++ -c -fshort-wchar -pthread conftest.C 1>&5
configure: In function 'int main()':
configure:10413: error: invalid conversion from 'const char**' to 'char**'
configure:10413: error: initializing argument 2 of 'size_t iconv(void*, char**, size_t*, char**, size_t*)'
configure: failed program was:
#line 10404 "configure"
#include "confdefs.h"
#include <stdlib.h>
#include <iconv.h>
int main() {
const char *input = "testing";
iconv_t h = iconv_open("", "");
iconv(h, &input, NULL, NULL, NULL);
iconv_close(h);
; return 0; }
configure:10448: checking for nl_langinfo and CODESET
configure:10460: c++ -o conftest -fshort-wchar -pthread -Wl,--as-needed conftest.C -ldl -lm 1>&5
configure:10492: checking for an implementation of va_copy()
configure:10516: gcc -o conftest -pthread -Wl,--as-needed conftest.c -ldl -lm 1>&5
configure: In function 'f':
configure:10510: warning: incompatible implicit declaration of built-in function 'exit'
configure:10533: checking for an implementation of __va_copy()
configure:10557: gcc -o conftest -pthread -Wl,--as-needed conftest.c -ldl -lm 1>&5
configure: In function 'f':
configure:10551: warning: incompatible implicit declaration of built-in function 'exit'
configure:10574: checking whether va_lists can be copied by value
configure:10598: gcc -o conftest -pthread -Wl,--as-needed conftest.c -ldl -lm 1>&5
configure: In function 'f':
configure:10592: warning: incompatible implicit declaration of built-in function 'exit'
configure:10697: checking for C++ exceptions flag
configure:10732: checking for gcc 3.0 ABI
configure:10750: c++ -c -fshort-wchar -pthread conftest.C 1>&5
configure:10774: checking for C++ "explicit" keyword
configure:10789: c++ -c -fshort-wchar -pthread conftest.C 1>&5
configure:10810: checking for C++ "typename" keyword
configure:10834: c++ -c -fshort-wchar -pthread conftest.C 1>&5
configure:10855: checking for modern C++ template specialization syntax support
configure:10870: c++ -c -fshort-wchar -pthread conftest.C 1>&5
configure:10892: checking whether partial template specialization works
configure:10905: c++ -c -fshort-wchar -pthread conftest.C 1>&5
configure:10926: checking whether operators must be re-defined for templates derived from templates
configure:10943: c++ -c -fshort-wchar -pthread conftest.C 1>&5
configure:10965: checking whether we need to cast a derived template to pass as its base class
configure:10979: c++ -c -fshort-wchar -pthread conftest.C 1>&5
configure:11000: checking whether the compiler can resolve const ambiguities for templates
configure:11026: c++ -c -fshort-wchar -pthread conftest.C 1>&5
configure:11048: checking whether the C++ "using" keyword can change access
configure:11061: c++ -c -fshort-wchar -pthread conftest.C 1>&5
configure:11072: c++ -c -fshort-wchar -pthread conftest.C 1>&5
configure: In function 'int main()':
configure:11065: error: 'int A::foo()' is inaccessible
configure:11068: error: within this context
configure: failed program was:
#line 11064 "configure"
#include "confdefs.h"
class A { public: int foo() { return 1; } };
class B : public A { private: using A::foo; };
int main() {
B b; return b.foo();
; return 0; }
configure:11100: checking whether the C++ "using" keyword resolves ambiguity
configure:11121: c++ -c -fshort-wchar -pthread conftest.C 1>&5
configure:11142: checking for "std::" namespace
configure:11154: c++ -c -fshort-wchar -pthread conftest.C 1>&5
configure:11175: checking whether standard template operator!=() is ambiguous
configure:11190: c++ -c -fshort-wchar -pthread conftest.C 1>&5
configure:11212: checking for C++ reinterpret_cast
configure:11225: c++ -c -fshort-wchar -pthread conftest.C 1>&5
configure:11246: checking for C++ dynamic_cast to void*
configure:11270: c++ -o conftest -fshort-wchar -pthread -Wl,--as-needed conftest.C -ldl -lm 1>&5
configure:11294: checking whether C++ requires implementation of unused virtual methods
configure:11306: c++ -o conftest -fshort-wchar -pthread -Wl,--as-needed conftest.C -ldl -lm 1>&5
/tmp/cceEGAOG.o: In function `X::X()':
conftest.C:(.text._ZN1XC1Ev[X::X()]+0x4): undefined reference to `vtable for X'
collect2: ld returned 1 exit status
configure: failed program was:
#line 11299 "configure"
#include "confdefs.h"
class X {private: virtual void never_called();};
int main() {
X x;
; return 0; }
configure:11329: checking for trouble comparing to zero near std::operator!=()
configure:11345: c++ -c -fshort-wchar -pthread conftest.C 1>&5
configure:11377: checking for LC_MESSAGES
configure:11389: gcc -c -pthread conftest.c 1>&5
configure:11715: checking for jpeg_destroy_compress in -ljpeg
configure:11734: gcc -o conftest -I/usr/include -pthread -L/usr/lib -Wl,--as-needed conftest.c -ljpeg -ldl -lm 1>&5
configure:11777: gcc -o conftest -I/usr/include -pthread -L/usr/lib -Wl,--as-needed conftest.c -ljpeg -ldl -lm 1>&5
configure: In function 'main':
configure:11769: warning: incompatible implicit declaration of built-in function 'exit'
configure:11818: checking for gzread in -lz
configure:11837: gcc -o conftest -I/usr/include -pthread -L/usr/lib -Wl,--as-needed conftest.c -lz -ldl -lm 1>&5
configure:11886: gcc -o conftest -I/usr/include -pthread -L/usr/lib -Wl,--as-needed conftest.c -lz -ldl -lm 1>&5
configure: In function 'main':
configure:11876: warning: incompatible implicit declaration of built-in function 'exit'
configure:11929: checking for png_get_valid in -lpng
configure:11948: gcc -o conftest -I/usr/include -I/usr/include -pthread -L/usr/lib -L/usr/lib -lz -lz -Wl,--as-needed conftest.c -lpng -ldl -lm 1>&5
configure:11990: gcc -o conftest -I/usr/include -I/usr/include -pthread -L/usr/lib -L/usr/lib -lz -lz -Wl,--as-needed conftest.c -lpng -ldl -lm 1>&5
configure: In function 'main':
configure:11982: warning: incompatible implicit declaration of built-in function 'exit'
configure:12473: checking for pkg-config
configure:12517: checking for gtk+-2.0 >= 1.3.7
configure:12524: checking MOZ_GTK2_CFLAGS
configure:12529: checking MOZ_GTK2_LIBS
configure:13384: checking for xft
configure:13391: checking MOZ_XFT_CFLAGS
configure:13396: checking MOZ_XFT_LIBS
configure:13475: checking for pango >= 1.1.0
configure:13482: checking _PANGOCHK_CFLAGS
configure:13487: checking _PANGOCHK_LIBS
configure:13591: checking for pangoxft >= 1.6.0
configure:13598: checking MOZ_PANGO_CFLAGS
configure:13603: checking MOZ_PANGO_LIBS
configure:13671: checking for XpGetPrinterList in -lXp
configure:13690: gcc -o conftest -pthread -Wl,--as-needed conftest.c -lXp -lXext -lX11 -ldl -lm 1>&5
configure:13807: checking for gnome-vfs-2.0 >= 2.0 gnome-vfs-module-2.0 >= 2.0
configure:13814: checking MOZ_GNOMEVFS_CFLAGS
configure:13819: checking MOZ_GNOMEVFS_LIBS
configure:13914: checking for gconf-2.0 >= 1.2.1
configure:13921: checking MOZ_GCONF_CFLAGS
configure:13926: checking MOZ_GCONF_LIBS
configure:14017: checking for libgnome-2.0 >= 2.0
configure:14024: checking MOZ_LIBGNOME_CFLAGS
configure:14029: checking MOZ_LIBGNOME_LIBS
configure:14151: checking for libgnomeui-2.0 >= 2.2.0
configure:14158: checking MOZ_GNOMEUI_CFLAGS
configure:14163: checking MOZ_GNOMEUI_LIBS
configure:15549: checking for valid optimization flags
configure:15560: gcc -c -pthread -pipe -w -O2 -g -fno-strict-aliasing conftest.c 1>&5
configure:15897: checking for __builtin_vec_new
configure:15928: c++ -o conftest -fshort-wchar -pthread -Wl,--as-needed conftest.C -ldl -lm 1>&5
/tmp/ccOhGTpE.o: In function `main':
conftest.C:(.text+0x12): undefined reference to `__builtin_vec_new'
collect2: ld returned 1 exit status
configure: failed program was:
#line 15902 "configure"
#include "confdefs.h"
/* System header to define __stub macros and hopefully few prototypes,
which can conflict with char __builtin_vec_new(); below. */
#include <assert.h>
/* Override any gcc2 internal prototype to avoid an error. */
#ifdef __cplusplus
extern "C"
#endif
/* We use char because int might match the return type of a gcc2
builtin and then its argument prototype would still apply. */
char __builtin_vec_new();
int main() {
/* The GNU C library defines this for functions which it implements
to always fail with ENOSYS. Some functions are actually named
something starting with __ and the normal name is an alias. */
#if defined (__stub___builtin_vec_new) || defined (__stub_____builtin_vec_new)
choke me
#else
__builtin_vec_new();
#endif
; return 0; }
configure:15897: checking for __builtin_vec_delete
configure:15928: c++ -o conftest -fshort-wchar -pthread -Wl,--as-needed conftest.C -ldl -lm 1>&5
/tmp/ccQNRM4Y.o: In function `main':
conftest.C:(.text+0x12): undefined reference to `__builtin_vec_delete'
collect2: ld returned 1 exit status
configure: failed program was:
#line 15902 "configure"
#include "confdefs.h"
/* System header to define __stub macros and hopefully few prototypes,
which can conflict with char __builtin_vec_delete(); below. */
#include <assert.h>
/* Override any gcc2 internal prototype to avoid an error. */
#ifdef __cplusplus
extern "C"
#endif
/* We use char because int might match the return type of a gcc2
builtin and then its argument prototype would still apply. */
char __builtin_vec_delete();
int main() {
/* The GNU C library defines this for functions which it implements
to always fail with ENOSYS. Some functions are actually named
something starting with __ and the normal name is an alias. */
#if defined (__stub___builtin_vec_delete) || defined (__stub_____builtin_vec_delete)
choke me
#else
__builtin_vec_delete();
#endif
; return 0; }
configure:15897: checking for __builtin_new
configure:15928: c++ -o conftest -fshort-wchar -pthread -Wl,--as-needed conftest.C -ldl -lm 1>&5
/tmp/cccI62Uj.o: In function `main':
conftest.C:(.text+0x12): undefined reference to `__builtin_new'
collect2: ld returned 1 exit status
configure: failed program was:
#line 15902 "configure"
#include "confdefs.h"
/* System header to define __stub macros and hopefully few prototypes,
which can conflict with char __builtin_new(); below. */
#include <assert.h>
/* Override any gcc2 internal prototype to avoid an error. */
#ifdef __cplusplus
extern "C"
#endif
/* We use char because int might match the return type of a gcc2
builtin and then its argument prototype would still apply. */
char __builtin_new();
int main() {
/* The GNU C library defines this for functions which it implements
to always fail with ENOSYS. Some functions are actually named
something starting with __ and the normal name is an alias. */
#if defined (__stub___builtin_new) || defined (__stub_____builtin_new)
choke me
#else
__builtin_new();
#endif
; return 0; }
configure:15897: checking for __builtin_delete
configure:15928: c++ -o conftest -fshort-wchar -pthread -Wl,--as-needed conftest.C -ldl -lm 1>&5
/tmp/ccUcofvl.o: In function `main':
conftest.C:(.text+0x12): undefined reference to `__builtin_delete'
collect2: ld returned 1 exit status
configure: failed program was:
#line 15902 "configure"
#include "confdefs.h"
/* System header to define __stub macros and hopefully few prototypes,
which can conflict with char __builtin_delete(); below. */
#include <assert.h>
/* Override any gcc2 internal prototype to avoid an error. */
#ifdef __cplusplus
extern "C"
#endif
/* We use char because int might match the return type of a gcc2
builtin and then its argument prototype would still apply. */
char __builtin_delete();
int main() {
/* The GNU C library defines this for functions which it implements
to always fail with ENOSYS. Some functions are actually named
something starting with __ and the normal name is an alias. */
#if defined (__stub___builtin_delete) || defined (__stub_____builtin_delete)
choke me
#else
__builtin_delete();
#endif
; return 0; }
configure:15897: checking for __pure_virtual
configure:15928: c++ -o conftest -fshort-wchar -pthread -Wl,--as-needed conftest.C -ldl -lm 1>&5
/tmp/ccycerRG.o: In function `main':
conftest.C:(.text+0x12): undefined reference to `__pure_virtual'
collect2: ld returned 1 exit status
configure: failed program was:
#line 15902 "configure"
#include "confdefs.h"
/* System header to define __stub macros and hopefully few prototypes,
which can conflict with char __pure_virtual(); below. */
#include <assert.h>
/* Override any gcc2 internal prototype to avoid an error. */
#ifdef __cplusplus
extern "C"
#endif
/* We use char because int might match the return type of a gcc2
builtin and then its argument prototype would still apply. */
char __pure_virtual();
int main() {
/* The GNU C library defines this for functions which it implements
to always fail with ENOSYS. Some functions are actually named
something starting with __ and the normal name is an alias. */
#if defined (__stub___pure_virtual) || defined (__stub_____pure_virtual)
choke me
#else
__pure_virtual();
#endif
; return 0; }
configure:16171: checking for __cxa_demangle
configure:16202: c++ -o conftest -fshort-wchar -pthread -Wl,--as-needed conftest.C -ldl -lm 1>&5
configure:16340: checking for gcc -pipe support
dummy-hello.c: In function 'main':
dummy-hello.c:2: warning: incompatible implicit declaration of built-in function 'exit'
configure:16362: gcc -c -pthread -pipe conftest.c 1>&5
configure:16404: checking whether compiler supports -Wno-long-long
configure:16413: gcc -c -pthread -pipe -Wno-long-long conftest.c 1>&5
configure:16434: checking whether C compiler supports -fprofile-generate
configure:16443: gcc -c -pthread -pipe -fprofile-generate conftest.c 1>&5
configure:16557: checking for correct temporary object destruction order
configure:16582: c++ -o conftest -fshort-wchar -pthread -pipe -Wl,--as-needed conftest.C -ldl -lm 1>&5
configure:16603: checking for correct overload resolution with const and templates
configure:16638: c++ -c -fshort-wchar -pthread -pipe -Wall -Wconversion -Wpointer-arith -Wcast-align -Woverloaded-virtual -Wsynth -Wno-ctor-dtor-privacy -Wno-non-virtual-dtor -Wno-long-long conftest.C 1>&5
configure:16974: checking for libIDL-2.0 >= 0.8.0
configure:16981: checking LIBIDL_CFLAGS
configure:16986: checking LIBIDL_LIBS
configure:18370: checking for glib-2.0 >= 1.3.7
configure:18377: checking GLIB_CFLAGS
configure:18382: checking GLIB_LIBS
configure:19128: checking for cairo >= 0.3.0
configure:19135: checking CAIRO_CFLAGS
configure:19140: checking CAIRO_LIBS
configure:19811: gcc -c -Wall -W -Wno-unused -Wpointer-arith -Wcast-align -Wno-long-long -pthread -pipe conftest.c 1>&5
configure: In function 'main':
configure:19805: warning: implicit declaration of function 'exit'
configure:19805: warning: incompatible implicit declaration of built-in function 'exit'