$ cat /var/lib/mock/fedora-6-i386-core/result/build.log
Installing /builddir/build/SRPMS/SteGUI-0.0.1-5.fc6.src.rpm
Building target platforms: i386
Building for target i386
Executing(%prep): /bin/sh -e /var/tmp/rpm-tmp.14665
+ umask 022
+ cd /builddir/build/BUILD
+ LANG=C
+ export LANG
+ unset DISPLAY
+ cd /builddir/build/BUILD
+ rm -rf SteGUI-0.0.1
+ /usr/bin/bzip2 -dc /builddir/build/SOURCES/SteGUI-0.0.1.tar.bz2
+ tar -xf -
+ STATUS=0
+ '[' 0 -ne 0 ']'
+ cd SteGUI-0.0.1
++ /usr/bin/id -u
+ '[' 501 = 0 ']'
++ /usr/bin/id -u
+ '[' 501 = 0 ']'
+ /bin/chmod -Rf a+rX,u+w,g-w,o-w .
+ exit 0
Executing(%build): /bin/sh -e /var/tmp/rpm-tmp.14665
+ umask 022
+ cd /builddir/build/BUILD
+ cd SteGUI-0.0.1
+ LANG=C
+ export LANG
+ unset DISPLAY
+ CFLAGS='-O2 -g -pipe -Wall -Wp,-D_FORTIFY_SOURCE=2 -fexceptions -fstack-protector --param=ssp-buffer-size=4 -m32 -march=i386 -mtune=generic -fasynchronous-unwind-tables'
+ CXXFLAGS='-O2 -g -pipe -Wall -Wp,-D_FORTIFY_SOURCE=2 -fexceptions -fstack-protector --param=ssp-buffer-size=4 -m32 -march=i386 -mtune=generic -fasynchronous-unwind-tables'
+ make all
g++ -Wall -pedantic -O2 `fltk-config --cxxflags` -c -o src/Callback.o src/Callback.cc
src/Callback.cc: In static member function 'static void Callback::quit_cb(Fl_Widget*, void*)':
src/Callback.cc:86: warning: 'fl_ask' is deprecated (declared at /usr/include/FL/fl_ask.H:59)
src/Callback.cc:86: warning: 'fl_ask' is deprecated (declared at /usr/include/FL/fl_ask.H:59)
g++ -Wall -pedantic -O2 `fltk-config --cxxflags` -c -o src/CardWidget.o src/CardWidget.cc
g++ -Wall -pedantic -O2 `fltk-config --cxxflags` -c -o src/EmbedWindow.o src/EmbedWindow.cc
src/EmbedWindow.cc: In member function 'std::string EmbedWindow::parseOptions()':
src/EmbedWindow.cc:332: warning: 'fl_ask' is deprecated (declared at /usr/include/FL/fl_ask.H:59)
src/EmbedWindow.cc:332: warning: 'fl_ask' is deprecated (declared at /usr/include/FL/fl_ask.H:59)
g++ -Wall -pedantic -O2 `fltk-config --cxxflags` -c -o src/ExtractWindow.o src/ExtractWindow.cc
src/ExtractWindow.cc: In member function 'std::string ExtractWindow::parseOptions()':
src/ExtractWindow.cc:157: warning: 'fl_ask' is deprecated (declared at /usr/include/FL/fl_ask.H:59)
src/ExtractWindow.cc:157: warning: 'fl_ask' is deprecated (declared at /usr/include/FL/fl_ask.H:59)
g++ -Wall -pedantic -O2 `fltk-config --cxxflags` -c -o src/ImgWidget.o src/ImgWidget.cc
g++ -Wall -pedantic -O2 `fltk-config --cxxflags` -c -o src/MsgWindow.o src/MsgWindow.cc
g++ -Wall -pedantic -O2 `fltk-config --cxxflags` -c -o src/PlayerPanel.o src/PlayerPanel.cc
g++ -Wall -pedantic -O2 `fltk-config --cxxflags` -c -o src/SndWidget.o src/SndWidget.cc
g++ -Wall -pedantic -O2 `fltk-config --cxxflags` -c -o src/SteGUI.o src/SteGUI.cc
g++ -Wall -pedantic -O2 `fltk-config --cxxflags` -c -o src/StegWindow.o src/StegWindow.cc
g++ -Wall -pedantic -O2 `fltk-config --cxxflags` -c -o src/Support.o src/Support.cc
src/Support.cc: In static member function 'static void Support::get_info(const char*)':
src/Support.cc:74: warning: 'fl_ask' is deprecated (declared at /usr/include/FL/fl_ask.H:59)
src/Support.cc:74: warning: 'fl_ask' is deprecated (declared at /usr/include/FL/fl_ask.H:59)
g++ -Wall -pedantic -O2 `fltk-config --cxxflags` -c -o src/TxtWidget.o src/TxtWidget.cc
src/TxtWidget.cc: In member function 'void TxtWidget::saveFile(std::string)':
src/TxtWidget.cc:65: warning: 'fl_ask' is deprecated (declared at /usr/include/FL/fl_ask.H:59)
src/TxtWidget.cc:65: warning: 'fl_ask' is deprecated (declared at /usr/include/FL/fl_ask.H:59)
gcc -O2 -c -o src/Player.o src/Player.c
src/Player.c:40:28: error: alsa/asoundlib.h: No such file or directory
src/Player.c:64: error: expected declaration specifiers or '...' before '*' token
src/Player.c:64: error: expected ')' before '*' token
src/Player.c:65: error: expected declaration specifiers or '...' before '*' token
src/Player.c:65: error: expected ')' before '*' token
src/Player.c:66: error: expected declaration specifiers or '...' before '*' token
src/Player.c:66: error: expected ')' before '*' token
src/Player.c:67: error: expected declaration specifiers or '...' before '*' token
src/Player.c:67: error: expected ')' before '*' token
src/Player.c:70: error: expected '=', ',', ';', 'asm' or '__attribute__' before '*' token
src/Player.c:72: error: expected specifier-qualifier-list before 'snd_pcm_format_t'
src/Player.c:81: error: expected '=', ',', ';', 'asm' or '__attribute__' before 'stream'
src/Player.c:86: error: expected '=', ',', ';', 'asm' or '__attribute__' before 'chunk_size'
src/Player.c:89: error: expected '=', ',', ';', 'asm' or '__attribute__' before 'period_frames'
src/Player.c:90: error: expected '=', ',', ';', 'asm' or '__attribute__' before 'buffer_frames'
src/Player.c:97: error: expected '=', ',', ';', 'asm' or '__attribute__' before '*' token
src/Player.c: In function 'signal_handler':
src/Player.c:136: error: 'handle' undeclared (first use in this function)
src/Player.c:136: error: (Each undeclared identifier is reported only once
src/Player.c:136: error: for each function it appears in.)
src/Player.c: In function 'cleanup':
src/Player.c:153: error: 'handle' undeclared (first use in this function)
src/Player.c:159: error: 'log' undeclared (first use in this function)
src/Player.c: In function 'playsound':
src/Player.c:172: error: 'snd_pcm_info_t' undeclared (first use in this function)
src/Player.c:172: error: 'info' undeclared (first use in this function)
src/Player.c:183: error: 'log' undeclared (first use in this function)
src/Player.c:187: error: 'stream' undeclared (first use in this function)
src/Player.c:187: error: 'SND_PCM_STREAM_PLAYBACK' undeclared (first use in this function)
src/Player.c:189: error: 'chunk_size' undeclared (first use in this function)
src/Player.c:190: error: 'struct <anonymous>' has no member named 'format'
src/Player.c:190: error: 'SND_PCM_FORMAT_U8' undeclared (first use in this function)
src/Player.c:191: error: 'struct <anonymous>' has no member named 'rate'
src/Player.c:192: error: 'struct <anonymous>' has no member named 'channels'
src/Player.c:195: error: 'handle' undeclared (first use in this function)
src/Player.c:223: error: 'writei_func' undeclared (first use in this function)
src/Player.c:223: error: 'snd_pcm_writei' undeclared (first use in this function)
src/Player.c:224: error: 'readi_func' undeclared (first use in this function)
src/Player.c:224: error: 'snd_pcm_readi' undeclared (first use in this function)
src/Player.c:225: error: 'writen_func' undeclared (first use in this function)
src/Player.c:225: error: 'snd_pcm_writen' undeclared (first use in this function)
src/Player.c:226: error: 'readn_func' undeclared (first use in this function)
src/Player.c:226: error: 'snd_pcm_readn' undeclared (first use in this function)
src/Player.c: In function 'test_wavefile':
src/Player.c:339: error: 'struct <anonymous>' has no member named 'channels'
src/Player.c:342: error: 'struct <anonymous>' has no member named 'format'
src/Player.c:342: error: 'SND_PCM_FORMAT_U8' undeclared (first use in this function)
src/Player.c:343: error: 'struct <anonymous>' has no member named 'format'
src/Player.c:345: error: 'struct <anonymous>' has no member named 'format'
src/Player.c:348: error: 'struct <anonymous>' has no member named 'format'
src/Player.c:349: error: 'struct <anonymous>' has no member named 'format'
src/Player.c:349: error: 'SND_PCM_FORMAT_S16_LE' undeclared (first use in this function)
src/Player.c:351: error: 'struct <anonymous>' has no member named 'format'
src/Player.c:354: error: 'struct <anonymous>' has no member named 'channels'
src/Player.c:356: error: 'struct <anonymous>' has no member named 'format'
src/Player.c:357: error: 'struct <anonymous>' has no member named 'format'
src/Player.c:357: error: 'SND_PCM_FORMAT_S24_3LE' undeclared (first use in this function)
src/Player.c:359: error: 'struct <anonymous>' has no member named 'format'
src/Player.c:362: error: 'struct <anonymous>' has no member named 'format'
src/Player.c:363: error: 'struct <anonymous>' has no member named 'format'
src/Player.c:363: error: 'SND_PCM_FORMAT_S24_LE' undeclared (first use in this function)
src/Player.c:365: error: 'struct <anonymous>' has no member named 'format'
src/Player.c:368: error: 'struct <anonymous>' has no member named 'channels'
src/Player.c:373: error: 'struct <anonymous>' has no member named 'format'
src/Player.c:373: error: 'SND_PCM_FORMAT_S32_LE' undeclared (first use in this function)
src/Player.c:379: error: 'struct <anonymous>' has no member named 'rate'
src/Player.c: In function 'test_au':
src/Player.c:427: error: 'struct <anonymous>' has no member named 'format'
src/Player.c:427: error: 'SND_PCM_FORMAT_U8' undeclared (first use in this function)
src/Player.c:428: error: 'struct <anonymous>' has no member named 'format'
src/Player.c:428: error: 'SND_PCM_FORMAT_MU_LAW' undeclared (first use in this function)
src/Player.c:430: error: 'struct <anonymous>' has no member named 'format'
src/Player.c:433: error: 'struct <anonymous>' has no member named 'format'
src/Player.c:434: error: 'struct <anonymous>' has no member named 'format'
src/Player.c:436: error: 'struct <anonymous>' has no member named 'format'
src/Player.c:439: error: 'struct <anonymous>' has no member named 'format'
src/Player.c:440: error: 'struct <anonymous>' has no member named 'format'
src/Player.c:440: error: 'SND_PCM_FORMAT_S16_BE' undeclared (first use in this function)
src/Player.c:442: error: 'struct <anonymous>' has no member named 'format'
src/Player.c:447: error: 'struct <anonymous>' has no member named 'rate'
src/Player.c:448: error: 'struct <anonymous>' has no member named 'rate'
src/Player.c:448: error: 'struct <anonymous>' has no member named 'rate'
src/Player.c:450: error: 'struct <anonymous>' has no member named 'channels'
src/Player.c:451: error: 'struct <anonymous>' has no member named 'channels'
src/Player.c:451: error: 'struct <anonymous>' has no member named 'channels'
src/Player.c: In function 'set_params':
src/Player.c:462: error: 'snd_pcm_hw_params_t' undeclared (first use in this function)
src/Player.c:462: error: expected expression before 'params'
src/Player.c:463: error: 'snd_pcm_sw_params_t' undeclared (first use in this function)
src/Player.c:463: error: 'swparams' undeclared (first use in this function)
src/Player.c:464: error: 'snd_pcm_uframes_t' undeclared (first use in this function)
src/Player.c:464: error: expected ';' before 'buffer_size'
src/Player.c:467: error: expected ';' before 'xfer_align'
src/Player.c:469: error: expected ';' before 'start_threshold'
src/Player.c:470: error: expected expression before 'params'
src/Player.c:472: error: 'handle' undeclared (first use in this function)
src/Player.c:472: error: expected expression before 'params'
src/Player.c:478: error: 'snd_pcm_access_mask_t' undeclared (first use in this function)
src/Player.c:478: error: 'mask' undeclared (first use in this function)
src/Player.c:480: error: 'SND_PCM_ACCESS_MMAP_INTERLEAVED' undeclared (first use in this function)
src/Player.c:481: error: 'SND_PCM_ACCESS_MMAP_NONINTERLEAVED' undeclared (first use in this function)
src/Player.c:482: error: 'SND_PCM_ACCESS_MMAP_COMPLEX' undeclared (first use in this function)
src/Player.c:483: error: expected expression before 'params'
src/Player.c:485: error: expected expression before 'params'
src/Player.c:488: error: expected expression before 'params'
src/Player.c:494: error: expected expression before 'params'
src/Player.c:499: error: expected expression before 'params'
src/Player.c:509: error: 'struct <anonymous>' has no member named 'rate'
src/Player.c:510: error: expected expression before 'params'
src/Player.c:512: error: 'struct <anonymous>' has no member named 'rate'
src/Player.c:512: error: 'struct <anonymous>' has no member named 'rate'
src/Player.c:514: error: 'struct <anonymous>' has no member named 'rate'
src/Player.c:518: error: 'struct <anonymous>' has no member named 'rate'
src/Player.c:519: error: 'buffer_frames' undeclared (first use in this function)
src/Player.c:520: error: expected expression before 'params'
src/Player.c:526: error: 'period_frames' undeclared (first use in this function)
src/Player.c:533: error: expected expression before 'params'
src/Player.c:536: error: expected expression before 'params'
src/Player.c:540: error: expected expression before 'params'
src/Player.c:543: error: expected expression before 'params'
src/Player.c:547: error: expected expression before 'params'
src/Player.c:550: error: expected expression before 'params'
src/Player.c:553: error: expected expression before 'params'
src/Player.c:554: error: expected expression before 'params'
src/Player.c:555: error: 'chunk_size' undeclared (first use in this function)
src/Player.c:555: error: 'buffer_size' undeclared (first use in this function)
src/Player.c:560: error: 'xfer_align' undeclared (first use in this function)
src/Player.c:579: error: 'start_threshold' undeclared (first use in this function)
src/Player.c:589: error: 'stop_threshold' undeclared (first use in this function)
src/Player.c:600: error: 'log' undeclared (first use in this function)
src/Player.c:607: error: 'struct <anonymous>' has no member named 'format'
src/Player.c:608: error: 'struct <anonymous>' has no member named 'channels'
src/Player.c: In function 'xrun':
src/Player.c:635: error: 'snd_pcm_status_t' undeclared (first use in this function)
src/Player.c:635: error: 'status' undeclared (first use in this function)
src/Player.c:639: error: 'handle' undeclared (first use in this function)
src/Player.c:643: error: 'SND_PCM_STATE_XRUN' undeclared (first use in this function)
src/Player.c:649: error: 'stream' undeclared (first use in this function)
src/Player.c:649: error: 'SND_PCM_STREAM_PLAYBACK' undeclared (first use in this function)
src/Player.c:653: error: 'log' undeclared (first use in this function)
src/Player.c:660: error: 'SND_PCM_STATE_DRAINING' undeclared (first use in this function)
src/Player.c:665: error: 'SND_PCM_STREAM_CAPTURE' undeclared (first use in this function)
src/Player.c: In function 'suspend':
src/Player.c:689: error: 'handle' undeclared (first use in this function)
src/Player.c: In function 'compute_max_peak':
src/Player.c:712: error: 'struct <anonymous>' has no member named 'format'
src/Player.c:723: error: 'struct <anonymous>' has no member named 'format'
src/Player.c:735: error: 'struct <anonymous>' has no member named 'format'
src/Player.c: In function 'pcm_write':
src/Player.c:774: error: 'chunk_size' undeclared (first use in this function)
src/Player.c:775: error: 'struct <anonymous>' has no member named 'format'
src/Player.c:775: error: 'struct <anonymous>' has no member named 'channels'
src/Player.c:779: error: 'handle' undeclared (first use in this function)
src/Player.c:792: error: 'struct <anonymous>' has no member named 'channels'
src/Player.c: In function 'calc_count':
src/Player.c:815: error: 'struct <anonymous>' has no member named 'format'
src/Player.c:815: error: 'struct <anonymous>' has no member named 'rate'
src/Player.c:815: error: 'struct <anonymous>' has no member named 'channels'
src/Player.c: In function 'playback_go':
src/Player.c:855: error: 'chunk_size' undeclared (first use in this function)
src/Player.c:891: error: 'handle' undeclared (first use in this function)
src/Player.c: In function 'playback':
src/Player.c:921: error: 'struct <anonymous>' has no member named 'format'
src/Player.c:921: error: 'struct <anonymous>' has no member named 'format'
make: *** [src/Player.o] Error 1
error: Bad exit status from /var/tmp/rpm-tmp.14665 (%build)
RPM build errors:
Bad exit status from /var/tmp/rpm-tmp.14665 (%build)