rendered paste bodymake[2]: Entering directory `/home/nathan/tgzs/gcc-2.95.3/gcc/ch'gcc -c -DIN_GCC -g -O2 -I. -I.. -I. -I./.. -I./../config -I./../../include decl.cdecl.c: In function start_struct:decl.c:4451: error: argument code doesnt match prototypech-tree.h:736: error: prototype declarationmake[2]: *** [decl.o] Error 1make[2]: Leaving directory `/home/nathan/tgzs/gcc-2.95.3/gcc/ch'make[1]: *** [cc1chill] Error 2make[1]: Leaving directory `/home/nathan/tgzs/gcc-2.95.3/gcc'make: *** [all-gcc] Error 2