Configuring search environment for revdep-rebuild
Checking reverse dependencies...
Packages containing binaries and libraries broken by a package update
will be emerged.
[32;01mCollecting system binaries and libraries...[0m using existing /root/.revdep-rebuild.1_files.
[32;01mCollecting complete LD_LIBRARY_PATH...[0m using existing /root/.revdep-rebuild.2_ldpath.
[32;01mChecking dynamic linking consistency...[0m using existing /root/.revdep-rebuild.3_rebuild.
[32;01mAssigning files to ebuilds...[0m using existing /root/.revdep-rebuild.4_ebuilds.
[32;01mEvaluating package order...[0m using existing /root/.revdep-rebuild.5_order.
[32;01mAll prepared. Starting rebuild...[0m
emerge --oneshot =x11-terms/xterm-207 =x11-libs/qt-3.3.6-r1 =kde-base/arts-3.4.3
..........
Calculating dependencies >>> Unpacking source...
>>> Unpacking libXmu-1.0.2.tar.bz2 to /var/tmp/portage/libXmu-1.0.2/work
[32;01m*[0m Running elibtoolize in: libXmu-1.0.2
[32;01m*[0m Applying portage-1.5.10.patch ...
[32;01m*[0m Applying max_cmd_len-1.5.20.patch ...
[32;01m*[0m Applying sed-1.5.6.patch ...
>>> Source unpacked.
* econf: updating libXmu-1.0.2/config.guess with /usr/share/gnuconfig/config.guess
* econf: updating libXmu-1.0.2/config.sub with /usr/share/gnuconfig/config.sub
./configure --prefix=/usr --host=i686-pc-linux-gnu --mandir=/usr/share/man --infodir=/usr/share/info --datadir=/usr/share --sysconfdir=/etc --localstatedir=/var/lib --prefix=/usr --datadir=/usr/share --enable-ipv6 --build=i686-pc-linux-gnu
checking for a BSD-compatible install... /bin/install -c
checking whether build environment is sane... yes
checking for gawk... gawk
checking whether make sets $(MAKE)... yes
checking whether to enable maintainer-specific portions of Makefiles... no
checking build system type... i686-pc-linux-gnu
checking host system type... i686-pc-linux-gnu
checking for style of include used by make... GNU
checking for i686-pc-linux-gnu-gcc... i686-pc-linux-gnu-gcc
checking for C compiler default output file name... a.out
checking whether the C compiler works... yes
checking whether we are cross compiling... no
checking for suffix of executables...
checking for suffix of object files... o
checking whether we are using the GNU C compiler... yes
checking whether i686-pc-linux-gnu-gcc accepts -g... yes
checking for i686-pc-linux-gnu-gcc option to accept ANSI C... none needed
checking dependency style of i686-pc-linux-gnu-gcc... gcc3
checking for a sed that does not truncate output... /bin/sed
checking for egrep... grep -E
checking for ld used by i686-pc-linux-gnu-gcc... /usr/i686-pc-linux-gnu/bin/ld
checking if the linker (/usr/i686-pc-linux-gnu/bin/ld) is GNU ld... yes
checking for /usr/i686-pc-linux-gnu/bin/ld option to reload object files... -r
checking for BSD-compatible nm... /usr/bin/nm -B
checking whether ln -s works... yes
checking how to recognise dependent libraries... pass_all
checking how to run the C preprocessor... i686-pc-linux-gnu-gcc -E
checking for ANSI C header files... yes
checking for sys/types.h... yes
checking for sys/stat.h... yes
checking for stdlib.h... yes
checking for string.h... yes
checking for memory.h... yes
checking for strings.h... yes
checking for inttypes.h... yes
checking for stdint.h... yes
checking for unistd.h... yes
checking dlfcn.h usability... yes
checking dlfcn.h presence... yes
checking for dlfcn.h... yes
checking for i686-pc-linux-gnu-g++... i686-pc-linux-gnu-g++
checking whether we are using the GNU C++ compiler... yes
checking whether i686-pc-linux-gnu-g++ accepts -g... yes
checking dependency style of i686-pc-linux-gnu-g++... gcc3
checking how to run the C++ preprocessor... i686-pc-linux-gnu-g++ -E
checking for i686-pc-linux-gnu-g77... i686-pc-linux-gnu-g77
checking whether we are using the GNU Fortran 77 compiler... yes
checking whether i686-pc-linux-gnu-g77 accepts -g... yes
checking the maximum length of command line arguments... 32768
checking command to parse /usr/bin/nm -B output from i686-pc-linux-gnu-gcc object... ok
checking for objdir... .libs
checking for i686-pc-linux-gnu-ar... i686-pc-linux-gnu-ar
checking for i686-pc-linux-gnu-ranlib... i686-pc-linux-gnu-ranlib
checking for i686-pc-linux-gnu-strip... i686-pc-linux-gnu-strip
checking if i686-pc-linux-gnu-gcc supports -fno-rtti -fno-exceptions... no
checking for i686-pc-linux-gnu-gcc option to produce PIC... -fPIC
checking if i686-pc-linux-gnu-gcc PIC flag -fPIC works... yes
checking if i686-pc-linux-gnu-gcc static flag -static works... yes
checking if i686-pc-linux-gnu-gcc supports -c -o file.o... yes
checking whether the i686-pc-linux-gnu-gcc linker (/usr/i686-pc-linux-gnu/bin/ld) supports shared libraries... yes
checking whether -lc should be explicitly linked in... no
checking dynamic linker characteristics... GNU/Linux ld.so
checking how to hardcode library paths into programs... immediate
checking whether stripping libraries is possible... yes
checking if libtool supports shared libraries... yes
checking whether to build shared libraries... yes
checking whether to build static libraries... yes
configure: creating libtool
appending configuration tag "CXX" to libtool
checking for ld used by i686-pc-linux-gnu-g++... /usr/i686-pc-linux-gnu/bin/ld
checking if the linker (/usr/i686-pc-linux-gnu/bin/ld) is GNU ld... yes
checking whether the i686-pc-linux-gnu-g++ linker (/usr/i686-pc-linux-gnu/bin/ld) supports shared libraries... yes
checking for i686-pc-linux-gnu-g++ option to produce PIC... -fPIC
checking if i686-pc-linux-gnu-g++ PIC flag -fPIC works... yes
checking if i686-pc-linux-gnu-g++ static flag -static works... yes
checking if i686-pc-linux-gnu-g++ supports -c -o file.o... yes
checking whether the i686-pc-linux-gnu-g++ linker (/usr/i686-pc-linux-gnu/bin/ld) supports shared libraries... yes
checking dynamic linker characteristics... GNU/Linux ld.so
checking how to hardcode library paths into programs... immediate
appending configuration tag "F77" to libtool
checking if libtool supports shared libraries... yes
checking whether to build shared libraries... yes
checking whether to build static libraries... yes
checking for i686-pc-linux-gnu-g77 option to produce PIC... -fPIC
checking if i686-pc-linux-gnu-g77 PIC flag -fPIC works... yes
checking if i686-pc-linux-gnu-g77 static flag -static works... yes
checking if i686-pc-linux-gnu-g77 supports -c -o file.o... yes
checking whether the i686-pc-linux-gnu-g77 linker (/usr/i686-pc-linux-gnu/bin/ld) supports shared libraries... yes
checking dynamic linker characteristics... GNU/Linux ld.so
checking how to hardcode library paths into programs... immediate
checking for i686-pc-linux-gnu-gcc... (cached) i686-pc-linux-gnu-gcc
checking whether we are using the GNU C compiler... (cached) yes
checking whether i686-pc-linux-gnu-gcc accepts -g... (cached) yes
checking for i686-pc-linux-gnu-gcc option to accept ANSI C... (cached) none needed
checking dependency style of i686-pc-linux-gnu-gcc... (cached) gcc3
checking for i686-pc-linux-gnu-pkg-config... no
checking for pkg-config... /usr/bin/pkg-config
checking pkg-config is at least version 0.9.0... yes
checking for XMU... yes
checking for XMUU... yes
checking return type of signal handlers... void
checking if Xtrans should support UNIX socket connections... yes
checking if Xtrans should support TCP socket connections... yes
checking for library containing socket... none required
checking for library containing gethostbyname... none required
checking if IPv6 support should be built... yes
checking for struct sockaddr_in.sin_len... no
configure: creating ./config.status
config.status: creating Makefile
config.status: creating include/Makefile
config.status: creating src/Makefile
config.status: creating xmu.pc
config.status: creating xmuu.pc
config.status: creating config.h
config.status: executing depfiles commands
make all-recursive
make[1]: Entering directory `/var/tmp/portage/libXmu-1.0.2/work/libXmu-1.0.2'
Making all in include
make[2]: Entering directory `/var/tmp/portage/libXmu-1.0.2/work/libXmu-1.0.2/include'
make[2]: Nothing to be done for `all'.
make[2]: Leaving directory `/var/tmp/portage/libXmu-1.0.2/work/libXmu-1.0.2/include'
Making all in src
make[2]: Entering directory `/var/tmp/portage/libXmu-1.0.2/work/libXmu-1.0.2/src'
if /bin/sh ../libtool --tag=CC --mode=compile i686-pc-linux-gnu-gcc -DHAVE_CONFIG_H -I. -I. -I.. -I../include -I../include/X11/Xmu -DBITMAPDIR=\"/usr/include/X11/bitmaps\" -D_BSD_SOURCE -O2 -march=pentium-m -pipe -MT ClientWin.lo -MD -MP -MF ".deps/ClientWin.Tpo" -c -o ClientWin.lo ClientWin.c; \
then mv -f ".deps/ClientWin.Tpo" ".deps/ClientWin.Plo"; else rm -f ".deps/ClientWin.Tpo"; exit 1; fi
if /bin/sh ../libtool --tag=CC --mode=compile i686-pc-linux-gnu-gcc -DHAVE_CONFIG_H -I. -I. -I.. -I../include -I../include/X11/Xmu -DBITMAPDIR=\"/usr/include/X11/bitmaps\" -D_BSD_SOURCE -O2 -march=pentium-m -pipe -MT CursorName.lo -MD -MP -MF ".deps/CursorName.Tpo" -c -o CursorName.lo CursorName.c; \
then mv -f ".deps/CursorName.Tpo" ".deps/CursorName.Plo"; else rm -f ".deps/CursorName.Tpo"; exit 1; fi
mkdir .libs
i686-pc-linux-gnu-gcc -DHAVE_CONFIG_H -I. -I. -I.. -I../include -I../include/X11/Xmu -DBITMAPDIR=\"/usr/include/X11/bitmaps\" -D_BSD_SOURCE -O2 -march=pentium-m -pipe -MT CursorName.lo -MD -MP -MF .deps/CursorName.Tpo -c CursorName.c -fPIC -DPIC -o .libs/CursorName.o
i686-pc-linux-gnu-gcc -DHAVE_CONFIG_H -I. -I. -I.. -I../include -I../include/X11/Xmu -DBITMAPDIR=\"/usr/include/X11/bitmaps\" -D_BSD_SOURCE -O2 -march=pentium-m -pipe -MT ClientWin.lo -MD -MP -MF .deps/ClientWin.Tpo -c ClientWin.c -fPIC -DPIC -o .libs/ClientWin.o
In file included from CursorName.c:33:
../include/X11/Xmu/CharSet.h:39:28: X11/Xfuncproto.h: No such file or directory
In file included from CursorName.c:33:
../include/X11/Xmu/CharSet.h:43: error: syntax error before "void"
../include/X11/Xmu/CharSet.h:46: error: syntax error before "_Xconst"
../include/X11/Xmu/CharSet.h:52: error: syntax error before "_Xconst"
../include/X11/Xmu/CharSet.h:57: error: syntax error before "char"
../include/X11/Xmu/CharSet.h:64: error: syntax error before "_Xconst"
../include/X11/Xmu/CharSet.h:71: error: syntax error before "_Xconst"
In file included from CursorName.c:34:
../include/X11/Xmu/CurUtil.h:40: error: syntax error before "_XFUNCPROTOBEGIN"
../include/X11/Xmu/CurUtil.h:42: error: syntax error before "int"
../include/X11/Xmu/CurUtil.h:44: error: syntax error before "char"
CursorName.c:35:28: X11/cursorfont.h: No such file or directory
In file included from /usr/include/string.h:33,
from CursorName.c:36:
/usr/lib/gcc/i686-pc-linux-gnu/3.4.6/include/stddef.h:213: error: syntax error before "typedef"
CursorName.c:39: error: syntax error before "char"
CursorName.c: In function `XmuCursorNameToIndex':
CursorName.c:41: error: syntax error before "struct"
CursorName.c: At top level:
CursorName.c:45: warning: braces around scalar initializer
CursorName.c:45: warning: (near initialization for `cursor_names[0]')
CursorName.c:45: warning: initialization makes integer from pointer without a cast
CursorName.c:45: error: `XC_X_cursor' undeclared here (not in a function)
CursorName.c:45: warning: excess elements in scalar initializer
CursorName.c:45: warning: (near initialization for `cursor_names[0]')
CursorName.c:46: warning: braces around scalar initializer
CursorName.c:46: warning: (near initialization for `cursor_names[1]')
CursorName.c:46: warning: initialization makes integer from pointer without a cast
CursorName.c:46: error: `XC_arrow' undeclared here (not in a function)
CursorName.c:46: warning: excess elements in scalar initializer
CursorName.c:46: warning: (near initialization for `cursor_names[1]')
CursorName.c:47: warning: braces around scalar initializer
CursorName.c:47: warning: (near initialization for `cursor_names[2]')
CursorName.c:47: warning: initialization makes integer from pointer without a cast
CursorName.c:47: error: `XC_based_arrow_down' undeclared here (not in a function)
CursorName.c:47: warning: excess elements in scalar initializer
CursorName.c:47: warning: (near initialization for `cursor_names[2]')
CursorName.c:48: warning: braces around scalar initializer
CursorName.c:48: warning: (near initialization for `cursor_names[3]')
CursorName.c:48: warning: initialization makes integer from pointer without a cast
CursorName.c:48: error: `XC_based_arrow_up' undeclared here (not in a function)
CursorName.c:48: warning: excess elements in scalar initializer
CursorName.c:48: warning: (near initialization for `cursor_names[3]')
CursorName.c:49: warning: braces around scalar initializer
CursorName.c:49: warning: (near initialization for `cursor_names[4]')
CursorName.c:49: warning: initialization makes integer from pointer without a cast
CursorName.c:49: error: `XC_boat' undeclared here (not in a function)
CursorName.c:49: warning: excess elements in scalar initializer
CursorName.c:49: warning: (near initialization for `cursor_names[4]')
CursorName.c:50: warning: braces around scalar initializer
CursorName.c:50: warning: (near initialization for `cursor_names[5]')
CursorName.c:50: warning: initialization makes integer from pointer without a cast
CursorName.c:50: error: `XC_bogosity' undeclared here (not in a function)
CursorName.c:50: warning: excess elements in scalar initializer
CursorName.c:50: warning: (near initialization for `cursor_names[5]')
CursorName.c:51: warning: braces around scalar initializer
CursorName.c:51: warning: (near initialization for `cursor_names[6]')
CursorName.c:51: warning: initialization makes integer from pointer without a cast
CursorName.c:51: error: `XC_bottom_left_corner' undeclared here (not in a function)
CursorName.c:51: warning: excess elements in scalar initializer
CursorName.c:51: warning: (near initialization for `cursor_names[6]')
CursorName.c:52: warning: braces around scalar initializer
CursorName.c:52: warning: (near initialization for `cursor_names[7]')
CursorName.c:52: warning: initialization makes integer from pointer without a cast
CursorName.c:52: error: `XC_bottom_right_corner' undeclared here (not in a function)
CursorName.c:52: warning: excess elements in scalar initializer
CursorName.c:52: warning: (near initialization for `cursor_names[7]')
CursorName.c:53: warning: braces around scalar initializer
CursorName.c:53: warning: (near initialization for `cursor_names[8]')
CursorName.c:53: warning: initialization makes integer from pointer without a cast
CursorName.c:53: error: `XC_bottom_side' undeclared here (not in a function)
CursorName.c:53: warning: excess elements in scalar initializer
CursorName.c:53: warning: (near initialization for `cursor_names[8]')
CursorName.c:54: warning: braces around scalar initializer
CursorName.c:54: warning: (near initialization for `cursor_names[9]')
CursorName.c:54: warning: initialization makes integer from pointer without a cast
CursorName.c:54: error: `XC_bottom_tee' undeclared here (not in a function)
CursorName.c:54: warning: excess elements in scalar initializer
CursorName.c:54: warning: (near initialization for `cursor_names[9]')
CursorName.c:55: warning: braces around scalar initializer
CursorName.c:55: warning: (near initialization for `cursor_names[10]')
CursorName.c:55: warning: initialization makes integer from pointer without a cast
CursorName.c:55: error: `XC_box_spiral' undeclared here (not in a function)
CursorName.c:55: warning: excess elements in scalar initializer
CursorName.c:55: warning: (near initialization for `cursor_names[10]')
CursorName.c:56: warning: braces around scalar initializer
CursorName.c:56: warning: (near initialization for `cursor_names[11]')
CursorName.c:56: warning: initialization makes integer from pointer without a cast
CursorName.c:56: error: `XC_center_ptr' undeclared here (not in a function)
CursorName.c:56: warning: excess elements in scalar initializer
CursorName.c:56: warning: (near initialization for `cursor_names[11]')
CursorName.c:57: warning: braces around scalar initializer
CursorName.c:57: warning: (near initialization for `cursor_names[12]')
CursorName.c:57: warning: initialization makes integer from pointer without a cast
CursorName.c:57: error: `XC_circle' undeclared here (not in a function)
CursorName.c:57: warning: excess elements in scalar initializer
CursorName.c:57: warning: (near initialization for `cursor_names[12]')
CursorName.c:58: warning: braces around scalar initializer
CursorName.c:58: warning: (near initialization for `cursor_names[13]')
CursorName.c:58: warning: initialization makes integer from pointer without a cast
CursorName.c:58: error: `XC_clock' undeclared here (not in a function)
CursorName.c:58: warning: excess elements in scalar initializer
CursorName.c:58: warning: (near initialization for `cursor_names[13]')
CursorName.c:59: warning: braces around scalar initializer
CursorName.c:59: warning: (near initialization for `cursor_names[14]')
CursorName.c:59: warning: initialization makes integer from pointer without a cast
CursorName.c:59: error: `XC_coffee_mug' undeclared here (not in a function)
CursorName.c:59: warning: excess elements in scalar initializer
CursorName.c:59: warning: (near initialization for `cursor_names[14]')
CursorName.c:60: warning: braces around scalar initializer
CursorName.c:60: warning: (near initialization for `cursor_names[15]')
CursorName.c:60: warning: initialization makes integer from pointer without a cast
CursorName.c:60: error: `XC_cross' undeclared here (not in a function)
CursorName.c:60: warning: excess elements in scalar initializer
CursorName.c:60: warning: (near initialization for `cursor_names[15]')
CursorName.c:61: warning: braces around scalar initializer
CursorName.c:61: warning: (near initialization for `cursor_names[16]')
CursorName.c:61: warning: initialization makes integer from pointer without a cast
CursorName.c:61: error: `XC_cross_reverse' undeclared here (not in a function)
CursorName.c:61: warning: excess elements in scalar initializer
CursorName.c:61: warning: (near initialization for `cursor_names[16]')
CursorName.c:62: warning: braces around scalar initializer
CursorName.c:62: warning: (near initialization for `cursor_names[17]')
CursorName.c:62: warning: initialization makes integer from pointer without a cast
CursorName.c:62: error: `XC_crosshair' undeclared here (not in a function)
CursorName.c:62: warning: excess elements in scalar initializer
CursorName.c:62: warning: (near initialization for `cursor_names[17]')
CursorName.c:63: warning: braces around scalar initializer
CursorName.c:63: warning: (near initialization for `cursor_names[18]')
CursorName.c:63: warning: initialization makes integer from pointer without a cast
CursorName.c:63: error: `XC_diamond_cross' undeclared here (not in a function)
CursorName.c:63: warning: excess elements in scalar initializer
CursorName.c:63: warning: (near initialization for `cursor_names[18]')
CursorName.c:64: warning: braces around scalar initializer
CursorName.c:64: warning: (near initialization for `cursor_names[19]')
CursorName.c:64: warning: initialization makes integer from pointer without a cast
CursorName.c:64: error: `XC_dot' undeclared here (not in a function)
CursorName.c:64: warning: excess elements in scalar initializer
CursorName.c:64: warning: (near initialization for `cursor_names[19]')
CursorName.c:65: warning: braces around scalar initializer
CursorName.c:65: warning: (near initialization for `cursor_names[20]')
CursorName.c:65: warning: initialization makes integer from pointer without a cast
CursorName.c:65: error: `XC_dotbox' undeclared here (not in a function)
CursorName.c:65: warning: excess elements in scalar initializer
CursorName.c:65: warning: (near initialization for `cursor_names[20]')
CursorName.c:66: warning: braces around scalar initializer
CursorName.c:66: warning: (near initialization for `cursor_names[21]')
CursorName.c:66: warning: initialization makes integer from pointer without a cast
CursorName.c:66: error: `XC_double_arrow' undeclared here (not in a function)
CursorName.c:66: warning: excess elements in scalar initializer
CursorName.c:66: warning: (near initialization for `cursor_names[21]')
CursorName.c:67: warning: braces around scalar initializer
CursorName.c:67: warning: (near initialization for `cursor_names[22]')
CursorName.c:67: warning: initialization makes integer from pointer without a cast
CursorName.c:67: error: `XC_draft_large' undeclared here (not in a function)
CursorName.c:67: warning: excess elements in scalar initializer
CursorName.c:67: warning: (near initialization for `cursor_names[22]')
CursorName.c:68: warning: braces around scalar initializer
CursorName.c:68: warning: (near initialization for `cursor_names[23]')
CursorName.c:68: warning: initialization makes integer from pointer without a cast
CursorName.c:68: error: `XC_draft_small' undeclared here (not in a function)
CursorName.c:68: warning: excess elements in scalar initializer
CursorName.c:68: warning: (near initialization for `cursor_names[23]')
CursorName.c:69: warning: braces around scalar initializer
CursorName.c:69: warning: (near initialization for `cursor_names[24]')
CursorName.c:69: warning: initialization makes integer from pointer without a cast
CursorName.c:69: error: `XC_draped_box' undeclared here (not in a function)
CursorName.c:69: warning: excess elements in scalar initializer
CursorName.c:69: warning: (near initialization for `cursor_names[24]')
CursorName.c:70: warning: braces around scalar initializer
CursorName.c:70: warning: (near initialization for `cursor_names[25]')
CursorName.c:70: warning: initialization makes integer from pointer without a cast
CursorName.c:70: error: `XC_exchange' undeclared here (not in a function)
CursorName.c:70: warning: excess elements in scalar initializer
CursorName.c:70: warning: (near initialization for `cursor_names[25]')
CursorName.c:71: warning: braces around scalar initializer
CursorName.c:71: warning: (near initialization for `cursor_names[26]')
CursorName.c:71: warning: initialization makes integer from pointer without a cast
CursorName.c:71: error: `XC_fleur' undeclared here (not in a function)
CursorName.c:71: warning: excess elements in scalar initializer
CursorName.c:71: warning: (near initialization for `cursor_names[26]')
CursorName.c:72: warning: braces around scalar initializer
CursorName.c:72: warning: (near initialization for `cursor_names[27]')
CursorName.c:72: warning: initialization makes integer from pointer without a cast
CursorName.c:72: error: `XC_gobbler' undeclared here (not in a function)
CursorName.c:72: warning: excess elements in scalar initializer
CursorName.c:72: warning: (near initialization for `cursor_names[27]')
CursorName.c:73: warning: braces around scalar initializer
CursorName.c:73: warning: (near initialization for `cursor_names[28]')
CursorName.c:73: warning: initialization makes integer from pointer without a cast
CursorName.c:73: error: `XC_gumby' undeclared here (not in a function)
CursorName.c:73: warning: excess elements in scalar initializer
CursorName.c:73: warning: (near initialization for `cursor_names[28]')
CursorName.c:74: warning: braces around scalar initializer
CursorName.c:74: warning: (near initialization for `cursor_names[29]')
CursorName.c:74: warning: initialization makes integer from pointer without a cast
CursorName.c:74: error: `XC_hand1' undeclared here (not in a function)
CursorName.c:74: warning: excess elements in scalar initializer
CursorName.c:74: warning: (near initialization for `cursor_names[29]')
CursorName.c:75: warning: braces around scalar initializer
CursorName.c:75: warning: (near initialization for `cursor_names[30]')
CursorName.c:75: warning: initialization makes integer from pointer without a cast
CursorName.c:75: error: `XC_hand2' undeclared here (not in a function)
CursorName.c:75: warning: excess elements in scalar initializer
CursorName.c:75: warning: (near initialization for `cursor_names[30]')
CursorName.c:76: warning: braces around scalar initializer
CursorName.c:76: warning: (near initialization for `cursor_names[31]')
CursorName.c:76: warning: initialization makes integer from pointer without a cast
CursorName.c:76: error: `XC_heart' undeclared here (not in a function)
CursorName.c:76: warning: excess elements in scalar initializer
CursorName.c:76: warning: (near initialization for `cursor_names[31]')
CursorName.c:77: warning: braces around scalar initializer
CursorName.c:77: warning: (near initialization for `cursor_names[32]')
CursorName.c:77: warning: initialization makes integer from pointer without a cast
CursorName.c:77: error: `XC_icon' undeclared here (not in a function)
CursorName.c:77: warning: excess elements in scalar initializer
CursorName.c:77: warning: (near initialization for `cursor_names[32]')
CursorName.c:78: warning: braces around scalar initializer
CursorName.c:78: warning: (near initialization for `cursor_names[33]')
CursorName.c:78: warning: initialization makes integer from pointer without a cast
CursorName.c:78: error: `XC_iron_cross' undeclared here (not in a function)
CursorName.c:78: warning: excess elements in scalar initializer
CursorName.c:78: warning: (near initialization for `cursor_names[33]')
CursorName.c:79: warning: braces around scalar initializer
CursorName.c:79: warning: (near initialization for `cursor_names[34]')
CursorName.c:79: warning: initialization makes integer from pointer without a cast
CursorName.c:79: error: `XC_left_ptr' undeclared here (not in a function)
CursorName.c:79: warning: excess elements in scalar initializer
CursorName.c:79: warning: (near initialization for `cursor_names[34]')
CursorName.c:80: warning: braces around scalar initializer
CursorName.c:80: warning: (near initialization for `cursor_names[35]')
CursorName.c:80: warning: initialization makes integer from pointer without a cast
CursorName.c:80: error: `XC_left_side' undeclared here (not in a function)
CursorName.c:80: warning: excess elements in scalar initializer
CursorName.c:80: warning: (near initialization for `cursor_names[35]')
CursorName.c:81: warning: braces around scalar initializer
CursorName.c:81: warning: (near initialization for `cursor_names[36]')
CursorName.c:81: warning: initialization makes integer from pointer without a cast
CursorName.c:81: error: `XC_left_tee' undeclared here (not in a function)
CursorName.c:81: warning: excess elements in scalar initializer
CursorName.c:81: warning: (near initialization for `cursor_names[36]')
CursorName.c:82: warning: braces around scalar initializer
CursorName.c:82: warning: (near initialization for `cursor_names[37]')
CursorName.c:82: warning: initialization makes integer from pointer without a cast
CursorName.c:82: error: `XC_leftbutton' undeclared here (not in a function)
CursorName.c:82: warning: excess elements in scalar initializer
CursorName.c:82: warning: (near initialization for `cursor_names[37]')
CursorName.c:83: warning: braces around scalar initializer
CursorName.c:83: warning: (near initialization for `cursor_names[38]')
CursorName.c:83: warning: initialization makes integer from pointer without a cast
CursorName.c:83: error: `XC_ll_angle' undeclared here (not in a function)
CursorName.c:83: warning: excess elements in scalar initializer
CursorName.c:83: warning: (near initialization for `cursor_names[38]')
CursorName.c:84: warning: braces around scalar initializer
CursorName.c:84: warning: (near initialization for `cursor_names[39]')
CursorName.c:84: warning: initialization makes integer from pointer without a cast
CursorName.c:84: error: `XC_lr_angle' undeclared here (not in a function)
CursorName.c:84: warning: excess elements in scalar initializer
CursorName.c:84: warning: (near initialization for `cursor_names[39]')
CursorName.c:85: warning: braces around scalar initializer
CursorName.c:85: warning: (near initialization for `cursor_names[40]')
CursorName.c:85: warning: initialization makes integer from pointer without a cast
CursorName.c:85: error: `XC_man' undeclared here (not in a function)
CursorName.c:85: warning: excess elements in scalar initializer
CursorName.c:85: warning: (near initialization for `cursor_names[40]')
CursorName.c:86: warning: braces around scalar initializer
CursorName.c:86: warning: (near initialization for `cursor_names[41]')
CursorName.c:86: warning: initialization makes integer from pointer without a cast
CursorName.c:86: error: `XC_middlebutton' undeclared here (not in a function)
CursorName.c:86: warning: excess elements in scalar initializer
CursorName.c:86: warning: (near initialization for `cursor_names[41]')
CursorName.c:87: warning: braces around scalar initializer
CursorName.c:87: warning: (near initialization for `cursor_names[42]')
CursorName.c:87: warning: initialization makes integer from pointer without a cast
CursorName.c:87: error: `XC_mouse' undeclared here (not in a function)
CursorName.c:87: warning: excess elements in scalar initializer
CursorName.c:87: warning: (near initialization for `cursor_names[42]')
CursorName.c:88: warning: braces around scalar initializer
CursorName.c:88: warning: (near initialization for `cursor_names[43]')
CursorName.c:88: warning: initialization makes integer from pointer without a cast
CursorName.c:88: error: `XC_pencil' undeclared here (not in a function)
CursorName.c:88: warning: excess elements in scalar initializer
CursorName.c:88: warning: (near initialization for `cursor_names[43]')
CursorName.c:89: warning: braces around scalar initializer
CursorName.c:89: warning: (near initialization for `cursor_names[44]')
CursorName.c:89: warning: initialization makes integer from pointer without a cast
CursorName.c:89: error: `XC_pirate' undeclared here (not in a function)
CursorName.c:89: warning: excess elements in scalar initializer
CursorName.c:89: warning: (near initialization for `cursor_names[44]')
CursorName.c:90: warning: braces around scalar initializer
CursorName.c:90: warning: (near initialization for `cursor_names[45]')
CursorName.c:90: warning: initialization makes integer from pointer without a cast
CursorName.c:90: error: `XC_plus' undeclared here (not in a function)
CursorName.c:90: warning: excess elements in scalar initializer
CursorName.c:90: warning: (near initialization for `cursor_names[45]')
CursorName.c:91: warning: braces around scalar initializer
CursorName.c:91: warning: (near initialization for `cursor_names[46]')
CursorName.c:91: warning: initialization makes integer from pointer without a cast
CursorName.c:91: error: `XC_question_arrow' undeclared here (not in a function)
CursorName.c:91: warning: excess elements in scalar initializer
CursorName.c:91: warning: (near initialization for `cursor_names[46]')
CursorName.c:92: warning: braces around scalar initializer
CursorName.c:92: warning: (near initialization for `cursor_names[47]')
CursorName.c:92: warning: initialization makes integer from pointer without a cast
CursorName.c:92: error: `XC_right_ptr' undeclared here (not in a function)
CursorName.c:92: warning: excess elements in scalar initializer
CursorName.c:92: warning: (near initialization for `cursor_names[47]')
CursorName.c:93: warning: braces around scalar initializer
CursorName.c:93: warning: (near initialization for `cursor_names[48]')
CursorName.c:93: warning: initialization makes integer from pointer without a cast
CursorName.c:93: error: `XC_right_side' undeclared here (not in a function)
CursorName.c:93: warning: excess elements in scalar initializer
CursorName.c:93: warning: (near initialization for `cursor_names[48]')
CursorName.c:94: warning: braces around scalar initializer
CursorName.c:94: warning: (near initialization for `cursor_names[49]')
CursorName.c:94: warning: initialization makes integer from pointer without a cast
CursorName.c:94: error: `XC_right_tee' undeclared here (not in a function)
CursorName.c:94: warning: excess elements in scalar initializer
CursorName.c:94: warning: (near initialization for `cursor_names[49]')
CursorName.c:95: warning: braces around scalar initializer
CursorName.c:95: warning: (near initialization for `cursor_names[50]')
CursorName.c:95: warning: initialization makes integer from pointer without a cast
CursorName.c:95: error: `XC_rightbutton' undeclared here (not in a function)
CursorName.c:95: warning: excess elements in scalar initializer
CursorName.c:95: warning: (near initialization for `cursor_names[50]')
CursorName.c:96: warning: braces around scalar initializer
CursorName.c:96: warning: (near initialization for `cursor_names[51]')
CursorName.c:96: warning: initialization makes integer from pointer without a cast
CursorName.c:96: error: `XC_rtl_logo' undeclared here (not in a function)
CursorName.c:96: warning: excess elements in scalar initializer
CursorName.c:96: warning: (near initialization for `cursor_names[51]')
CursorName.c:97: warning: braces around scalar initializer
CursorName.c:97: warning: (near initialization for `cursor_names[52]')
CursorName.c:97: warning: initialization makes integer from pointer without a cast
CursorName.c:97: error: `XC_sailboat' undeclared here (not in a function)
CursorName.c:97: warning: excess elements in scalar initializer
CursorName.c:97: warning: (near initialization for `cursor_names[52]')
CursorName.c:98: warning: braces around scalar initializer
CursorName.c:98: warning: (near initialization for `cursor_names[53]')
CursorName.c:98: warning: initialization makes integer from pointer without a cast
CursorName.c:98: error: `XC_sb_down_arrow' undeclared here (not in a function)
CursorName.c:98: warning: excess elements in scalar initializer
CursorName.c:98: warning: (near initialization for `cursor_names[53]')
CursorName.c:99: warning: braces around scalar initializer
CursorName.c:99: warning: (near initialization for `cursor_names[54]')
CursorName.c:99: warning: initialization makes integer from pointer without a cast
CursorName.c:99: error: `XC_sb_h_double_arrow' undeclared here (not in a function)
CursorName.c:99: warning: excess elements in scalar initializer
CursorName.c:99: warning: (near initialization for `cursor_names[54]')
CursorName.c:100: warning: braces around scalar initializer
CursorName.c:100: warning: (near initialization for `cursor_names[55]')
CursorName.c:100: warning: initialization makes integer from pointer without a cast
CursorName.c:100: error: `XC_sb_left_arrow' undeclared here (not in a function)
CursorName.c:100: warning: excess elements in scalar initializer
CursorName.c:100: warning: (near initialization for `cursor_names[55]')
CursorName.c:101: warning: braces around scalar initializer
CursorName.c:101: warning: (near initialization for `cursor_names[56]')
CursorName.c:101: warning: initialization makes integer from pointer without a cast
CursorName.c:101: error: `XC_sb_right_arrow' undeclared here (not in a function)
CursorName.c:101: warning: excess elements in scalar initializer
CursorName.c:101: warning: (near initialization for `cursor_names[56]')
CursorName.c:102: warning: braces around scalar initializer
CursorName.c:102: warning: (near initialization for `cursor_names[57]')
CursorName.c:102: warning: initialization makes integer from pointer without a cast
CursorName.c:102: error: `XC_sb_up_arrow' undeclared here (not in a function)
CursorName.c:102: warning: excess elements in scalar initializer
CursorName.c:102: warning: (near initialization for `cursor_names[57]')
CursorName.c:103: warning: braces around scalar initializer
CursorName.c:103: warning: (near initialization for `cursor_names[58]')
CursorName.c:103: warning: initialization makes integer from pointer without a cast
CursorName.c:103: error: `XC_sb_v_double_arrow' undeclared here (not in a function)
CursorName.c:103: warning: excess elements in scalar initializer
CursorName.c:103: warning: (near initialization for `cursor_names[58]')
CursorName.c:104: warning: braces around scalar initializer
CursorName.c:104: warning: (near initialization for `cursor_names[59]')
CursorName.c:104: warning: initialization makes integer from pointer without a cast
CursorName.c:104: error: `XC_shuttle' undeclared here (not in a function)
CursorName.c:104: warning: excess elements in scalar initializer
CursorName.c:104: warning: (near initialization for `cursor_names[59]')
CursorName.c:105: warning: braces around scalar initializer
CursorName.c:105: warning: (near initialization for `cursor_names[60]')
CursorName.c:105: warning: initialization makes integer from pointer without a cast
CursorName.c:105: error: `XC_sizing' undeclared here (not in a function)
CursorName.c:105: warning: excess elements in scalar initializer
CursorName.c:105: warning: (near initialization for `cursor_names[60]')
CursorName.c:106: warning: braces around scalar initializer
CursorName.c:106: warning: (near initialization for `cursor_names[61]')
CursorName.c:106: warning: initialization makes integer from pointer without a cast
CursorName.c:106: error: `XC_spider' undeclared here (not in a function)
CursorName.c:106: warning: excess elements in scalar initializer
CursorName.c:106: warning: (near initialization for `cursor_names[61]')
CursorName.c:107: warning: braces around scalar initializer
CursorName.c:107: warning: (near initialization for `cursor_names[62]')
CursorName.c:107: warning: initialization makes integer from pointer without a cast
CursorName.c:107: error: `XC_spraycan' undeclared here (not in a function)
CursorName.c:107: warning: excess elements in scalar initializer
CursorName.c:107: warning: (near initialization for `cursor_names[62]')
CursorName.c:108: warning: braces around scalar initializer
CursorName.c:108: warning: (near initialization for `cursor_names[63]')
CursorName.c:108: warning: initialization makes integer from pointer without a cast
CursorName.c:108: error: `XC_star' undeclared here (not in a function)
CursorName.c:108: warning: excess elements in scalar initializer
CursorName.c:108: warning: (near initialization for `cursor_names[63]')
CursorName.c:109: warning: braces around scalar initializer
CursorName.c:109: warning: (near initialization for `cursor_names[64]')
CursorName.c:109: warning: initialization makes integer from pointer without a cast
CursorName.c:109: error: `XC_target' undeclared here (not in a function)
CursorName.c:109: warning: excess elements in scalar initializer
CursorName.c:109: warning: (near initialization for `cursor_names[64]')
CursorName.c:110: warning: braces around scalar initializer
CursorName.c:110: warning: (near initialization for `cursor_names[65]')
CursorName.c:110: warning: initialization makes integer from pointer without a cast
CursorName.c:110: error: `XC_tcross' undeclared here (not in a function)
CursorName.c:110: warning: excess elements in scalar initializer
CursorName.c:110: warning: (near initialization for `cursor_names[65]')
CursorName.c:111: warning: braces around scalar initializer
CursorName.c:111: warning: (near initialization for `cursor_names[66]')
CursorName.c:111: warning: initialization makes integer from pointer without a cast
CursorName.c:111: error: `XC_top_left_arrow' undeclared here (not in a function)
CursorName.c:111: warning: excess elements in scalar initializer
CursorName.c:111: warning: (near initialization for `cursor_names[66]')
CursorName.c:112: warning: braces around scalar initializer
CursorName.c:112: warning: (near initialization for `cursor_names[67]')
CursorName.c:112: warning: initialization makes integer from pointer without a cast
CursorName.c:112: error: `XC_top_left_corner' undeclared here (not in a function)
CursorName.c:112: warning: excess elements in scalar initializer
CursorName.c:112: warning: (near initialization for `cursor_names[67]')
CursorName.c:113: warning: braces around scalar initializer
CursorName.c:113: warning: (near initialization for `cursor_names[68]')
CursorName.c:113: warning: initialization makes integer from pointer without a cast
CursorName.c:113: error: `XC_top_right_corner' undeclared here (not in a function)
CursorName.c:113: warning: excess elements in scalar initializer
CursorName.c:113: warning: (near initialization for `cursor_names[68]')
CursorName.c:114: warning: braces around scalar initializer
CursorName.c:114: warning: (near initialization for `cursor_names[69]')
CursorName.c:114: warning: initialization makes integer from pointer without a cast
CursorName.c:114: error: `XC_top_side' undeclared here (not in a function)
CursorName.c:114: warning: excess elements in scalar initializer
CursorName.c:114: warning: (near initialization for `cursor_names[69]')
CursorName.c:115: warning: braces around scalar initializer
CursorName.c:115: warning: (near initialization for `cursor_names[70]')
CursorName.c:115: warning: initialization makes integer from pointer without a cast
CursorName.c:115: error: `XC_top_tee' undeclared here (not in a function)
CursorName.c:115: warning: excess elements in scalar initializer
CursorName.c:115: warning: (near initialization for `cursor_names[70]')
CursorName.c:116: warning: braces around scalar initializer
CursorName.c:116: warning: (near initialization for `cursor_names[71]')
CursorName.c:116: warning: initialization makes integer from pointer without a cast
CursorName.c:116: error: `XC_trek' undeclared here (not in a function)
CursorName.c:116: warning: excess elements in scalar initializer
CursorName.c:116: warning: (near initialization for `cursor_names[71]')
CursorName.c:117: warning: braces around scalar initializer
CursorName.c:117: warning: (near initialization for `cursor_names[72]')
CursorName.c:117: warning: initialization makes integer from pointer without a cast
CursorName.c:117: error: `XC_ul_angle' undeclared here (not in a function)
CursorName.c:117: warning: excess elements in scalar initializer
CursorName.c:117: warning: (near initialization for `cursor_names[72]')
CursorName.c:118: warning: braces around scalar initializer
CursorName.c:118: warning: (near initialization for `cursor_names[73]')
CursorName.c:118: warning: initialization makes integer from pointer without a cast
CursorName.c:118: error: `XC_umbrella' undeclared here (not in a function)
CursorName.c:118: warning: excess elements in scalar initializer
CursorName.c:118: warning: (near initialization for `cursor_names[73]')
CursorName.c:119: warning: braces around scalar initializer
CursorName.c:119: warning: (near initialization for `cursor_names[74]')
CursorName.c:119: warning: initialization makes integer from pointer without a cast
CursorName.c:119: error: `XC_ur_angle' undeclared here (not in a function)
CursorName.c:119: warning: excess elements in scalar initializer
CursorName.c:119: warning: (near initialization for `cursor_names[74]')
CursorName.c:120: warning: braces around scalar initializer
CursorName.c:120: warning: (near initialization for `cursor_names[75]')
CursorName.c:120: warning: initialization makes integer from pointer without a cast
CursorName.c:120: error: `XC_watch' undeclared here (not in a function)
CursorName.c:120: warning: excess elements in scalar initializer
CursorName.c:120: warning: (near initialization for `cursor_names[75]')
CursorName.c:121: warning: braces around scalar initializer
CursorName.c:121: warning: (near initialization for `cursor_names[76]')
CursorName.c:121: warning: initialization makes integer from pointer without a cast
CursorName.c:121: error: `XC_xterm' undeclared here (not in a function)
CursorName.c:121: warning: excess elements in scalar initializer
CursorName.c:121: warning: (near initialization for `cursor_names[76]')
CursorName.c:122: warning: data definition has no type or storage class
CursorName.c:124: error: syntax error before "struct"
CursorName.c:128: error: syntax error before "if"
CursorName.c:129: warning: parameter names (without types) in function declaration
CursorName.c:129: error: conflicting types for 'XmuCopyISOLatin1Lowered'
../include/X11/Xmu/CharSet.h:47: error: previous declaration of 'XmuCopyISOLatin1Lowered' was here
CursorName.c:129: error: conflicting types for 'XmuCopyISOLatin1Lowered'
../include/X11/Xmu/CharSet.h:47: error: previous declaration of 'XmuCopyISOLatin1Lowered' was here
CursorName.c:129: warning: data definition has no type or storage class
CursorName.c:131: error: syntax error before "for"
CursorName.c:132: error: syntax error before '&&' token
CursorName.c:132: error: `__s2' undeclared here (not in a function)
CursorName.c:132: error: syntax error before "if"
CursorName.c:132: error: non-static declaration of '__result' follows static declaration
CursorName.c:132: error: previous definition of '__result' was here
CursorName.c:132: warning: data definition has no type or storage class
CursorName.c:132: error: syntax error before '}' token
CursorName.c:132: error: static declaration of '__result' follows non-static declaration
CursorName.c:132: error: previous declaration of '__result' was here
CursorName.c:132: error: static declaration of '__result' follows non-static declaration
CursorName.c:132: error: previous declaration of '__result' was here
CursorName.c:132: error: `__s1' undeclared here (not in a function)
CursorName.c:132: error: dereferencing pointer to incomplete type
CursorName.c:132: error: syntax error before "if"
CursorName.c:132: error: non-static declaration of '__result' follows static declaration
CursorName.c:132: error: previous definition of '__result' was here
CursorName.c:132: warning: data definition has no type or storage class
CursorName.c:132: error: syntax error before '}' token
CursorName.c:125: error: register name not specified for 'i'
ClientWin.c:33:22: X11/Xlib.h: No such file or directory
ClientWin.c:34:23: X11/Xatom.h: No such file or directory
In file included from ClientWin.c:36:
../include/X11/Xmu/WinUtil.h:38:23: X11/Xutil.h: No such file or directory
../include/X11/Xmu/WinUtil.h:39:28: X11/Xfuncproto.h: No such file or directory
In file included from ClientWin.c:36:
../include/X11/Xmu/WinUtil.h:43: error: syntax error before "Window"
../include/X11/Xmu/WinUtil.h:45: error: syntax error before '*' token
../include/X11/Xmu/WinUtil.h:47: warning: data definition has no type or storage class
../include/X11/Xmu/WinUtil.h:49: error: syntax error before "XmuUpdateMapHints"
../include/X11/Xmu/WinUtil.h:51: error: syntax error before '*' token
../include/X11/Xmu/WinUtil.h:54: warning: data definition has no type or storage class
../include/X11/Xmu/WinUtil.h:56: error: syntax error before '*' token
../include/X11/Xmu/WinUtil.h:58: error: syntax error before '*' token
../include/X11/Xmu/WinUtil.h:60: warning: data definition has no type or storage class
ClientWin.c:41: error: syntax error before "static"
ClientWin.c:41: error: syntax error before '*' token
ClientWin.c:41: warning: data definition has no type or storage class
ClientWin.c:46: error: syntax error before "XmuClientWindow"
ClientWin.c:46: error: syntax error before '*' token
ClientWin.c: In function `XmuClientWindow':
ClientWin.c:48: error: `Atom' undeclared (first use in this function)
ClientWin.c:48: error: (Each undeclared identifier is reported only once
ClientWin.c:48: error: for each function it appears in.)
ClientWin.c:48: error: syntax error before "WM_STATE"
ClientWin.c:52: error: `NULL' undeclared (first use in this function)
ClientWin.c:53: error: `Window' undeclared (first use in this function)
ClientWin.c:53: error: syntax error before "inf"
ClientWin.c:55: error: `WM_STATE' undeclared (first use in this function)
ClientWin.c:55: error: `dpy' undeclared (first use in this function)
ClientWin.c:55: error: `True' undeclared (first use in this function)
ClientWin.c:57: error: `win' undeclared (first use in this function)
ClientWin.c:58: error: `False' undeclared (first use in this function)
ClientWin.c:58: error: `AnyPropertyType' undeclared (first use in this function)
ClientWin.c:59: error: `type' undeclared (first use in this function)
ClientWin.c:64: error: `inf' undeclared (first use in this function)
ClientWin.c: At top level:
ClientWin.c:71: error: syntax error before "TryChildren"
ClientWin.c:71: error: syntax error before '*' token
ClientWin.c: In function `TryChildren':
ClientWin.c:73: error: `Window' undeclared (first use in this function)
ClientWin.c:73: error: syntax error before "root"
ClientWin.c:74: error: `children' undeclared (first use in this function)
ClientWin.c:77: error: `Atom' undeclared (first use in this function)
ClientWin.c:77: error: syntax error before "type"
ClientWin.c:81: error: syntax error before "inf"
ClientWin.c:83: error: `dpy' undeclared (first use in this function)
ClientWin.c:83: error: `win' undeclared (first use in this function)
ClientWin.c:83: error: `root' undeclared (first use in this function)
ClientWin.c:83: error: `parent' undeclared (first use in this function)
ClientWin.c:85: error: `inf' undeclared (first use in this function)
ClientWin.c:86: error: `NULL' undeclared (first use in this function)
ClientWin.c:87: error: `WM_STATE' undeclared (first use in this function)
ClientWin.c:87: error: `False' undeclared (first use in this function)
ClientWin.c:88: error: `AnyPropertyType' undeclared (first use in this function)
ClientWin.c:88: error: `type' undeclared (first use in this function)
make[2]: *** [ClientWin.lo] Error 1
make[2]: *** Waiting for unfinished jobs....
make[2]: *** [CursorName.lo] Error 1
make[2]: Leaving directory `/var/tmp/portage/libXmu-1.0.2/work/libXmu-1.0.2/src'
make[1]: *** [all-recursive] Error 1
make[1]: Leaving directory `/var/tmp/portage/libXmu-1.0.2/work/libXmu-1.0.2'
make: *** [all] Error 2
!!! ERROR: x11-libs/libXmu-1.0.2 failed.
!!! Function x-modular_src_make, Line 314, Exitcode 2
!!! emake failed
!!! If you need support, post the topmost build error, NOT this status message.
...done!
>>> emerge (1 of 20) x11-libs/libXmu-1.0.2 to /
>>> md5 files ;-) libXmu-1.0.0.ebuild
>>> md5 files ;-) libXmu-1.0.2.ebuild
>>> md5 files ;-) files/digest-libXmu-1.0.0
>>> md5 files ;-) files/digest-libXmu-1.0.2
>>> md5 src_uri ;-) libXmu-1.0.2.tar.bz2
[31;01mrevdep-rebuild failed to emerge all packages[0m
[31;01myou have the following choices:[0m
- if emerge failed during the build, fix the problems and re-run revdep-rebuild
or
- use -X or --package-names as first argument (trys to rebuild package, not exact
ebuild)
or
- set ACCEPT_KEYWORDS="~<your platform>" and/or /etc/portage/package.unmask
(and remove /root/.revdep-rebuild.5_order to be evaluated again)
or
- modify the above emerge command and run it manually
or
- compile or unmerge unsatisfied packages manually, remove temporary files and
try again (you can edit package/ebuild list first)
[32;01mTo remove temporary files, please run:[0m
rm /root/.revdep-rebuild*.?_*