All pastes #53338 Raw Edit

Untitled

public text v1 · immutable
#53338 ·published 2006-05-03 21:59 UTC
rendered paste body
Wp,-MD,.deps/nsDocumentCharsetInfo.pp nsDocumentCharsetInfo.cpp
rm -f libchardet_s.a
ar cr libchardet_s.a nsObserverBase.o nsXMLEncodingObserver.o nsMetaCharsetObser ver.o nsDetectionAdaptor.o nsDebugDetector.o nsPSMDetectors.o nsCyrillicDetector .o nsDocumentCharsetInfo.o
ranlib libchardet_s.a
/home/siimo/stuff/build/mozilla/config/nsinstall -R -m 644 libchardet_s.a ../../.. /dist/lib
gmake[5]: Leaving directory `/home/siimo/stuff/build/mozilla/intl/chardet/src'
gmake[4]: Leaving directory `/home/siimo/stuff/build/mozilla/intl/chardet'
gmake[4]: Entering directory `/home/siimo/stuff/build/mozilla/intl/build'
nsI18nModule.cpp
c++ -o nsI18nModule.o -c -I../../dist/include/system_wrappers -include ../../con fig/gcc_hidden.h -DMOZILLA_INTERNAL_API -DOSTYPE=\"Linux2.6.16-1\" -DOSARCH=\"Li nux\" -DBUILD_ID=0000000000 -I./../chardet/src -I./../lwbrk/src -I./../unicharut il/src -I./../strres/src -I./../locale/src -I./../locale/src/unix  -I../../dist/ include/xpcom -I../../dist/include/string -I../../dist/include/unicharutil -I../ ../dist/include/chardet -I../../dist/include/uconv -I../../dist/include/lwbrk -I ../../dist/include/intl -I../../dist/include/locale -I../../dist/include/htmlpar ser -I../../dist/include/content -I../../dist/include/widget -I../../dist/includ e/webshell -I../../dist/include/necko -I../../dist/include/i18n -I../../dist/inc lude -I../../dist/include/nspr    -I../../dist/sdk/include    -fPIC   -fno-rtti -fno-exceptions -Wall -Wconversion -Wpointer-arith -Wcast-align -Woverloaded-vir tual -Wsynth -Wno-ctor-dtor-privacy -Wno-non-virtual-dtor -Wno-long-long -fshort -wchar -pthread -pipe  -DNDEBUG -DTRIMMED -O2 -march=k8 -msse -msse2 -msse3 -mfp math=sse -fomit-frame-pointer -pipe   -DMOZILLA_CLIENT -include ../../mozilla-co nfig.h -Wp,-MD,.deps/nsI18nModule.pp nsI18nModule.cpp
rm -f libi18n.so
c++  -fno-rtti -fno-exceptions -Wall -Wconversion -Wpointer-arith -Wcast-align - Woverloaded-virtual -Wsynth -Wno-ctor-dtor-privacy -Wno-non-virtual-dtor -Wno-lo ng-long -fshort-wchar -pthread -pipe  -DNDEBUG -DTRIMMED -O2 -march=k8 -msse -ms se2 -msse3 -mfpmath=sse -fomit-frame-pointer -pipe -fPIC -shared -Wl,-h -Wl,libi 18n.so -o libi18n.so  nsI18nModule.o       -Wl,--whole-archive ../../dist/lib/li bchardet_s.a ../../dist/lib/liblwbrk_s.a ../../dist/lib/libucharucomp_s.a ../../ dist/lib/libstrres_s.a ../../dist/lib/libnslocale_s.a ../../dist/lib/libplatloca le_s.a  -Wl,--no-whole-archive ../../dist/lib/libunicharutil_s.a -L../../dist/bi n -lxpcom -lxpcom_core  -L../../dist/bin -L../../dist/lib -lplds4 -lplc4 -lnspr4  -lpthread -ldl  -Wl,--version-script -Wl,../../build/unix/gnu-ld-scripts/compon ents-version-script -Wl,-Bsymbolic -ldl -lm
chmod +x libi18n.so
strip libi18n.so
/home/siimo/stuff/build/mozilla/config/nsinstall -R -m 755 libi18n.so ../../dist/g re/components
../../dist/bin/elf-dynstr-gc ../../dist/gre/components/libi18n.so
Couldn't GC any strings, exiting.
/home/siimo/stuff/build/mozilla/config/nsinstall -R -m 755 libi18n.so ../../dist/b in/components
../../dist/bin/elf-dynstr-gc ../../dist/bin/components/libi18n.so
Couldn't GC any strings, exiting.
gmake[4]: Leaving directory `/home/siimo/stuff/build/mozilla/intl/build'
gmake[3]: Leaving directory `/home/siimo/stuff/build/mozilla/intl'
gmake[3]: Entering directory `/home/siimo/stuff/build/mozilla/widget/src/gtkxtbin'
gtk2xtbin.c
gcc -o gtk2xtbin.o -c -I../../../dist/include/system_wrappers -include ../../../ config/gcc_hidden.h -DMOZILLA_INTERNAL_API -DOSTYPE=\"Linux2.6.16-1\" -DOSARCH=\ "Linux\" -DBUILD_ID=0000000000 -D_IMPL_GTKXTBIN_API -DUSE_XIM  -I../../../dist/i nclude/xpcom -I../../../dist/include/gtkxtbin -I../../../dist/include -I../../.. /dist/include/nspr    -I../../../dist/sdk/include -I.     -fPIC  -Wall -W -Wno-u nused -Wpointer-arith -Wcast-align -Wno-long-long -pthread -pipe  -DNDEBUG -DTRI MMED -O2 -march=k8 -msse -msse2 -msse3 -mfpmath=sse -fomit-frame-pointer -pipe - I/usr/include/gtk-2.0 -I/usr/lib/gtk-2.0/include -I/usr/include/atk-1.0 -I/usr/i nclude/cairo -I/usr/include/pango-1.0 -I/usr/include/glib-2.0 -I/usr/lib/glib-2. 0/include     -include ../../../mozilla-config.h -DMOZILLA_CLIENT -Wp,-MD,.deps/ gtk2xtbin.pp gtk2xtbin.c
In file included from gtk2xtbin.h:44,
                 from gtk2xtbin.c:46:
../../../dist/include/system_wrappers/X11/Intrinsic.h:3:32: error: X11/Intrinsic .h: No such file or directory
In file included from gtk2xtbin.c:46:
gtk2xtbin.h:78: error: expected specifier-qualifier-list before ‘Widget’
gtk2xtbin.h:104: error: expected declaration specifiers or ‘...’ before ‘String’
gtk2xtbin.h:113: error: expected specifier-qualifier-list before ‘XtTranslations ’
gtk2xtbin.h:120: error: expected specifier-qualifier-list before ‘Widget’
In file included from gtk2xtbin.c:61:
../../../dist/include/system_wrappers/X11/Shell.h:3:28: error: X11/Shell.h: No s uch file or directory
In file included from gtk2xtbin.c:63:
../../../dist/include/system_wrappers/X11/StringDefs.h:3:33: error: X11/StringDe fs.h: No such file or directory
gtk2xtbin.c:89: error: expected ‘)’ before ‘xtplug’
gtk2xtbin.c:91: error: expected ‘)’ before ‘w’
gtk2xtbin.c:94: error: expected ‘)’ before ‘w’
gtk2xtbin.c:97: error: expected ‘)’ before ‘w’
gtk2xtbin.c:100: error: expected ‘)’ before ‘w’
gtk2xtbin.c:101: error: expected ‘)’ before ‘treeroot’
gtk2xtbin.c:102: error: expected ‘)’ before ‘w’
gtk2xtbin.c:120: error: expected ‘=’, ‘,’, ‘;’, ‘asm’ or ‘__attribute__’ before ‘*’ token
gtk2xtbin.c: In function ‘xt_event_dispatch’:
gtk2xtbin.c:163: error: ‘XtAppContext’ undeclared (first use in this function)
gtk2xtbin.c:163: error: (Each undeclared identifier is reported only once
gtk2xtbin.c:163: error: for each function it appears in.)
gtk2xtbin.c:163: error: expected ‘;’ before ‘ac’
gtk2xtbin.c:166: error: ‘ac’ undeclared (first use in this function)
gtk2xtbin.c:166: warning: implicit declaration of function ‘XtDisplayToApplicati onContext’
gtk2xtbin.c:176: warning: implicit declaration of function ‘XtAppProcessEvent’
gtk2xtbin.c:176: error: ‘XtIMXEvent’ undeclared (first use in this function)
gtk2xtbin.c: At top level:
gtk2xtbin.c:188: warning: initialization from incompatible pointer type
gtk2xtbin.c: In function ‘xt_event_polling_timer_callback’:
gtk2xtbin.c:197: error: ‘XtAppContext’ undeclared (first use in this function)
gtk2xtbin.c:197: error: expected ‘;’ before ‘ac’
gtk2xtbin.c:201: error: ‘ac’ undeclared (first use in this function)
gtk2xtbin.c:209: warning: implicit declaration of function ‘XtAppPending’
gtk2xtbin.c:210: error: ‘XtIMAll’ undeclared (first use in this function)
gtk2xtbin.c: At top level:
gtk2xtbin.c:216: warning: redeclaration of ‘gtk_xtbin_get_type’ with different v isibility (old visibility preserved)
gtk2xtbin.h:103: warning: previous declaration of ‘gtk_xtbin_get_type’ was here
gtk2xtbin.c: In function ‘gtk_xtbin_realize’:
gtk2xtbin.c:298: warning: implicit declaration of function ‘XtWindow’
gtk2xtbin.c:298: error: ‘XtClient’ has no member named ‘child_widget’
gtk2xtbin.c: At top level:
gtk2xtbin.c:309: error: expected declaration specifiers or ‘...’ before ‘String’
gtk2xtbin.c:310: warning: redeclaration of ‘gtk_xtbin_new’ with different visibi lity (old visibility preserved)
gtk2xtbin.h:104: warning: previous declaration of ‘gtk_xtbin_new’ was here
gtk2xtbin.c: In function ‘gtk_xtbin_new’:
gtk2xtbin.c:320: error: ‘f’ undeclared (first use in this function)
gtk2xtbin.c:321: error: ‘fallback’ undeclared (first use in this function)
gtk2xtbin.c: At top level:
gtk2xtbin.c:395: warning: redeclaration of ‘gtk_xtbin_set_position’ with differe nt visibility (old visibility preserved)
gtk2xtbin.h:107: warning: previous declaration of ‘gtk_xtbin_set_position’ was h ere
gtk2xtbin.c:407: warning: redeclaration of ‘gtk_xtbin_resize’ with different vis ibility (old visibility preserved)
gtk2xtbin.h:110: warning: previous declaration of ‘gtk_xtbin_resize’ was here
gtk2xtbin.c: In function ‘gtk_xtbin_resize’:
gtk2xtbin.c:408: error: ‘Arg’ undeclared (first use in this function)
gtk2xtbin.c:408: error: expected ‘;’ before ‘args’
gtk2xtbin.c:416: warning: implicit declaration of function ‘XtSetArg’
gtk2xtbin.c:416: error: ‘args’ undeclared (first use in this function)
gtk2xtbin.c:416: error: ‘XtNheight’ undeclared (first use in this function)
gtk2xtbin.c:417: error: ‘XtNwidth’ undeclared (first use in this function)
gtk2xtbin.c:418: warning: implicit declaration of function ‘XtSetValues’
gtk2xtbin.c:418: error: ‘XtClient’ has no member named ‘top_widget’
gtk2xtbin.c: In function ‘xt_client_init’:
gtk2xtbin.c:504: error: ‘XtAppContext’ undeclared (first use in this function)
gtk2xtbin.c:504: error: expected ‘;’ before ‘app_context’
gtk2xtbin.c:511: error: ‘XtClient’ has no member named ‘top_widget’
gtk2xtbin.c:512: error: ‘XtClient’ has no member named ‘child_widget’
gtk2xtbin.c:514: error: ‘XtClient’ has no member named ‘xtvisual’
gtk2xtbin.c:515: error: ‘XtClient’ has no member named ‘xtcolormap’
gtk2xtbin.c:516: error: ‘XtClient’ has no member named ‘xtdepth’
gtk2xtbin.c:522: warning: implicit declaration of function ‘XtToolkitInitialize’
gtk2xtbin.c:523: error: ‘app_context’ undeclared (first use in this function)
gtk2xtbin.c:523: warning: implicit declaration of function ‘XtCreateApplicationC ontext’
gtk2xtbin.c:524: error: ‘fallback’ undeclared (first use in this function)
gtk2xtbin.c:525: warning: implicit declaration of function ‘XtAppSetFallbackReso urces’
gtk2xtbin.c:527: warning: implicit declaration of function ‘XtOpenDisplay’
gtk2xtbin.c:528: warning: assignment makes pointer from integer without a cast
gtk2xtbin.c:533: error: ‘XtClient’ has no member named ‘xtvisual’
gtk2xtbin.c:534: error: ‘XtClient’ has no member named ‘xtcolormap’
gtk2xtbin.c:535: error: ‘XtClient’ has no member named ‘xtdepth’
gtk2xtbin.c: In function ‘xt_client_create’:
gtk2xtbin.c:547: error: ‘Arg’ undeclared (first use in this function)
gtk2xtbin.c:547: error: expected ‘;’ before ‘args’
gtk2xtbin.c:548: error: ‘Widget’ undeclared (first use in this function)
gtk2xtbin.c:548: error: expected ‘;’ before ‘child_widget’
gtk2xtbin.c:549: error: expected ‘;’ before ‘top_widget’
gtk2xtbin.c:554: error: ‘top_widget’ undeclared (first use in this function)
gtk2xtbin.c:554: warning: implicit declaration of function ‘XtAppCreateShell’
gtk2xtbin.c:555: error: ‘applicationShellWidgetClass’ undeclared (first use in t his function)
gtk2xtbin.c:558: error: ‘XtClient’ has no member named ‘top_widget’
gtk2xtbin.c:562: error: ‘args’ undeclared (first use in this function)
gtk2xtbin.c:562: error: ‘XtNheight’ undeclared (first use in this function)
gtk2xtbin.c:563: error: ‘XtNwidth’ undeclared (first use in this function)
gtk2xtbin.c:566: error: ‘child_widget’ undeclared (first use in this function)
gtk2xtbin.c:566: warning: implicit declaration of function ‘XtVaCreateWidget’
gtk2xtbin.c:567: error: ‘compositeWidgetClass’ undeclared (first use in this fun ction)
gtk2xtbin.c:573: error: ‘XtNvisual’ undeclared (first use in this function)
gtk2xtbin.c:573: error: ‘XtClient’ has no member named ‘xtvisual’
gtk2xtbin.c:574: error: ‘XtNdepth’ undeclared (first use in this function)
gtk2xtbin.c:574: error: ‘XtClient’ has no member named ‘xtdepth’
gtk2xtbin.c:575: error: ‘XtNcolormap’ undeclared (first use in this function)
gtk2xtbin.c:575: error: ‘XtClient’ has no member named ‘xtcolormap’
gtk2xtbin.c:576: error: ‘XtNborderWidth’ undeclared (first use in this function)
gtk2xtbin.c:580: error: ‘XtClient’ has no member named ‘oldwindow’
gtk2xtbin.c:585: warning: implicit declaration of function ‘XtRegisterDrawable’
gtk2xtbin.c:592: warning: implicit declaration of function ‘XtRealizeWidget’
gtk2xtbin.c:598: warning: implicit declaration of function ‘xt_client_set_info’
gtk2xtbin.c:600: warning: implicit declaration of function ‘XtManageChild’
gtk2xtbin.c:601: error: ‘XtClient’ has no member named ‘child_widget’
gtk2xtbin.c:604: warning: implicit declaration of function ‘XtAddEventHandler’
gtk2xtbin.c:607: error: ‘XtEventHandler’ undeclared (first use in this function)
gtk2xtbin.c:607: error: expected ‘)’ before ‘xt_client_event_handler’
gtk2xtbin.c:611: error: expected ‘)’ before ‘xt_client_focus_listener’
gtk2xtbin.c: In function ‘xt_client_unrealize’:
gtk2xtbin.c:620: warning: implicit declaration of function ‘XtUnregisterDrawable ’
gtk2xtbin.c:621: error: ‘XtClient’ has no member named ‘top_widget’
gtk2xtbin.c:631: error: ‘XtClient’ has no member named ‘top_widget’
gtk2xtbin.c:631: error: ‘XtClient’ has no member named ‘oldwindow’
gtk2xtbin.c:632: warning: implicit declaration of function ‘XtUnrealizeWidget’
gtk2xtbin.c:632: error: ‘XtClient’ has no member named ‘top_widget’
gtk2xtbin.c: In function ‘xt_client_destroy’:
gtk2xtbin.c:638: error: ‘XtClient’ has no member named ‘top_widget’
gtk2xtbin.c:639: warning: implicit declaration of function ‘XtRemoveEventHandler ’
gtk2xtbin.c:639: error: ‘XtClient’ has no member named ‘child_widget’
gtk2xtbin.c:640: error: ‘XtEventHandler’ undeclared (first use in this function)
gtk2xtbin.c:640: error: expected ‘)’ before ‘xt_client_event_handler’
gtk2xtbin.c:641: warning: implicit declaration of function ‘XtDestroyWidget’
gtk2xtbin.c:641: error: ‘XtClient’ has no member named ‘top_widget’
gtk2xtbin.c:642: error: ‘XtClient’ has no member named ‘top_widget’
gtk2xtbin.c: At top level:
gtk2xtbin.c:647: error: expected ‘)’ before ‘xtplug’
gtk2xtbin.c:663: error: expected ‘)’ before ‘w’
gtk2xtbin.c:724: error: expected ‘)’ before ‘w’
gtk2xtbin.c: In function ‘send_xembed_message’:
gtk2xtbin.c:771: error: ‘XtClient’ has no member named ‘top_widget’
gtk2xtbin.c:775: warning: implicit declaration of function ‘memset’
gtk2xtbin.c:775: warning: incompatible implicit declaration of built-in function  ‘memset’
gtk2xtbin.c: At top level:
gtk2xtbin.c:824: error: expected ‘)’ before ‘w’
gtk2xtbin.c:869: error: expected ‘)’ before ‘w’
gtk2xtbin.c:892: error: expected ‘)’ before ‘w’
gtk2xtbin.c:904: error: expected ‘)’ before ‘treeroot’
gmake[3]: *** [gtk2xtbin.o] Error 1