All pastes #52778 Raw Edit

Unnamed

public text v1 · immutable
#52778 ·published 2006-05-02 03:04 UTC
rendered paste body
Could not write method GnomeProgram.preinit: No ArgType for 'char**'
Could not write function config_get_string_with_default_: No ArgType for 'gboolean*'
Could not write function config_get_translated_string_with_default_: No ArgType for 'gboolean*'
Could not write function config_get_int_with_default_: No ArgType for 'gboolean*'
Could not write function config_get_float_with_default_: No ArgType for 'gboolean*'
Could not write function config_get_bool_with_default_: No ArgType for 'gboolean*'
Could not write function config_get_vector_with_default_: No ArgType for 'gint*'
Could not write function config_set_vector_: No ArgType for 'const-char*-const[]'
Could not write function config_init_iterator_: No ArgType for 'void*'
Could not write function config_init_iterator_sections_: No ArgType for 'void*'
Could not write function config_iterator_next: No ArgType for 'void*'
Could not write function config_make_vector: No ArgType for 'int*'
Could not write function config_assemble_vector: No ArgType for 'const-char*-const-argv'
Could not write function config_set_set_handler: No ArgType for 'void-(*'
Could not write function config_set_sync_handler: No ArgType for 'void-(*'
Could not write function execute_async: No ArgType for 'char*-const[]'
Could not write function execute_async_fds: No ArgType for 'char*-const[]'
Could not write function execute_async_with_env: No ArgType for 'char*-const[]'
Could not write function execute_async_with_env_fds: No ArgType for 'char*-const[]'
Could not write function prepend_terminal_to_vector: No ArgType for 'int*'
Could not write function help_error_quark: No ArgType for 'GQuark'
Could not write function help_display_uri_with_env: No ArgType for 'char**'
Could not write function help_display_with_doc_id_and_env: No ArgType for 'char**'
Could not write function help_display_desktop_with_env: No ArgType for 'char**'
Could not write function i18n_get_language_list: No ArgType for 'const-GList*'
Could not write function program_install_property: No ArgType for 'GnomeProgramClass*'
Could not write function program_initv: No ArgType for 'char**'
Could not write function program_init_paramv: No ArgType for 'char**'
Could not write function score_get_notable: No ArgType for 'gchar***'
Could not write function triggers_do: varargs functions not supported
Could not write function triggers_vdo: No ArgType for 'const-char*[]'
Could not write function url_error_quark: No ArgType for 'GQuark'
Could not write function url_show_with_env: No ArgType for 'char**'
***INFO*** The coverage of global functions is 61.45% (51/83)
***INFO*** The coverage of methods is 87.50% (7/8)
***INFO*** There are no declared virtual proxies.
***INFO*** There are no declared virtual accessors.
***INFO*** There are no declared interface proxies.
Could not write method GnomeApp.create_menus: No ArgType for 'GnomeUIInfo*'
Could not write method GnomeApp.create_menus_interp: No ArgType for 'GnomeUIInfo*'
Could not write method GnomeApp.create_menus_with_data: No ArgType for 'GnomeUIInfo*'
Could not write method GnomeApp.create_menus_custom: No ArgType for 'GnomeUIInfo*'
Could not write method GnomeApp.create_toolbar: No ArgType for 'GnomeUIInfo*'
Could not write method GnomeApp.create_toolbar_interp: No ArgType for 'GnomeUIInfo*'
Could not write method GnomeApp.create_toolbar_with_data: No ArgType for 'GnomeUIInfo*'
Could not write method GnomeApp.create_toolbar_custom: No ArgType for 'GnomeUIInfo*'
Could not write method GnomeApp.insert_menus_custom: No ArgType for 'GnomeUIInfo*'
Could not write method GnomeApp.insert_menus: No ArgType for 'GnomeUIInfo*'
Could not write method GnomeApp.insert_menus_with_data: No ArgType for 'GnomeUIInfo*'
Could not write method GnomeApp.insert_menus_interp: No ArgType for 'GnomeUIInfo*'
Could not write method GnomeApp.install_menu_hints: No ArgType for 'GnomeUIInfo*'
Could not write method GnomeApp.question: No ArgType for 'GnomeReplyCallback'
Could not write method GnomeApp.question_modal: No ArgType for 'GnomeReplyCallback'
Could not write method GnomeApp.ok_cancel: No ArgType for 'GnomeReplyCallback'
Could not write method GnomeApp.ok_cancel_modal: No ArgType for 'GnomeReplyCallback'
Could not write method GnomeApp.request_string: No ArgType for 'GnomeStringCallback'
Could not write method GnomeApp.request_password: No ArgType for 'GnomeStringCallback'
Could not write method GnomeApp.progress_timeout: No ArgType for 'GnomeAppProgressFunc'
Could not write method GnomeApp.progress_manual: No ArgType for 'GnomeAppProgressCancelFunc'
Could not write method GnomeClient.set_process_id: No ArgType for 'pid_t'
Could not write method GnomeClient.request_interaction: No ArgType for 'GnomeInteractFunction'
Could not write method GnomeClient.request_interaction_interp: No ArgType for 'GtkCallbackMarshal'
Could not write method GnomeColorPicker.get_d: No ArgType for 'gdouble*'
Could not write method GnomeColorPicker.get_i8: No ArgType for 'guint8*'
Could not write method GnomeColorPicker.get_i16: No ArgType for 'gushort*'
Warning: generating old-style constructor for gnome_date_edit_new
Warning: generating old-style constructor for gnome_dialog_new
Could not write constructor for GnomeDialog: varargs functions not supported
Could not write method GnomeDialog.button_connect: No ArgType for 'GtkSignalFunc'
Could not write method GnomeDialog.button_connect_object: No ArgType for 'GtkSignalFunc'
Could not write method GnomeDialog.set_accelerator: No ArgType for 'const-guchar'
Could not write method GnomeDialog.append_buttonsv: No ArgType for 'const-gchar**'
Could not write method GnomeDialog.append_buttons_with_pixmaps: No ArgType for 'const-gchar**'
Could not write method GnomeDialog.constructv: No ArgType for 'const-gchar**'
Could not write method GnomeDruid.construct_with_window: No ArgType for 'GtkWidget**'
Warning: generating old-style constructor for gnome_druid_page_edge_new
Warning: generating old-style constructor for gnome_icon_list_new
Could not write method GnomeIconList.set_icon_data_full: No ArgType for 'gpointer'
Could not write method GnomeIconList.find_icon_from_data: No ArgType for 'gpointer'
Could not write method GnomeIconList.get_icon_pixbuf_item: No ArgType for 'GnomeCanvasPixbuf*'
Warning: generating old-style constructor for gnome_mdi_new
Could not write method GnomeMDI.restore_state: No ArgType for 'GnomeMDIChildCreator'
Could not write method GnomeMDI.set_menubar_template: No ArgType for 'GnomeUIInfo*'
Could not write method GnomeMDI.set_toolbar_template: No ArgType for 'GnomeUIInfo*'
Could not write method GnomeMDIChild.set_menu_template: No ArgType for 'GnomeUIInfo*'
Warning: generating old-style constructor for gnome_mdi_generic_child_new
Could not write method GnomeMDIGenericChild.set_view_creator: No ArgType for 'GnomeMDIChildViewCreator'
Could not write method GnomeMDIGenericChild.set_view_creator_full: No ArgType for 'GnomeMDIChildViewCreator'
Could not write method GnomeMDIGenericChild.set_menu_creator: No ArgType for 'GnomeMDIChildMenuCreator'
Could not write method GnomeMDIGenericChild.set_menu_creator_full: No ArgType for 'GnomeMDIChildMenuCreator'
Could not write method GnomeMDIGenericChild.set_config_func: No ArgType for 'GnomeMDIChildConfigFunc'
Could not write method GnomeMDIGenericChild.set_config_func_full: No ArgType for 'GnomeMDIChildConfigFunc'
Could not write method GnomeMDIGenericChild.set_label_func: No ArgType for 'GnomeMDIChildLabelFunc'
Could not write method GnomeMDIGenericChild.set_label_func_full: No ArgType for 'GnomeMDIChildLabelFunc'
Warning: generating old-style constructor for gnome_message_box_newv
Could not write constructor for GnomeMessageBox: No ArgType for 'const-gchar**'
Warning: generating old-style constructor for gnome_pixmap_new_from_gnome_pixmap
Could not write method GnomePixmap.load_xpm_d: No ArgType for 'const-char**'
Could not write method GnomePixmap.load_xpm_d_at_size: No ArgType for 'const-char**'
Warning: generating old-style constructor for gnome_scores_new
Could not write constructor for GnomeScores: No ArgType for 'gchar**'
Warning: generating old-style constructor for gnome_thumbnail_factory_new
Could not write function app_fill_menu: No ArgType for 'GnomeUIInfo*'
Could not write function app_fill_menu_with_data: No ArgType for 'GnomeUIInfo*'
Could not write function app_fill_menu_custom: No ArgType for 'GnomeUIInfo*'
Could not write function app_ui_configure_configurable: No ArgType for 'GnomeUIInfo*'
Could not write function app_fill_toolbar: No ArgType for 'GnomeUIInfo*'
Could not write function app_fill_toolbar_with_data: No ArgType for 'GnomeUIInfo*'
Could not write function app_fill_toolbar_custom: No ArgType for 'GnomeUIInfo*'
Could not write function app_find_menu_pos: No ArgType for 'gint*'
Could not write function app_install_appbar_menu_hints: No ArgType for 'GnomeUIInfo*'
Could not write function app_install_statusbar_menu_hints: No ArgType for 'GnomeUIInfo*'
Could not write function app_set_progress: No ArgType for 'GnomeAppProgressKey'
Could not write function app_progress_done: No ArgType for 'GnomeAppProgressKey'
Could not write function question_dialog: No ArgType for 'GnomeReplyCallback'
Could not write function question_dialog_parented: No ArgType for 'GnomeReplyCallback'
Could not write function question_dialog_modal: No ArgType for 'GnomeReplyCallback'
Could not write function question_dialog_modal_parented: No ArgType for 'GnomeReplyCallback'
Could not write function ok_cancel_dialog: No ArgType for 'GnomeReplyCallback'
Could not write function ok_cancel_dialog_parented: No ArgType for 'GnomeReplyCallback'
Could not write function ok_cancel_dialog_modal: No ArgType for 'GnomeReplyCallback'
Could not write function ok_cancel_dialog_modal_parented: No ArgType for 'GnomeReplyCallback'
Could not write function request_string_dialog: No ArgType for 'GnomeStringCallback'
Could not write function request_string_dialog_parented: No ArgType for 'GnomeStringCallback'
Could not write function request_password_dialog: No ArgType for 'GnomeStringCallback'
Could not write function request_password_dialog_parented: No ArgType for 'GnomeStringCallback'
Could not write function request_dialog: No ArgType for 'const-guint16'
Could not write function help_display_with_doc_id_on_screen: No ArgType for 'GnomeProgram*'
Could not write function help_display_desktop_on_screen: No ArgType for 'GnomeProgram*'
Could not write function mdi_get_menubar_info: No ArgType for 'GnomeUIInfo*'
Could not write function mdi_get_toolbar_info: No ArgType for 'GnomeUIInfo*'
Could not write function mdi_get_child_menu_info: No ArgType for 'GnomeUIInfo*'
Could not write function popup_menu_attach: No ArgType for 'gpointer'
Could not write function popup_menu_do_popup: No ArgType for 'GtkMenuPositionFunc'
Could not write function popup_menu_do_popup_modal: No ArgType for 'GtkMenuPositionFunc'
Could not write function popup_menu_append: No ArgType for 'GnomeUIInfo*'
Could not write function gtk_widget_add_popup_items: No ArgType for 'GnomeUIInfo*'
Could not write function theme_file_parse_error_quark: No ArgType for 'GQuark'
Could not write function theme_file_new_from_string: No ArgType for 'GnomeThemeFile*'
Could not write function init_with_popt_table: No ArgType for 'char**'
Could not write function gdk_pixbuf_new_from_uri_async: No ArgType for 'GnomeGdkPixbufLoadCallback'
Could not write function gdk_pixbuf_new_from_uri_cancel: No ArgType for 'GnomeGdkPixbufAsyncHandle*'
Warning: Constructor for GnomeAbout needs to be updated to new API
         See http://live.gnome.org/PyGTK_2fWhatsNew28#update-constructors
Warning: Constructor for GnomeAppBar needs to be updated to new API
         See http://live.gnome.org/PyGTK_2fWhatsNew28#update-constructors
Warning: Constructor for GnomeDateEdit needs to be updated to new API
         See http://live.gnome.org/PyGTK_2fWhatsNew28#update-constructors
Warning: Constructor for GnomeDialog needs to be updated to new API
         See http://live.gnome.org/PyGTK_2fWhatsNew28#update-constructors
Warning: Constructor for GnomeDruidPageEdge needs to be updated to new API
         See http://live.gnome.org/PyGTK_2fWhatsNew28#update-constructors
Warning: Constructor for GnomeIconList needs to be updated to new API
         See http://live.gnome.org/PyGTK_2fWhatsNew28#update-constructors
Warning: Constructor for GnomeIconTextItem needs to be updated to new API
         See http://live.gnome.org/PyGTK_2fWhatsNew28#update-constructors
Warning: Constructor for GnomeMDI needs to be updated to new API
         See http://live.gnome.org/PyGTK_2fWhatsNew28#update-constructors
Warning: Constructor for GnomeMDIChild needs to be updated to new API
         See http://live.gnome.org/PyGTK_2fWhatsNew28#update-constructors
Warning: Constructor for GnomeMDIGenericChild needs to be updated to new API
         See http://live.gnome.org/PyGTK_2fWhatsNew28#update-constructors
Warning: Constructor for GnomeMessageBox needs to be updated to new API
         See http://live.gnome.org/PyGTK_2fWhatsNew28#update-constructors
Warning: Constructor for GnomePixmap needs to be updated to new API
         See http://live.gnome.org/PyGTK_2fWhatsNew28#update-constructors
Warning: Constructor for GnomeScores needs to be updated to new API
         See http://live.gnome.org/PyGTK_2fWhatsNew28#update-constructors
Warning: Constructor for GnomeThumbnailFactory needs to be updated to new API
         See http://live.gnome.org/PyGTK_2fWhatsNew28#update-constructors
***INFO*** The coverage of global functions is 45.95% (34/74)
***INFO*** The coverage of methods is 83.96% (267/318)
***INFO*** There are no declared virtual proxies.
***INFO*** There are no declared virtual accessors.
***INFO*** There are no declared interface proxies.
gnome.override: In function `_wrap_gnome_program_init':
gnome.override:288: error: storage size of 'sa' isn't known
gnome.override:396: warning: implicit declaration of function `sigaction'
gnome.override:288: warning: unused variable `sa'
make[2]: *** [_gnome_la-gnome.lo] Error 1
make[2]: *** Waiting for unfinished jobs....
make[1]: *** [all-recursive] Error 1
make: *** [all] Error 2

!!! ERROR: dev-python/gnome-python-2.12.3 failed.
Call stack:
  ebuild.sh, line 1521:   Called dyn_compile
  ebuild.sh, line 924:   Called src_compile
  ebuild.sh, line 1233:   Called gnome2_src_compile
  gnome2.eclass, line 58:   Called die

!!! compile failure
!!! If you need support, post the topmost build error, and the call stack if relevant.