[root@localhost gspcav1-20070508]# cat /var/lib/dkms/gspca/1.00.18-1mdv2007.1/build/make.log
DKMS make.log for gspca-1.00.18-1mdv2007.1 for kernel 2.6.17.14-mm-desktop-5mdv (i586)
jeu mai 31 23:09:24 CEST 2007
make: entrant dans le répertoire « /usr/src/kernel-multimedia-2.6.17.14-5mdv »
WARNING: Symbol version dump /usr/src/kernel-multimedia-2.6.17.14-5mdv/Module.symvers
is missing; modules will have no dependencies and modversions.
CC [M] /var/lib/dkms/gspca/1.00.18-1mdv2007.1/build/gspca_core.o
/var/lib/dkms/gspca/1.00.18-1mdv2007.1/build/gspca_core.c: In function spca5xx_open:
/var/lib/dkms/gspca/1.00.18-1mdv2007.1/build/gspca_core.c:1922: warning: implicit declaration of function video_devdata
/var/lib/dkms/gspca/1.00.18-1mdv2007.1/build/gspca_core.c:1922: warning: initialization makes pointer from integer without a cast
/var/lib/dkms/gspca/1.00.18-1mdv2007.1/build/gspca_core.c:1923: warning: implicit declaration of function video_get_drvdata
/var/lib/dkms/gspca/1.00.18-1mdv2007.1/build/gspca_core.c:1923: warning: initialization makes pointer from integer without a cast
/var/lib/dkms/gspca/1.00.18-1mdv2007.1/build/gspca_core.c: In function spca5xx_close:
/var/lib/dkms/gspca/1.00.18-1mdv2007.1/build/gspca_core.c:1986: warning: initialization makes pointer from integer without a cast
/var/lib/dkms/gspca/1.00.18-1mdv2007.1/build/gspca_core.c: In function spca5xx_do_ioctl:
/var/lib/dkms/gspca/1.00.18-1mdv2007.1/build/gspca_core.c:2027: warning: initialization makes pointer from integer without a cast
/var/lib/dkms/gspca/1.00.18-1mdv2007.1/build/gspca_core.c: In function spca5xx_ioctl:
/var/lib/dkms/gspca/1.00.18-1mdv2007.1/build/gspca_core.c:2418: warning: implicit declaration of function video_usercopy
/var/lib/dkms/gspca/1.00.18-1mdv2007.1/build/gspca_core.c: In function spca5xx_read:
/var/lib/dkms/gspca/1.00.18-1mdv2007.1/build/gspca_core.c:2430: warning: initialization makes pointer from integer without a cast
/var/lib/dkms/gspca/1.00.18-1mdv2007.1/build/gspca_core.c: In function spca5xx_mmap:
/var/lib/dkms/gspca/1.00.18-1mdv2007.1/build/gspca_core.c:2522: warning: initialization makes pointer from integer without a cast
/var/lib/dkms/gspca/1.00.18-1mdv2007.1/build/gspca_core.c: At top level:
/var/lib/dkms/gspca/1.00.18-1mdv2007.1/build/gspca_core.c:2563: error: variable spca50x_template has initializer but incomplete type
/var/lib/dkms/gspca/1.00.18-1mdv2007.1/build/gspca_core.c:2564: error: unknown field owner specified in initializer
/var/lib/dkms/gspca/1.00.18-1mdv2007.1/build/gspca_core.c:2564: warning: excess elements in struct initializer
/var/lib/dkms/gspca/1.00.18-1mdv2007.1/build/gspca_core.c:2564: warning: (near initialization for spca50x_template)
/var/lib/dkms/gspca/1.00.18-1mdv2007.1/build/gspca_core.c:2565: error: unknown field name specified in initializer
/var/lib/dkms/gspca/1.00.18-1mdv2007.1/build/gspca_core.c:2565: warning: excess elements in struct initializer
/var/lib/dkms/gspca/1.00.18-1mdv2007.1/build/gspca_core.c:2565: warning: (near initialization for spca50x_template)
/var/lib/dkms/gspca/1.00.18-1mdv2007.1/build/gspca_core.c:2566: error: unknown field type specified in initializer
/var/lib/dkms/gspca/1.00.18-1mdv2007.1/build/gspca_core.c:2566: warning: excess elements in struct initializer
/var/lib/dkms/gspca/1.00.18-1mdv2007.1/build/gspca_core.c:2566: warning: (near initialization for spca50x_template)
/var/lib/dkms/gspca/1.00.18-1mdv2007.1/build/gspca_core.c:2567: error: unknown field hardware specified in initializer
/var/lib/dkms/gspca/1.00.18-1mdv2007.1/build/gspca_core.c:2567: warning: excess elements in struct initializer
/var/lib/dkms/gspca/1.00.18-1mdv2007.1/build/gspca_core.c:2567: warning: (near initialization for spca50x_template)
/var/lib/dkms/gspca/1.00.18-1mdv2007.1/build/gspca_core.c:2568: error: unknown field fops specified in initializer
/var/lib/dkms/gspca/1.00.18-1mdv2007.1/build/gspca_core.c:2568: warning: excess elements in struct initializer
/var/lib/dkms/gspca/1.00.18-1mdv2007.1/build/gspca_core.c:2568: warning: (near initialization for spca50x_template)
/var/lib/dkms/gspca/1.00.18-1mdv2007.1/build/gspca_core.c:2569: error: unknown field release specified in initializer
/var/lib/dkms/gspca/1.00.18-1mdv2007.1/build/gspca_core.c:2569: error: video_device_release undeclared here (not in a function)
/var/lib/dkms/gspca/1.00.18-1mdv2007.1/build/gspca_core.c:2569: warning: excess elements in struct initializer
/var/lib/dkms/gspca/1.00.18-1mdv2007.1/build/gspca_core.c:2569: warning: (near initialization for spca50x_template)
/var/lib/dkms/gspca/1.00.18-1mdv2007.1/build/gspca_core.c:2570: error: unknown field minor specified in initializer
/var/lib/dkms/gspca/1.00.18-1mdv2007.1/build/gspca_core.c:2570: warning: excess elements in struct initializer
/var/lib/dkms/gspca/1.00.18-1mdv2007.1/build/gspca_core.c:2570: warning: (near initialization for spca50x_template)
/var/lib/dkms/gspca/1.00.18-1mdv2007.1/build/gspca_core.c: In function cd_to_spca50x:
/var/lib/dkms/gspca/1.00.18-1mdv2007.1/build/gspca_core.c:2616: warning: implicit declaration of function to_video_device
/var/lib/dkms/gspca/1.00.18-1mdv2007.1/build/gspca_core.c:2616: warning: initialization makes pointer from integer without a cast
/var/lib/dkms/gspca/1.00.18-1mdv2007.1/build/gspca_core.c:2617: warning: return makes pointer from integer without a cast
/var/lib/dkms/gspca/1.00.18-1mdv2007.1/build/gspca_core.c: In function spca50x_create_sysfs:
/var/lib/dkms/gspca/1.00.18-1mdv2007.1/build/gspca_core.c:2671: warning: implicit declaration of function video_device_create_file
/var/lib/dkms/gspca/1.00.18-1mdv2007.1/build/gspca_core.c: In function spca5xx_probe:
/var/lib/dkms/gspca/1.00.18-1mdv2007.1/build/gspca_core.c:4120: warning: implicit declaration of function video_device_alloc
/var/lib/dkms/gspca/1.00.18-1mdv2007.1/build/gspca_core.c:4120: warning: assignment makes pointer from integer without a cast
/var/lib/dkms/gspca/1.00.18-1mdv2007.1/build/gspca_core.c:4123: error: invalid application of sizeof to incomplete type struct video_device
/var/lib/dkms/gspca/1.00.18-1mdv2007.1/build/gspca_core.c:4123: error: invalid application of sizeof to incomplete type struct video_device
/var/lib/dkms/gspca/1.00.18-1mdv2007.1/build/gspca_core.c:4123: error: invalid application of sizeof to incomplete type struct video_device
/var/lib/dkms/gspca/1.00.18-1mdv2007.1/build/gspca_core.c:4124: error: dereferencing pointer to incomplete type
/var/lib/dkms/gspca/1.00.18-1mdv2007.1/build/gspca_core.c:4125: warning: implicit declaration of function video_set_drvdata
/var/lib/dkms/gspca/1.00.18-1mdv2007.1/build/gspca_core.c:4128: warning: implicit declaration of function video_register_device
/var/lib/dkms/gspca/1.00.18-1mdv2007.1/build/gspca_core.c:4128: error: VFL_TYPE_GRABBER undeclared (first use in this function)
/var/lib/dkms/gspca/1.00.18-1mdv2007.1/build/gspca_core.c:4128: error: (Each undeclared identifier is reported only once
/var/lib/dkms/gspca/1.00.18-1mdv2007.1/build/gspca_core.c:4128: error: for each function it appears in.)
/var/lib/dkms/gspca/1.00.18-1mdv2007.1/build/gspca_core.c:4147: error: dereferencing pointer to incomplete type
/var/lib/dkms/gspca/1.00.18-1mdv2007.1/build/gspca_core.c:4148: warning: implicit declaration of function video_device_release
/var/lib/dkms/gspca/1.00.18-1mdv2007.1/build/gspca_core.c:4150: warning: implicit declaration of function video_unregister_device
make[1]: *** [/var/lib/dkms/gspca/1.00.18-1mdv2007.1/build/gspca_core.o] Erreur 1
make: *** [_module_/var/lib/dkms/gspca/1.00.18-1mdv2007.1/build] Erreur 2
make: quittant le répertoire « /usr/src/kernel-multimedia-2.6.17.14-5mdv »