All pastes #525833 Raw Edit

Unnamed

public text v1 · immutable
#525833 ·published 2007-05-31 15:17 UTC
rendered paste body
/*Here is the error

make[2]: Entering directory `/var/tmp/portage/x11-libs/gtk+-1.2.10-r12/work/gtk+-1.2.10/gdk'
/bin/sh ../libtool --mode=compile x86_64-pc-linux-gnu-gcc -DHAVE_CONFIG_H -I. -I. -I.. -DG_LOG_DOMAIN=\"Gdk\" -I.. -DGTK_NO_CHECK_CASTS -DUSE_XIM -I/usr/include/glib-1.2 -I/usr/lib64/glib/include -D_REENTRANT    -march=athlon64 -O2 -pipe -Wall -c gdk.c
../libtool: line 297: s,^.*/,,g: No such file or directory
../libtool: line 711: -e: command not found
*** Warning: inferring the mode of operation is deprecated.
*** Future versions of Libtool will require --mode=MODE be specified.
../libtool: line 1022: -e: command not found
../libtool: line 1022: -e: command not found
../libtool: line 1022: -e: command not found
../libtool: line 1022: -e: command not found
../libtool: line 1022: -e: command not found
../libtool: line 1022: -e: command not found
../libtool: line 1022: -e: command not found
../libtool: line 1022: -e: command not found
../libtool: line 1022: -e: command not found
../libtool: line 1022: -e: command not found
../libtool: line 1022: -e: command not found
../libtool: line 1022: -e: command not found
../libtool: line 1022: -e: command not found
../libtool: line 1022: -e: command not found
../libtool: line 1022: -e: command not found
../libtool: line 1022: -e: command not found
../libtool: line 1022: -e: command not found
../libtool: line 1022: -e: command not found
../libtool: line 1050: -e: command not found
../libtool: line 1074: -e: command not found
: compile: cannot determine name of library object from `'
make[2]: *** [gdk.lo] Error 1
make[2]: Leaving directory `/var/tmp/portage/x11-libs/gtk+-1.2.10-r12/work/gtk+-1.2.10/gdk'
make[1]: *** [all-recursive] Error 1
make[1]: Leaving directory `/var/tmp/portage/x11-libs/gtk+-1.2.10-r12/work/gtk+-1.2.10'
make: *** [all-recursive-am] Error 2

!!! ERROR: x11-libs/gtk+-1.2.10-r12 failed.
Call stack:
  ebuild.sh, line 1621:   Called dyn_compile
  ebuild.sh, line 973:   Called qa_call 'src_compile'
  ebuild.sh, line 44:   Called src_compile
  gtk+-1.2.10-r12.ebuild, line 62:   Called die

!!! (no error message)
!!! If you need support, post the topmost build error, and the call stack if relevant.
!!! A complete build log is located at '/var/tmp/portage/x11-libs/gtk+-1.2.10-r12/temp/build.log'.