> make
=> Required installed package digest>=20010302: digest-20060826 found
===> Checking for vulnerabilities in gnustep-gui-0.12.0nb1
=> Checksum SHA1 OK for gnustep-gui-0.12.0.tar.gz
=> Checksum RMD160 OK for gnustep-gui-0.12.0.tar.gz
===> Installing dependencies for gnustep-gui-0.12.0nb1
==========================================================================
The following variables will affect the build process of this package,
gnustep-gui-0.12.0nb1. Their current value is shown below:
* SSLBASE = /usr
* SSLCERTS = /etc/openssl/certs
* SSLDIR = /etc/openssl
* SSLKEYS = /etc/openssl/private
You may want to abort the process now with CTRL-C and change their value
before continuing. Be sure to run `/usr/bin/make clean' after
the changes.
==========================================================================
=> Required installed package gmake>=3.78: gmake-3.81 found
=> Required installed package libaudiofile>=0.2.6nb1: libaudiofile-0.2.6nb1 found
=> Required installed package gnustep-base>=1.11.2nb1: gnustep-base-1.14.0nb1 found
=> Required installed package libungif>=4.1.3nb1: libungif-4.1.4nb1 found
=> Required installed package png>=1.2.9nb2: png-1.2.16 found
=> Required installed package tiff>=3.7.2nb1: tiff-3.8.2nb3 found
=> Required installed package jpeg>=6bnb2: jpeg-6bnb3 found
===> Overriding tools for gnustep-gui-0.12.0nb1
===> Extracting for gnustep-gui-0.12.0nb1
===> Patching for gnustep-gui-0.12.0nb1
=> Applying pkgsrc patches for gnustep-gui-0.12.0nb1
===> Creating toolchain wrappers for gnustep-gui-0.12.0nb1
===> Configuring for gnustep-gui-0.12.0nb1
=> Modifying GNU configure scripts to avoid --recheck
=> Replacing config-guess with pkgsrc versions
=> Replacing config-sub with pkgsrc versions
configure: WARNING: If you wanted to set the --build type, don't use --host.
If a cross compiler is detected then cross compile mode will be used.
checking build system type... i386-unknown-netbsdelf4.0.
checking host system type... i386--netbsdelf
checking target system type... i386--netbsdelf
checking for i386--netbsdelf-gcc... cc
checking for C compiler default output file name... a.out
checking whether the C compiler works... yes
checking whether we are cross compiling... no
checking for suffix of executables...
checking for suffix of object files... o
checking whether we are using the GNU C compiler... yes
checking whether cc accepts -g... yes
checking for cc option to accept ANSI C... none needed
checking how to run the C preprocessor... cc -E
checking for X... no
checking for i386--netbsdelf-gcc... (cached) cc
checking whether we are using the GNU C compiler... (cached) yes
checking whether cc accepts -g... (cached) yes
checking for cc option to accept ANSI C... (cached) none needed
checking how to run the C preprocessor... cc -E
checking for main in -lm... yes
checking for rint... yes
checking for rintf... yes
checking for egrep... grep -E
checking for ANSI C header files... yes
checking for sys/types.h... yes
checking for sys/stat.h... yes
checking for stdlib.h... yes
checking for string.h... yes
checking for memory.h... yes
checking for strings.h... yes
checking for inttypes.h... yes
checking for stdint.h... yes
checking for unistd.h... yes
checking mntent.h usability... no
checking mntent.h presence... no
checking for mntent.h... no
checking sys/mntent.h usability... no
checking sys/mntent.h presence... no
checking for sys/mntent.h... no
checking for struct mntent.mnt_dir... no
checking for struct mntent.mnt_mountp... no
checking for getmntent in -lsun... no
checking for getmntent in -lseq... no
checking for getmntent in -lgen... no
checking for getmntent... no
checking jpeglib.h usability... yes
checking jpeglib.h presence... yes
checking for jpeglib.h... yes
checking for jpeg_destroy_decompress in -ljpeg... yes
checking for main in -lz... yes
checking tiffio.h usability... yes
checking tiffio.h presence... yes
checking for tiffio.h... yes
checking for TIFFReadScanline in -ltiff... yes
checking for png_sig_cmp in -lpng... yes
checking for DGifOpen in -lungif... yes
checking for new_aspell_document_checker in -laspell... no
checking for Pa_OpenDefaultStream in -lportaudio... no
checking for afGetVirtualFrameSize in -laudiofile... yes
checking portaudio.h usability... no
checking portaudio.h presence... no
checking for portaudio.h... no
checking audiofile.h usability... yes
checking audiofile.h presence... yes
checking for audiofile.h... yes
checking for portaudio version >= 19... no
checking for cups-config... no
Could not find cups-config program, cups printing support will not be built.
checking for the version of gnustep-gui we are compiling... 0.12.0
configure: creating ./config.status
config.status: creating config.make
config.status: creating gui.make
config.status: creating Headers/Additions/GNUstepGUI/GSVersion.h
config.status: creating Headers/Additions/GNUstepGUI/config.h
===> Building for gnustep-gui-0.12.0nb1
This is gnustep-make 2.0.0. Type 'make print-gnustep-make-help' for help.
Making all in Source...
gmake[1]: Entering directory `/usr/pkgsrc/x11/gnustep-gui/work/gnustep-gui-0.12.0/Source'
/usr/pkg/share/GNUstep/System/Library/Makefiles/mkinstalldirs .
mv ../Headers/Additions/GNUstepGUI/config.h .
touch ./config.h
Making all for library libgnustep-gui...
Compiling file Functions.m ...
Functions.m:29:42: warning: Foundation/NSAutoreleasePool.h: No such file or directory
Functions.m:30:33: warning: Foundation/NSBundle.h: No such file or directory
Functions.m:31:38: warning: Foundation/NSProcessInfo.h: No such file or directory
In file included from Functions.m:33:
../Headers/AppKit/NSApplication.h:41:40: warning: GNUstepBase/GSVersionMacros.h: No such file or directory
In file included from ../Headers/AppKit/NSApplication.h:43,
from Functions.m:33:
../Headers/AppKit/NSResponder.h:34:33: warning: Foundation/NSObject.h: No such file or directory
In file included from ../Headers/AppKit/NSResponder.h:35,
from ../Headers/AppKit/NSApplication.h:43,
from Functions.m:33:
../Headers/AppKit/NSInterfaceStyle.h:32:19: error: missing binary operator before token "("
In file included from ../Headers/AppKit/NSApplication.h:43,
from Functions.m:33:
../Headers/AppKit/NSResponder.h:47: error: cannot find interface declaration for 'NSObject', superclass of 'NSResponder'
../Headers/AppKit/NSResponder.h:47: error: cannot find protocol declaration for 'NSCoding'
In file included from ../Headers/AppKit/NSApplication.h:43,
from Functions.m:33:
../Headers/AppKit/NSResponder.h:49:20: error: missing binary operator before token "("
../Headers/AppKit/NSResponder.h:52: error: expected specifier-qualifier-list before 'NSInterfaceStyle'
../Headers/AppKit/NSResponder.h:79: error: expected ')' before 'BOOL'
../Headers/AppKit/NSResponder.h:80: error: expected ')' before 'BOOL'
../Headers/AppKit/NSResponder.h:81: error: expected ')' before 'BOOL'
../Headers/AppKit/NSResponder.h:86: error: expected ')' before 'BOOL'
../Headers/AppKit/NSResponder.h:87: error: expected ')' before 'BOOL'
../Headers/AppKit/NSResponder.h:87: error: expected ')' before 'SEL'
../Headers/AppKit/NSResponder.h:102: error: expected ')' before 'SEL'
../Headers/AppKit/NSResponder.h:103:19: error: missing binary operator before token "("
# $NetBSD: Makefile,v 1.36 2007/01/15 19:07:14 joerg Exp $
../Headers/AppKit/NSResponder.h:111:19: error: missing binary operator before token "("
../Headers/AppKit/NSResponder.h:127:19: error: missing binary operator before token "("
../Headers/AppKit/NSResponder.h:161:19: error: missing binary operator before token "("
../Headers/AppKit/NSResponder.h:173:19: error: missing binary operator before token "("
In file included from Functions.m:33:
../Headers/AppKit/NSApplication.h:72:19: error: missing binary operator before token "("
In file included from Functions.m:33:
../Headers/AppKit/NSApplication.h:108: error: cannot find protocol declaration for 'NSCoding'
../Headers/AppKit/NSApplication.h:120: error: expected specifier-qualifier-list before 'BOOL'
../Headers/AppKit/NSApplication.h:121: error: expected specifier-qualifier-list before 'BOOL'
../Headers/AppKit/NSApplication.h:122: error: expected specifier-qualifier-list before 'BOOL'
../Headers/AppKit/NSApplication.h:123: error: expected specifier-qualifier-list before 'BOOL'
../Headers/AppKit/NSApplication.h:124: error: expected specifier-qualifier-list before 'BOOL'
../Headers/AppKit/NSApplication.h:125: error: expected specifier-qualifier-list before 'BOOL'
../Headers/AppKit/NSApplication.h:144:19: error: missing binary operator before token "("
../Headers/AppKit/NSApplication.h:167: error: expected ')' before 'BOOL'
../Headers/AppKit/NSApplication.h:169: error: expected ')' before 'BOOL'
../Headers/AppKit/NSApplication.h:170:19: error: missing binary operator before token "("
../Headers/AppKit/NSApplication.h:181: error: expected ')' before 'BOOL'
../Headers/AppKit/NSApplication.h:191:19: error: missing binary operator before token "("
../Headers/AppKit/NSApplication.h:213: error: expected ')' before 'BOOL'
../Headers/AppKit/NSApplication.h:214: error: expected ')' before 'BOOL'
../Headers/AppKit/NSApplication.h:219: error: expected ')' before 'BOOL'
../Headers/AppKit/NSApplication.h:219: error: expected ')' before 'SEL'
../Headers/AppKit/NSApplication.h:222: error: expected ')' before 'SEL'
../Headers/AppKit/NSApplication.h:223:19: error: missing binary operator before token "("
../Headers/AppKit/NSApplication.h:228: error: expected ')' before 'BOOL'
../Headers/AppKit/NSApplication.h:228: error: expected ')' before 'SEL'
../Headers/AppKit/NSApplication.h:241: error: expected ')' before 'BOOL'
../Headers/AppKit/NSApplication.h:250: error: expected ')' before 'SEL'
../Headers/AppKit/NSApplication.h:251: error: expected ')' before 'BOOL'
../Headers/AppKit/NSApplication.h:254: error: expected ')' before 'BOOL'
../Headers/AppKit/NSApplication.h:262:19: error: missing binary operator before token "("
../Headers/AppKit/NSApplication.h:269:19: error: missing binary operator before token "("
../Headers/AppKit/NSApplication.h:282:19: error: missing binary operator before token "("
../Headers/AppKit/NSApplication.h:291: error: expected ')' before 'BOOL'
../Headers/AppKit/NSApplication.h:295: error: expected ')' before 'BOOL'
../Headers/AppKit/NSApplication.h:326:19: error: missing binary operator before token "("
../Headers/AppKit/NSApplication.h:337:19: error: missing binary operator before token "("
../Headers/AppKit/NSApplication.h:365: error: cannot find interface declaration for 'NSObject'
gmake[2]: *** [obj/Functions.o] Error 1
gmake[1]: *** [libgnustep-gui.all.library.variables] Error 2
gmake[1]: Leaving directory `/usr/pkgsrc/x11/gnustep-gui/work/gnustep-gui-0.12.0/Source'
gmake: *** [internal-all] Error 2
*** Error code 2
Stop.
make: stopped in /usr/pkgsrc/x11/gnustep-gui
*** Error code 1
Stop.
make: stopped in /usr/pkgsrc/x11/gnustep-gui