All pastes #525412 Raw Edit

Anonymous

public text v1 · immutable
#525412 ·published 2007-05-31 10:58 UTC
rendered paste body
../../dist/include/content/nsContentPolicyUtils.h:199: warning: 'nsIDocShell* NS_CP_GetDocShellFromContext(nsISupports*)' defined but not used
In file included from ./../generic/nsAreaFrame.h:40,
                 from ./../forms/nsTextControlFrame.h:42,
                 from nsLayoutStatics.cpp:75:
./../generic/nsFrame.h:331: warning: `virtual nsresult nsFrame::GetAscent(nsBoxLayoutState&, nscoord&)' was hidden
./../generic/nsBlockFrame.h:270: warning:   by `nscoord nsBlockFrame::GetAscent()'
In file included from ./../../content/xul/content/src/nsXULElement.h:62,
                 from nsLayoutStatics.cpp:83:
../../dist/include/dom/nsIDOMXULSelectCntrlEl.h:33: warning: `virtual nsresult nsIDOMXULSelectControlElement::GetSelectedItem(nsIDOMXULSelectControlItemElement**)' was hidden
../../dist/include/dom/nsIDOMXULMultSelectCntrlEl.h:73: warning:   by `virtual nsresult nsIDOMXULMultiSelectControlElement::GetSelectedItem(PRInt32, nsIDOMXULSelectControlItemElement**)'
rm -f libgklayout.so
c++ -I/usr/X11R6/include -fno-rtti -fno-exceptions -Wall -Wconversion -Wpointer-arith -Wcast-align -Woverloaded-virtual -Wsynth -Wno-ctor-dtor-privacy -Wno-non-virtual-dtor -Wno-long-long -pedantic -fshort-wchar -pthread -pipe  -DNDEBUG -DTRIMMED -ffunction-sections -O2 -march=x86-64 -fPIC -pipe -fPIC -shared -Wl,-z,defs -Wl,-h,libgklayout.so -o libgklayout.so  nsLayoutModule.o nsContentHTTPStartup.o nsContentDLF.o nsLayoutStatics.o    -O2 -march=x86-64 -fPIC -pipe -Wl,--as-needed   -Wl,--whole-archive ../../dist/lib/libgkbase_s.a ../../dist/lib/libgkgeneric_s.a ../../dist/lib/libgkforms_s.a ../../dist/lib/libgkstyle_s.a ../../dist/lib/libgkprinting_s.a ../../dist/lib/libgktable_s.a ../../dist/lib/libgkxulbase_s.a ../../dist/lib/libgkconbase_s.a ../../dist/lib/libgkconcvs_s.a ../../dist/lib/libgkconevents_s.a ../../dist/lib/libgkconhtmlcon_s.a ../../dist/lib/libgkconhtmldoc_s.a ../../dist/lib/libgkconxmlcon_s.a ../../dist/lib/libgkconxmldoc_s.a ../../dist/lib/libgkconxbl_s.a ../../dist/lib/libgkconxulcon_s.a ../../dist/lib/libgkconxuldoc_s.a ../../dist/lib/libgkview_s.a ../../dist/lib/libjsdombase_s.a ../../dist/lib/libjsdomevents_s.a ../../dist/lib/libjsurl_s.a ../../dist/lib/libjsdomstorage_s.a  ../../dist/lib/libgkxultree_s.a ../../dist/lib/libgkxulgrid_s.a ../../dist/lib/libgkconxultmpl_s.a  ../../dist/lib/libinspector_s.a  ../../dist/lib/libgkcontentxtf_s.a ../../dist/lib/libgkxtfbase_s.a  ../../dist/lib/libgksvgbase_s.a ../../dist/lib/libgkconsvgdoc_s.a ../../dist/lib/libgkcontentsvg_s.a  ../../dist/lib/libgksvgrenderercairo_s.a  -Wl,--no-whole-archive -L../../dist/bin -L../../dist/lib -lgkgfx ../../dist/lib/libunicharutil_s.a -L../../dist/bin -lxpcom -lxpcom_core  -L../../dist/bin -L../../dist/lib -lplds4 -lplc4 -lnspr4 -lpthread -ldl -L../../dist/bin -lmozjs  -lgtk-x11-2.0 -lgdk-x11-2.0 -latk-1.0 -lgdk_pixbuf-2.0 -lm -lpangocairo-1.0 -lpango-1.0 -lcairo -lgobject-2.0 -lgmodule-2.0 -ldl -lglib-2.0    -lcairo    -Wl,--version-script -Wl,../../build/unix/gnu-ld-scripts/components-version-script -Wl,-Bsymbolic -ldl -lm    
../../dist/lib/libgkconcvs_s.a(nsCanvasRenderingContext2D.o): In function `nsCanvasRenderingContext2D::Destroy()':
nsCanvasRenderingContext2D.cpp:(.text._ZN26nsCanvasRenderingContext2D7DestroyEv+0x4c): undefined reference to `XFreePixmap'
../../dist/lib/libgkconcvs_s.a(nsCanvasRenderingContext2D.o): In function `nsCanvasRenderingContext2D::SetDimensions(int, int)':
nsCanvasRenderingContext2D.cpp:(.text._ZN26nsCanvasRenderingContext2D13SetDimensionsEii+0x2a1): undefined reference to `XRenderFindStandardFormat'
nsCanvasRenderingContext2D.cpp:(.text._ZN26nsCanvasRenderingContext2D13SetDimensionsEii+0x2c2): undefined reference to `XListPixmapFormats'
nsCanvasRenderingContext2D.cpp:(.text._ZN26nsCanvasRenderingContext2D13SetDimensionsEii+0x2e7): undefined reference to `XFree'
nsCanvasRenderingContext2D.cpp:(.text._ZN26nsCanvasRenderingContext2D13SetDimensionsEii+0x323): undefined reference to `XCreatePixmap'
collect2: ld returned 1 exit status
gmake[3]: *** [libgklayout.so] Error 1
gmake[3]: Leaving directory `/home/sasa/DEVELOPMENT/DROPLINE_GNOME/DBS/DLG/WORK/mozilla-thunderbird-2.0.0.0-1/mozilla/layout/build'
gmake[2]: *** [libs] Error 2
gmake[2]: Leaving directory `/home/sasa/DEVELOPMENT/DROPLINE_GNOME/DBS/DLG/WORK/mozilla-thunderbird-2.0.0.0-1/mozilla/layout'
gmake[1]: *** [tier_9] Error 2
gmake[1]: Leaving directory `/home/sasa/DEVELOPMENT/DROPLINE_GNOME/DBS/DLG/WORK/mozilla-thunderbird-2.0.0.0-1/mozilla'
make: *** [default] Error 2
Error!  make exited with status: 2
Failed package mozilla-thunderbird

root@rcserver:/home/sasa/DEVELOPMENT/DROPLINE_GNOME/DBS/dropline-build-system#