make[2]: Entering directory `/var/tmp/portage/libXext-1.0.1/work/libXext-1.0.1/src'
if /bin/sh ../libtool --tag=CC --mode=compile x86_64-pc-linux-gnu-gcc -DHAVE_CONFIG_H -I. -I. -I.. -DMALLOC_0_RETURNS_NULL -march=k8 -pipe -O2 -MT DPMS.lo -MD -MP -MF ".deps/DPMS.Tpo" -c -o DPMS.lo DPMS.c; \
then mv -f ".deps/DPMS.Tpo" ".deps/DPMS.Plo"; else rm -f ".deps/DPMS.Tpo"; exit 1; fi
if /bin/sh ../libtool --tag=CC --mode=compile x86_64-pc-linux-gnu-gcc -DHAVE_CONFIG_H -I. -I. -I.. -DMALLOC_0_RETURNS_NULL -march=k8 -pipe -O2 -MT MITMisc.lo -MD -MP -MF ".deps/MITMisc.Tpo" -c -o MITMisc.lo MITMisc.c; \
then mv -f ".deps/MITMisc.Tpo" ".deps/MITMisc.Plo"; else rm -f ".deps/MITMisc.Tpo"; exit 1; fi
mkdir .libs
x86_64-pc-linux-gnu-gcc -DHAVE_CONFIG_H -I. -I. -I.. -DMALLOC_0_RETURNS_NULL -march=k8 -pipe -O2 -MT DPMS.lo -MD -MP -MF .deps/DPMS.Tpo -c DPMS.c -fPIC -DPIC -o .libs/DPMS.o
x86_64-pc-linux-gnu-gcc -DHAVE_CONFIG_H -I. -I. -I.. -DMALLOC_0_RETURNS_NULL -march=k8 -pipe -O2 -MT MITMisc.lo -MD -MP -MF .deps/MITMisc.Tpo -c MITMisc.c -fPIC -DPIC -o .libs/MITMisc.o
DPMS.c:39:25: X11/Xlibint.h: No such file or directory
DPMS.c:40:33: X11/extensions/dpms.h: No such file or directory
DPMS.c:41:36: X11/extensions/dpmsstr.h: No such file or directory
DPMS.c:42:33: X11/extensions/Xext.h: No such file or directory
DPMS.c:43:36: X11/extensions/extutil.h: No such file or directory
DPMS.c:46: error: syntax error before "_dpms_info_data"
DPMS.c:46: warning: data definition has no type or storage class
DPMS.c:47: error: syntax error before '*' token
DPMS.c:47: warning: data definition has no type or storage class
DPMS.c:48: error: `DPMSExtensionName' undeclared here (not in a function)
DPMS.c:59: error: syntax error before '*' token
DPMS.c:60: error: syntax error before "dpms_extension_hooks"
DPMS.c:61: warning: initialization makes integer from pointer without a cast
DPMS.c:62: warning: excess elements in scalar initializer
DPMS.c:62: warning: (near initialization for `dpms_extension_hooks')
DPMS.c:63: warning: excess elements in scalar initializer
DPMS.c:63: warning: (near initialization for `dpms_extension_hooks')
DPMS.c:64: warning: excess elements in scalar initializer
DPMS.c:64: warning: (near initialization for `dpms_extension_hooks')
DPMS.c:65: warning: excess elements in scalar initializer
DPMS.c:65: warning: (near initialization for `dpms_extension_hooks')
DPMS.c:66: warning: excess elements in scalar initializer
DPMS.c:66: warning: (near initialization for `dpms_extension_hooks')
DPMS.c:67: warning: excess elements in scalar initializer
DPMS.c:67: warning: (near initialization for `dpms_extension_hooks')
DPMS.c:68: warning: excess elements in scalar initializer
DPMS.c:68: warning: (near initialization for `dpms_extension_hooks')
DPMS.c:69: warning: excess elements in scalar initializer
DPMS.c:69: warning: (near initialization for `dpms_extension_hooks')
DPMS.c:70: warning: excess elements in scalar initializer
DPMS.c:70: warning: (near initialization for `dpms_extension_hooks')
DPMS.c:72: warning: excess elements in scalar initializer
DPMS.c:72: warning: (near initialization for `dpms_extension_hooks')
DPMS.c:72: warning: data definition has no type or storage class
DPMS.c:76: error: syntax error before '&' token
DPMS.c:94: error: `info' undeclared here (not in a function)
DPMS.c:94: warning: data definition has no type or storage class
DPMS.c:95: error: syntax error before "return"
DPMS.c:102: error: syntax error before '*' token
DPMS.c: In function `DPMSGetVersion':
DPMS.c:104: error: `XExtDisplayInfo' undeclared (first use in this function)
DPMS.c:104: error: (Each undeclared identifier is reported only once
DPMS.c:104: error: for each function it appears in.)
DPMS.c:104: error: `dpy' undeclared (first use in this function)
DPMS.c:105: error: `xDPMSGetVersionReply' undeclared (first use in this function)
DPMS.c:105: error: syntax error before "rep"
DPMS.c:106: error: syntax error before '*' token
DPMS.c:111: error: `req' undeclared (first use in this function)
DPMS.c:113: error: `X_DPMSGetVersion' undeclared (first use in this function)
DPMS.c:114: error: `xReply' undeclared (first use in this function)
DPMS.c:114: error: syntax error before ')' token
DPMS.c:114: error: `rep' undeclared (first use in this function)
DPMS.c:114: error: `xTrue' undeclared (first use in this function)
DPMS.c:119: error: `major_versionp' undeclared (first use in this function)
DPMS.c:120: error: `minor_versionp' undeclared (first use in this function)
DPMS.c: At top level:
DPMS.c:127: error: syntax error before "DPMSCapable"
DPMS.c:127: error: syntax error before '*' token
DPMS.c: In function `DPMSCapable':
DPMS.c:129: error: `XExtDisplayInfo' undeclared (first use in this function)
DPMS.c:129: error: `dpy' undeclared (first use in this function)
DPMS.c:130: error: syntax error before '*' token
DPMS.c:131: error: `xDPMSCapableReply' undeclared (first use in this function)
DPMS.c:136: error: `req' undeclared (first use in this function)
DPMS.c:138: error: `X_DPMSCapable' undeclared (first use in this function)
DPMS.c:140: error: `xReply' undeclared (first use in this function)
DPMS.c:140: error: syntax error before ')' token
DPMS.c:140: error: `rep' undeclared (first use in this function)
DPMS.c:140: error: `xFalse' undeclared (first use in this function)
DPMS.c:143: error: `False' undeclared (first use in this function)
DPMS.c: At top level:
DPMS.c:151: error: syntax error before "DPMSSetTimeouts"
DPMS.c:151: error: syntax error before '*' token
DPMS.c: In function `DPMSSetTimeouts':
DPMS.c:153: error: `XExtDisplayInfo' undeclared (first use in this function)
DPMS.c:153: error: `dpy' undeclared (first use in this function)
DPMS.c:154: error: syntax error before '*' token
DPMS.c:156: error: `off' undeclared (first use in this function)
DPMS.c:156: error: `suspend' undeclared (first use in this function)
DPMS.c:158: error: `BadValue' undeclared (first use in this function)
DPMS.c:160: error: `standby' undeclared (first use in this function)
DPMS.c:167: error: `req' undeclared (first use in this function)
DPMS.c:169: error: `X_DPMSSetTimeouts' undeclared (first use in this function)
DPMS.c: At top level:
DPMS.c:180: error: syntax error before "DPMSGetTimeouts"
DPMS.c:180: error: syntax error before '*' token
DPMS.c: In function `DPMSGetTimeouts':
DPMS.c:182: error: `XExtDisplayInfo' undeclared (first use in this function)
DPMS.c:182: error: `dpy' undeclared (first use in this function)
DPMS.c:183: error: syntax error before '*' token
DPMS.c:184: error: `xDPMSGetTimeoutsReply' undeclared (first use in this function)
DPMS.c:189: error: `req' undeclared (first use in this function)
DPMS.c:191: error: `X_DPMSGetTimeouts' undeclared (first use in this function)
DPMS.c:193: error: `xReply' undeclared (first use in this function)
DPMS.c:193: error: syntax error before ')' token
DPMS.c:193: error: `rep' undeclared (first use in this function)
DPMS.c:193: error: `xTrue' undeclared (first use in this function)
DPMS.c:196: error: `False' undeclared (first use in this function)
DPMS.c:200: error: `standby' undeclared (first use in this function)
DPMS.c:201: error: `suspend' undeclared (first use in this function)
DPMS.c:202: error: `off' undeclared (first use in this function)
DPMS.c: At top level:
DPMS.c:207: error: syntax error before "DPMSEnable"
DPMS.c:207: error: syntax error before '*' token
DPMS.c: In function `DPMSEnable':
DPMS.c:209: error: `XExtDisplayInfo' undeclared (first use in this function)
DPMS.c:209: error: `dpy' undeclared (first use in this function)
DPMS.c:210: error: syntax error before '*' token
DPMS.c:214: error: `req' undeclared (first use in this function)
DPMS.c:216: error: `X_DPMSEnable' undeclared (first use in this function)
DPMS.c: At top level:
DPMS.c:224: error: syntax error before "DPMSDisable"
DPMS.c:224: error: syntax error before '*' token
DPMS.c: In function `DPMSDisable':
DPMS.c:226: error: `XExtDisplayInfo' undeclared (first use in this function)
DPMS.c:226: error: `dpy' undeclared (first use in this function)
DPMS.c:227: error: syntax error before '*' token
DPMS.c:231: error: `req' undeclared (first use in this function)
DPMS.c:233: error: `X_DPMSDisable' undeclared (first use in this function)
DPMS.c: At top level:
DPMS.c:242: error: syntax error before "DPMSForceLevel"
DPMS.c:242: error: syntax error before '*' token
DPMS.c: In function `DPMSForceLevel':
DPMS.c:244: error: `XExtDisplayInfo' undeclared (first use in this function)
DPMS.c:244: error: `dpy' undeclared (first use in this function)
DPMS.c:245: error: syntax error before '*' token
DPMS.c:249: error: `level' undeclared (first use in this function)
DPMS.c:249: error: `DPMSModeOn' undeclared (first use in this function)
DPMS.c:250: error: `DPMSModeStandby' undeclared (first use in this function)
DPMS.c:251: error: `DPMSModeSuspend' undeclared (first use in this function)
DPMS.c:252: error: `DPMSModeOff' undeclared (first use in this function)
DPMS.c:253: error: `BadValue' undeclared (first use in this function)
DPMS.c:256: error: `req' undeclared (first use in this function)
DPMS.c:258: error: `X_DPMSForceLevel' undeclared (first use in this function)
DPMS.c: At top level:
DPMS.c:267: error: syntax error before "DPMSInfo"
DPMS.c:267: error: syntax error before '*' token
DPMS.c: In function `DPMSInfo':
DPMS.c:269: error: `XExtDisplayInfo' undeclared (first use in this function)
DPMS.c:269: error: `dpy' undeclared (first use in this function)
DPMS.c:270: error: syntax error before '*' token
DPMS.c:271: error: `xDPMSInfoReply' undeclared (first use in this function)
DPMS.c:276: error: `req' undeclared (first use in this function)
DPMS.c:278: error: `X_DPMSInfo' undeclared (first use in this function)
DPMS.c:280: error: `xReply' undeclared (first use in this function)
DPMS.c:280: error: syntax error before ')' token
DPMS.c:280: error: `rep' undeclared (first use in this function)
DPMS.c:280: error: `xTrue' undeclared (first use in this function)
DPMS.c:283: error: `False' undeclared (first use in this function)
DPMS.c:287: error: `power_level' undeclared (first use in this function)
DPMS.c:288: error: `state' undeclared (first use in this function)
make[2]: *** [DPMS.lo] Error 1
make[2]: *** Waiting for unfinished jobs....
MITMisc.c:35:25: X11/Xlibint.h: No such file or directory
MITMisc.c:36:36: X11/extensions/MITMisc.h: No such file or directory
MITMisc.c:37:39: X11/extensions/mitmiscstr.h: No such file or directory
MITMisc.c:38:33: X11/extensions/Xext.h: No such file or directory
MITMisc.c:39:36: X11/extensions/extutil.h: No such file or directory
MITMisc.c:41: error: syntax error before "_mit_info_data"
MITMisc.c:41: warning: data definition has no type or storage class
MITMisc.c:42: error: syntax error before '*' token
MITMisc.c:42: warning: data definition has no type or storage class
MITMisc.c:43: error: `MITMISCNAME' undeclared here (not in a function)
MITMisc.c:54: error: syntax error before '*' token
MITMisc.c:55: error: syntax error before "mit_extension_hooks"
MITMisc.c:56: error: `NULL' undeclared here (not in a function)
MITMisc.c:56: error: initializer element is not constant
MITMisc.c:56: error: (near initialization for `mit_extension_hooks')
MITMisc.c:57: warning: excess elements in scalar initializer
MITMisc.c:57: warning: (near initialization for `mit_extension_hooks')
MITMisc.c:58: warning: excess elements in scalar initializer
MITMisc.c:58: warning: (near initialization for `mit_extension_hooks')
MITMisc.c:59: warning: excess elements in scalar initializer
MITMisc.c:59: warning: (near initialization for `mit_extension_hooks')
MITMisc.c:60: warning: excess elements in scalar initializer
MITMisc.c:60: warning: (near initialization for `mit_extension_hooks')
MITMisc.c:61: warning: excess elements in scalar initializer
MITMisc.c:61: warning: (near initialization for `mit_extension_hooks')
MITMisc.c:62: warning: excess elements in scalar initializer
MITMisc.c:62: warning: (near initialization for `mit_extension_hooks')
MITMisc.c:63: warning: excess elements in scalar initializer
MITMisc.c:63: warning: (near initialization for `mit_extension_hooks')
MITMisc.c:64: warning: excess elements in scalar initializer
MITMisc.c:64: warning: (near initialization for `mit_extension_hooks')
MITMisc.c:65: warning: excess elements in scalar initializer
MITMisc.c:65: warning: (near initialization for `mit_extension_hooks')
MITMisc.c:67: warning: excess elements in scalar initializer
MITMisc.c:67: warning: (near initialization for `mit_extension_hooks')
MITMisc.c:67: warning: data definition has no type or storage class
MITMisc.c:70: error: syntax error before '&' token
MITMisc.c: In function `XEXT_GENERATE_FIND_DISPLAY':
MITMisc.c:82: error: storage class specified for parameter `XEXT_GENERATE_CLOSE_DISPLAY'
MITMisc.c:82: warning: parameter names (without types) in function declaration
MITMisc.c:82: error: syntax error before "Bool"
MITMisc.c:99: error: syntax error before '*' token
MITMisc.c:116: error: syntax error before '*' token
make[2]: *** [MITMisc.lo] Error 1
make[2]: Leaving directory `/var/tmp/portage/libXext-1.0.1/work/libXext-1.0.1/src'
make[1]: *** [all-recursive] Error 1
make[1]: Leaving directory `/var/tmp/portage/libXext-1.0.1/work/libXext-1.0.1'
make: *** [all] Error 2
!!! ERROR: x11-libs/libXext-1.0.1 failed.
Call stack:
ebuild.sh, line 1521: Called dyn_compile
ebuild.sh, line 924: Called src_compile
ebuild.sh, line 1233: Called x-modular_src_compile
x-modular.eclass, line 320: Called x-modular_src_make
x-modular.eclass, line 315: Called die
!!! emake failed
!!! If you need support, post the topmost build error, and the call stack if relevant.