/var/tmp/portage/ieee80211-1.1.13-r1/work/ieee80211-1.1.13/net/ieee80211.h:1004: warning: type defaults to `int' in declaration of `flags'
/var/tmp/portage/ieee80211-1.1.13-r1/work/ieee80211-1.1.13/net/ieee80211.h:1004: warning: data definition has no type or storage class
/var/tmp/portage/ieee80211-1.1.13-r1/work/ieee80211-1.1.13/net/ieee80211.h:1005: error: parse error before "max_power"
/var/tmp/portage/ieee80211-1.1.13-r1/work/ieee80211-1.1.13/net/ieee80211.h:1005: warning: type defaults to `int' in declaration of `max_power'
/var/tmp/portage/ieee80211-1.1.13-r1/work/ieee80211-1.1.13/net/ieee80211.h:1005: warning: data definition has no type or storage class
/var/tmp/portage/ieee80211-1.1.13-r1/work/ieee80211-1.1.13/net/ieee80211.h:1009: error: parse error before "u8"
/var/tmp/portage/ieee80211-1.1.13-r1/work/ieee80211-1.1.13/net/ieee80211.h:1009: warning: no semicolon at end of struct or union
/var/tmp/portage/ieee80211-1.1.13-r1/work/ieee80211-1.1.13/net/ieee80211.h:1010: warning: type defaults to `int' in declaration of `bg_channels'
/var/tmp/portage/ieee80211-1.1.13-r1/work/ieee80211-1.1.13/net/ieee80211.h:1010: warning: data definition has no type or storage class
/var/tmp/portage/ieee80211-1.1.13-r1/work/ieee80211-1.1.13/net/ieee80211.h:1011: error: parse error before "a_channels"
/var/tmp/portage/ieee80211-1.1.13-r1/work/ieee80211-1.1.13/net/ieee80211.h:1011: warning: type defaults to `int' in declaration of `a_channels'
/var/tmp/portage/ieee80211-1.1.13-r1/work/ieee80211-1.1.13/net/ieee80211.h:1011: warning: data definition has no type or storage class
/var/tmp/portage/ieee80211-1.1.13-r1/work/ieee80211-1.1.13/net/ieee80211.h:1014: error: parse error before '}' token
/var/tmp/portage/ieee80211-1.1.13-r1/work/ieee80211-1.1.13/net/ieee80211.h:1018: error: field `sec' has incomplete type
/var/tmp/portage/ieee80211-1.1.13-r1/work/ieee80211-1.1.13/net/ieee80211.h:1024: error: field `geo' has incomplete type
/var/tmp/portage/ieee80211-1.1.13-r1/work/ieee80211-1.1.13/net/ieee80211.h:1036: error: parse error before "spinlock_t"
/var/tmp/portage/ieee80211-1.1.13-r1/work/ieee80211-1.1.13/net/ieee80211.h:1036: warning: no semicolon at end of struct or union
/var/tmp/portage/ieee80211-1.1.13-r1/work/ieee80211-1.1.13/net/ieee80211.h:1040: error: parse error before "config"
/var/tmp/portage/ieee80211-1.1.13-r1/work/ieee80211-1.1.13/net/ieee80211.h:1040: warning: type defaults to `int' in declaration of `config'
/var/tmp/portage/ieee80211-1.1.13-r1/work/ieee80211-1.1.13/net/ieee80211.h:1040: warning: data definition has no type or storage class
/var/tmp/portage/ieee80211-1.1.13-r1/work/ieee80211-1.1.13/net/ieee80211.h:1063: error: parse error before "wpa_ie_len"
/var/tmp/portage/ieee80211-1.1.13-r1/work/ieee80211-1.1.13/net/ieee80211.h:1063: warning: type defaults to `int' in declaration of `wpa_ie_len'
/var/tmp/portage/ieee80211-1.1.13-r1/work/ieee80211-1.1.13/net/ieee80211.h:1063: warning: data definition has no type or storage class
/var/tmp/portage/ieee80211-1.1.13-r1/work/ieee80211-1.1.13/net/ieee80211.h:1064: error: parse error before '*' token
/var/tmp/portage/ieee80211-1.1.13-r1/work/ieee80211-1.1.13/net/ieee80211.h:1064: warning: type defaults to `int' in declaration of `wpa_ie'
/var/tmp/portage/ieee80211-1.1.13-r1/work/ieee80211-1.1.13/net/ieee80211.h:1064: error: conflicting types for 'wpa_ie'
/var/tmp/portage/ieee80211-1.1.13-r1/work/ieee80211-1.1.13/net/ieee80211.h:940: error: previous declaration of 'wpa_ie' was here
/var/tmp/portage/ieee80211-1.1.13-r1/work/ieee80211-1.1.13/net/ieee80211.h:1064: warning: data definition has no type or storage class
/var/tmp/portage/ieee80211-1.1.13-r1/work/ieee80211-1.1.13/net/ieee80211.h:1078: error: parse error before "fts"
/var/tmp/portage/ieee80211-1.1.13-r1/work/ieee80211-1.1.13/net/ieee80211.h:1078: warning: type defaults to `int' in declaration of `fts'
/var/tmp/portage/ieee80211-1.1.13-r1/work/ieee80211-1.1.13/net/ieee80211.h:1078: warning: data definition has no type or storage class
/var/tmp/portage/ieee80211-1.1.13-r1/work/ieee80211-1.1.13/net/ieee80211.h:1079: error: parse error before "rts"
/var/tmp/portage/ieee80211-1.1.13-r1/work/ieee80211-1.1.13/net/ieee80211.h:1079: warning: type defaults to `int' in declaration of `rts'
/var/tmp/portage/ieee80211-1.1.13-r1/work/ieee80211-1.1.13/net/ieee80211.h:1079: warning: data definition has no type or storage class
/var/tmp/portage/ieee80211-1.1.13-r1/work/ieee80211-1.1.13/net/ieee80211.h:1082: error: parse error before "bssid"
/var/tmp/portage/ieee80211-1.1.13-r1/work/ieee80211-1.1.13/net/ieee80211.h:1082: warning: type defaults to `int' in declaration of `bssid'
/var/tmp/portage/ieee80211-1.1.13-r1/work/ieee80211-1.1.13/net/ieee80211.h:1082: error: conflicting types for 'bssid'
include/linux/wireless.h:833: error: previous declaration of 'bssid' was here
/var/tmp/portage/ieee80211-1.1.13-r1/work/ieee80211-1.1.13/net/ieee80211.h:1082: warning: data definition has no type or storage class
/var/tmp/portage/ieee80211-1.1.13-r1/work/ieee80211-1.1.13/net/ieee80211.h:1084: error: conflicting types for 'state'
include/linux/hrtimer.h:66: error: previous declaration of 'state' was here
/var/tmp/portage/ieee80211-1.1.13-r1/work/ieee80211-1.1.13/net/ieee80211.h:1098: error: conflicting types for 'hard_start_xmit'
include/linux/netdevice.h:412: error: previous declaration of 'hard_start_xmit' was here
/var/tmp/portage/ieee80211-1.1.13-r1/work/ieee80211-1.1.13/net/ieee80211.h:1103: error: parse error before "u16"
/var/tmp/portage/ieee80211-1.1.13-r1/work/ieee80211-1.1.13/net/ieee80211.h:1103: warning: function declaration isn't a prototype
/var/tmp/portage/ieee80211-1.1.13-r1/work/ieee80211-1.1.13/net/ieee80211.h:1136: error: parse error before "priv"
/var/tmp/portage/ieee80211-1.1.13-r1/work/ieee80211-1.1.13/net/ieee80211.h:1136: warning: type defaults to `int' in declaration of `priv'
/var/tmp/portage/ieee80211-1.1.13-r1/work/ieee80211-1.1.13/net/ieee80211.h:1136: error: conflicting types for 'priv'
include/linux/netdevice.h:410: error: previous declaration of 'priv' was here
/var/tmp/portage/ieee80211-1.1.13-r1/work/ieee80211-1.1.13/net/ieee80211.h:1136: warning: data definition has no type or storage class
/var/tmp/portage/ieee80211-1.1.13-r1/work/ieee80211-1.1.13/net/ieee80211.h:1137: error: parse error before '}' token
In file included from /var/tmp/portage/ieee80211-1.1.13-r1/work/ieee80211-1.1.13/ieee80211_module.c:53:
/var/tmp/portage/ieee80211-1.1.13-r1/work/ieee80211-1.1.13/net/ieee80211.h: In function `ieee80211_priv':
/var/tmp/portage/ieee80211-1.1.13-r1/work/ieee80211-1.1.13/net/ieee80211.h:1180: error: dereferencing pointer to incomplete type
/var/tmp/portage/ieee80211-1.1.13-r1/work/ieee80211-1.1.13/net/ieee80211.h: In function `ieee80211_is_valid_mode':
/var/tmp/portage/ieee80211-1.1.13-r1/work/ieee80211-1.1.13/net/ieee80211.h:1216: error: dereferencing pointer to incomplete type
/var/tmp/portage/ieee80211-1.1.13-r1/work/ieee80211-1.1.13/net/ieee80211.h:1217: error: dereferencing pointer to incomplete type
/var/tmp/portage/ieee80211-1.1.13-r1/work/ieee80211-1.1.13/net/ieee80211.h:1221: error: dereferencing pointer to incomplete type
/var/tmp/portage/ieee80211-1.1.13-r1/work/ieee80211-1.1.13/net/ieee80211.h:1222: error: dereferencing pointer to incomplete type
/var/tmp/portage/ieee80211-1.1.13-r1/work/ieee80211-1.1.13/net/ieee80211.h:1226: error: dereferencing pointer to incomplete type
/var/tmp/portage/ieee80211-1.1.13-r1/work/ieee80211-1.1.13/net/ieee80211.h:1227: error: dereferencing pointer to incomplete type
/var/tmp/portage/ieee80211-1.1.13-r1/work/ieee80211-1.1.13/net/ieee80211.h: At top level:
/var/tmp/portage/ieee80211-1.1.13-r1/work/ieee80211-1.1.13/net/ieee80211.h:1233: error: parse error before "fc"
/var/tmp/portage/ieee80211-1.1.13-r1/work/ieee80211-1.1.13/net/ieee80211.h:1234: warning: function declaration isn't a prototype
/var/tmp/portage/ieee80211-1.1.13-r1/work/ieee80211-1.1.13/net/ieee80211.h: In function `ieee80211_get_hdrlen':
/var/tmp/portage/ieee80211-1.1.13-r1/work/ieee80211-1.1.13/net/ieee80211.h:1236: error: `u16' undeclared (first use in this function)
/var/tmp/portage/ieee80211-1.1.13-r1/work/ieee80211-1.1.13/net/ieee80211.h:1236: error: parse error before "stype"
/var/tmp/portage/ieee80211-1.1.13-r1/work/ieee80211-1.1.13/net/ieee80211.h:1238: error: `fc' undeclared (first use in this function)
/var/tmp/portage/ieee80211-1.1.13-r1/work/ieee80211-1.1.13/net/ieee80211.h:1242: error: `stype' undeclared (first use in this function)
/var/tmp/portage/ieee80211-1.1.13-r1/work/ieee80211-1.1.13/net/ieee80211.h: At top level:
/var/tmp/portage/ieee80211-1.1.13-r1/work/ieee80211-1.1.13/net/ieee80211.h:1261: error: parse error before '*' token
/var/tmp/portage/ieee80211-1.1.13-r1/work/ieee80211-1.1.13/net/ieee80211.h:1262: warning: return type defaults to `int'
/var/tmp/portage/ieee80211-1.1.13-r1/work/ieee80211-1.1.13/net/ieee80211.h: In function `ieee80211_get_payload':
/var/tmp/portage/ieee80211-1.1.13-r1/work/ieee80211-1.1.13/net/ieee80211.h:1263: warning: implicit declaration of function `le16_to_cpu'
/var/tmp/portage/ieee80211-1.1.13-r1/work/ieee80211-1.1.13/net/ieee80211.h:1263: error: dereferencing pointer to incomplete type
/var/tmp/portage/ieee80211-1.1.13-r1/work/ieee80211-1.1.13/net/ieee80211.h:1265: error: dereferencing pointer to incomplete type
/var/tmp/portage/ieee80211-1.1.13-r1/work/ieee80211-1.1.13/net/ieee80211.h:1267: error: dereferencing pointer to incomplete type
/var/tmp/portage/ieee80211-1.1.13-r1/work/ieee80211-1.1.13/net/ieee80211.h:1269: error: dereferencing pointer to incomplete type
/var/tmp/portage/ieee80211-1.1.13-r1/work/ieee80211-1.1.13/net/ieee80211.h:1271: error: dereferencing pointer to incomplete type
/var/tmp/portage/ieee80211-1.1.13-r1/work/ieee80211-1.1.13/net/ieee80211.h: At top level:
/var/tmp/portage/ieee80211-1.1.13-r1/work/ieee80211-1.1.13/net/ieee80211.h:1276: error: parse error before "rate"
/var/tmp/portage/ieee80211-1.1.13-r1/work/ieee80211-1.1.13/net/ieee80211.h:1277: warning: function declaration isn't a prototype
/var/tmp/portage/ieee80211-1.1.13-r1/work/ieee80211-1.1.13/net/ieee80211.h:1292: error: parse error before "rate"
/var/tmp/portage/ieee80211-1.1.13-r1/work/ieee80211-1.1.13/net/ieee80211.h:1293: warning: function declaration isn't a prototype
/var/tmp/portage/ieee80211-1.1.13-r1/work/ieee80211-1.1.13/net/ieee80211.h:1332: error: parse error before "u8"
/var/tmp/portage/ieee80211-1.1.13-r1/work/ieee80211-1.1.13/net/ieee80211.h:1332: warning: function declaration isn't a prototype
/var/tmp/portage/ieee80211-1.1.13-r1/work/ieee80211-1.1.13/net/ieee80211.h:1334: error: parse error before "u8"
/var/tmp/portage/ieee80211-1.1.13-r1/work/ieee80211-1.1.13/net/ieee80211.h:1334: warning: function declaration isn't a prototype
/var/tmp/portage/ieee80211-1.1.13-r1/work/ieee80211-1.1.13/net/ieee80211.h:1335: error: parse error before "ieee80211_freq_to_channel"
/var/tmp/portage/ieee80211-1.1.13-r1/work/ieee80211-1.1.13/net/ieee80211.h:1335: error: parse error before "u32"
/var/tmp/portage/ieee80211-1.1.13-r1/work/ieee80211-1.1.13/net/ieee80211.h:1335: warning: type defaults to `int' in declaration of `ieee80211_freq_to_channel'
/var/tmp/portage/ieee80211-1.1.13-r1/work/ieee80211-1.1.13/net/ieee80211.h:1335: warning: function declaration isn't a prototype
/var/tmp/portage/ieee80211-1.1.13-r1/work/ieee80211-1.1.13/net/ieee80211.h:1335: warning: data definition has no type or storage class
/var/tmp/portage/ieee80211-1.1.13-r1/work/ieee80211-1.1.13/net/ieee80211.h:1336: error: parse error before "ieee80211_get_channel_flags"
/var/tmp/portage/ieee80211-1.1.13-r1/work/ieee80211-1.1.13/net/ieee80211.h:1337: error: parse error before "u8"
/var/tmp/portage/ieee80211-1.1.13-r1/work/ieee80211-1.1.13/net/ieee80211.h:1337: warning: type defaults to `int' in declaration of `ieee80211_get_channel_flags'/var/tmp/portage/ieee80211-1.1.13-r1/work/ieee80211-1.1.13/net/ieee80211.h:1337: warning: function declaration isn't a prototype
/var/tmp/portage/ieee80211-1.1.13-r1/work/ieee80211-1.1.13/net/ieee80211.h:1337: warning: data definition has no type or storage class
/var/tmp/portage/ieee80211-1.1.13-r1/work/ieee80211-1.1.13/net/ieee80211.h:1340: error: parse error before "u8"
/var/tmp/portage/ieee80211-1.1.13-r1/work/ieee80211-1.1.13/net/ieee80211.h:1340: warning: function declaration isn't a prototype
/var/tmp/portage/ieee80211-1.1.13-r1/work/ieee80211-1.1.13/net/ieee80211.h: In function `ieee80211_increment_scans':
/var/tmp/portage/ieee80211-1.1.13-r1/work/ieee80211-1.1.13/net/ieee80211.h:1369: error: dereferencing pointer to incomplete type
/var/tmp/portage/ieee80211-1.1.13-r1/work/ieee80211-1.1.13/net/ieee80211.h: In function `ieee80211_get_scans':
/var/tmp/portage/ieee80211-1.1.13-r1/work/ieee80211-1.1.13/net/ieee80211.h:1374: error: dereferencing pointer to incomplete type
/var/tmp/portage/ieee80211-1.1.13-r1/work/ieee80211-1.1.13/ieee80211_module.c: In function `ieee80211_networks_allocate':
/var/tmp/portage/ieee80211-1.1.13-r1/work/ieee80211-1.1.13/ieee80211_module.c:67: error: dereferencing pointer to incomplete type
/var/tmp/portage/ieee80211-1.1.13-r1/work/ieee80211-1.1.13/ieee80211_module.c:70: error: dereferencing pointer to incomplete type
/var/tmp/portage/ieee80211-1.1.13-r1/work/ieee80211-1.1.13/ieee80211_module.c:71: error: invalid application of `sizeof' to incomplete type `ieee80211_network'
/var/tmp/portage/ieee80211-1.1.13-r1/work/ieee80211-1.1.13/ieee80211_module.c:73: error: dereferencing pointer to incomplete type
/var/tmp/portage/ieee80211-1.1.13-r1/work/ieee80211-1.1.13/ieee80211_module.c:75: error: dereferencing pointer to incomplete type
/var/tmp/portage/ieee80211-1.1.13-r1/work/ieee80211-1.1.13/ieee80211_module.c:76: error: `ENOMEM' undeclared (first use in this function)
/var/tmp/portage/ieee80211-1.1.13-r1/work/ieee80211-1.1.13/ieee80211_module.c:79: error: dereferencing pointer to incomplete type
/var/tmp/portage/ieee80211-1.1.13-r1/work/ieee80211-1.1.13/ieee80211_module.c:80: error: invalid application of `sizeof' to incomplete type `ieee80211_network'
/var/tmp/portage/ieee80211-1.1.13-r1/work/ieee80211-1.1.13/ieee80211_module.c: In function `ieee80211_network_reset':
/var/tmp/portage/ieee80211-1.1.13-r1/work/ieee80211-1.1.13/ieee80211_module.c:90: error: dereferencing pointer to incomplete type
/var/tmp/portage/ieee80211-1.1.13-r1/work/ieee80211-1.1.13/ieee80211_module.c:91: error: dereferencing pointer to incomplete type
/var/tmp/portage/ieee80211-1.1.13-r1/work/ieee80211-1.1.13/ieee80211_module.c:92: error: dereferencing pointer to incomplete type
/var/tmp/portage/ieee80211-1.1.13-r1/work/ieee80211-1.1.13/ieee80211_module.c: In function `ieee80211_networks_free':
/var/tmp/portage/ieee80211-1.1.13-r1/work/ieee80211-1.1.13/ieee80211_module.c:100: error: dereferencing pointer to incomplete type
/var/tmp/portage/ieee80211-1.1.13-r1/work/ieee80211-1.1.13/ieee80211_module.c:104: error: dereferencing pointer to incomplete type
/var/tmp/portage/ieee80211-1.1.13-r1/work/ieee80211-1.1.13/ieee80211_module.c:105: error: dereferencing pointer to incomplete type
/var/tmp/portage/ieee80211-1.1.13-r1/work/ieee80211-1.1.13/ieee80211_module.c:107: error: dereferencing pointer to incomplete type
/var/tmp/portage/ieee80211-1.1.13-r1/work/ieee80211-1.1.13/ieee80211_module.c:108: error: dereferencing pointer to incomplete type
/var/tmp/portage/ieee80211-1.1.13-r1/work/ieee80211-1.1.13/ieee80211_module.c: In function `ieee80211_networks_initialize':
/var/tmp/portage/ieee80211-1.1.13-r1/work/ieee80211-1.1.13/ieee80211_module.c:115: error: dereferencing pointer to incomplete type
/var/tmp/portage/ieee80211-1.1.13-r1/work/ieee80211-1.1.13/ieee80211_module.c:116: error: dereferencing pointer to incomplete type
/var/tmp/portage/ieee80211-1.1.13-r1/work/ieee80211-1.1.13/ieee80211_module.c:118: error: dereferencing pointer to incomplete type
/var/tmp/portage/ieee80211-1.1.13-r1/work/ieee80211-1.1.13/ieee80211_module.c:119: error: dereferencing pointer to incomplete type
/var/tmp/portage/ieee80211-1.1.13-r1/work/ieee80211-1.1.13/ieee80211_module.c: In function `alloc_ieee80211':
/var/tmp/portage/ieee80211-1.1.13-r1/work/ieee80211-1.1.13/ieee80211_module.c:130: error: invalid application of `sizeof' to incomplete type `ieee80211_device'
/var/tmp/portage/ieee80211-1.1.13-r1/work/ieee80211-1.1.13/ieee80211_module.c:136: error: dereferencing pointer to incomplete type
/var/tmp/portage/ieee80211-1.1.13-r1/work/ieee80211-1.1.13/ieee80211_module.c:138: error: dereferencing pointer to incomplete type
/var/tmp/portage/ieee80211-1.1.13-r1/work/ieee80211-1.1.13/ieee80211_module.c:148: error: dereferencing pointer to incomplete type
/var/tmp/portage/ieee80211-1.1.13-r1/work/ieee80211-1.1.13/ieee80211_module.c:149: error: dereferencing pointer to incomplete type
/var/tmp/portage/ieee80211-1.1.13-r1/work/ieee80211-1.1.13/ieee80211_module.c:150: error: dereferencing pointer to incomplete type
/var/tmp/portage/ieee80211-1.1.13-r1/work/ieee80211-1.1.13/ieee80211_module.c:150: error: `HZ' undeclared (first use in this function)
/var/tmp/portage/ieee80211-1.1.13-r1/work/ieee80211-1.1.13/ieee80211_module.c:151: error: dereferencing pointer to incomplete type
/var/tmp/portage/ieee80211-1.1.13-r1/work/ieee80211-1.1.13/ieee80211_module.c:154: error: dereferencing pointer to incomplete type
/var/tmp/portage/ieee80211-1.1.13-r1/work/ieee80211-1.1.13/ieee80211_module.c:155: error: dereferencing pointer to incomplete type
/var/tmp/portage/ieee80211-1.1.13-r1/work/ieee80211-1.1.13/ieee80211_module.c:156: error: dereferencing pointer to incomplete type
/var/tmp/portage/ieee80211-1.1.13-r1/work/ieee80211-1.1.13/ieee80211_module.c:163: error: dereferencing pointer to incomplete type
/var/tmp/portage/ieee80211-1.1.13-r1/work/ieee80211-1.1.13/ieee80211_module.c:164: error: dereferencing pointer to incomplete type
/var/tmp/portage/ieee80211-1.1.13-r1/work/ieee80211-1.1.13/ieee80211_module.c:166: error: dereferencing pointer to incomplete type
/var/tmp/portage/ieee80211-1.1.13-r1/work/ieee80211-1.1.13/ieee80211_module.c:167: error: dereferencing pointer to incomplete type
/var/tmp/portage/ieee80211-1.1.13-r1/work/ieee80211-1.1.13/ieee80211_module.c:168: error: dereferencing pointer to incomplete type
/var/tmp/portage/ieee80211-1.1.13-r1/work/ieee80211-1.1.13/ieee80211_module.c:169: error: dereferencing pointer to incomplete type
/var/tmp/portage/ieee80211-1.1.13-r1/work/ieee80211-1.1.13/ieee80211_module.c:170: error: dereferencing pointer to incomplete type
/var/tmp/portage/ieee80211-1.1.13-r1/work/ieee80211-1.1.13/ieee80211_module.c:172: error: dereferencing pointer to incomplete type
/var/tmp/portage/ieee80211-1.1.13-r1/work/ieee80211-1.1.13/ieee80211_module.c:172: error: parse error before '{' token
/var/tmp/portage/ieee80211-1.1.13-r1/work/ieee80211-1.1.13/ieee80211_module.c:174: error: dereferencing pointer to incomplete type
/var/tmp/portage/ieee80211-1.1.13-r1/work/ieee80211-1.1.13/ieee80211_module.c:175: error: dereferencing pointer to incomplete type
/var/tmp/portage/ieee80211-1.1.13-r1/work/ieee80211-1.1.13/ieee80211_module.c:176: error: dereferencing pointer to incomplete type
/var/tmp/portage/ieee80211-1.1.13-r1/work/ieee80211-1.1.13/ieee80211_module.c: In function `free_ieee80211':
/var/tmp/portage/ieee80211-1.1.13-r1/work/ieee80211-1.1.13/ieee80211_module.c:193: error: dereferencing pointer to incomplete type
/var/tmp/portage/ieee80211-1.1.13-r1/work/ieee80211-1.1.13/ieee80211_module.c:197: error: dereferencing pointer to incomplete type
/var/tmp/portage/ieee80211-1.1.13-r1/work/ieee80211-1.1.13/ieee80211_module.c:199: error: dereferencing pointer to incomplete type
/var/tmp/portage/ieee80211-1.1.13-r1/work/ieee80211-1.1.13/ieee80211_module.c:200: error: dereferencing pointer to incomplete type
/var/tmp/portage/ieee80211-1.1.13-r1/work/ieee80211-1.1.13/ieee80211_module.c:200: error: dereferencing pointer to incomplete type
/var/tmp/portage/ieee80211-1.1.13-r1/work/ieee80211-1.1.13/ieee80211_module.c:201: error: dereferencing pointer to incomplete type
/var/tmp/portage/ieee80211-1.1.13-r1/work/ieee80211-1.1.13/ieee80211_module.c:204: error: dereferencing pointer to incomplete type
/var/tmp/portage/ieee80211-1.1.13-r1/work/ieee80211-1.1.13/ieee80211_module.c: At top level:
/var/tmp/portage/ieee80211-1.1.13-r1/work/ieee80211-1.1.13/ieee80211_module.c:294: error: parse error before "u8"
/var/tmp/portage/ieee80211-1.1.13-r1/work/ieee80211-1.1.13/ieee80211_module.c:295: warning: function declaration isn't a prototype
/var/tmp/portage/ieee80211-1.1.13-r1/work/ieee80211-1.1.13/ieee80211_module.c: In function `escape_essid':
/var/tmp/portage/ieee80211-1.1.13-r1/work/ieee80211-1.1.13/ieee80211_module.c:297: warning: initialization from incompatible pointer type
/var/tmp/portage/ieee80211-1.1.13-r1/work/ieee80211-1.1.13/ieee80211_module.c:300: warning: passing arg 1 of `ieee80211_is_empty_essid' from incompatible pointer type
/var/tmp/portage/ieee80211-1.1.13-r1/work/ieee80211-1.1.13/ieee80211_module.c:305: error: parse error before numeric constant
/var/tmp/portage/ieee80211-1.1.13-r1/work/ieee80211-1.1.13/ieee80211_module.c:305: error: `_y' undeclared (first use in this function)
/var/tmp/portage/ieee80211-1.1.13-r1/work/ieee80211-1.1.13/ieee80211_module.c: At top level:
include/linux/elf.h:421: warning: array '_DYNAMIC' assumed to have one element
include/linux/aio.h:180: error: storage size of `wait' isn't known
include/linux/aio.h:191: error: storage size of `ring_info' isn't known
include/linux/sched.h:309: error: storage size of `mmap_sem' isn't known
include/linux/sched.h:355: error: storage size of `action' isn't known
include/linux/sched.h:378: error: storage size of `wait_chldexit' isn't known
include/linux/sched.h:384: error: storage size of `shared_pending' isn't known
include/linux/sched.h:404: error: storage size of `real_timer' isn't known
include/linux/sched.h:447: error: storage size of `rlim' isn't known
include/linux/sched.h:768: error: storage size of `start_time' isn't known
include/linux/sched.h:798: error: storage size of `thread' isn't known
include/linux/sched.h:811: error: storage size of `pending' isn't known
include/linux/stat.h:68: error: storage size of `atime' isn't known
include/linux/stat.h:69: error: storage size of `mtime' isn't known
include/linux/stat.h:70: error: storage size of `ctime' isn't known
include/linux/fs.h:284: error: storage size of `ia_atime' isn't known
include/linux/fs.h:285: error: storage size of `ia_mtime' isn't known
include/linux/fs.h:286: error: storage size of `ia_ctime' isn't known
include/linux/quota.h:220: error: storage size of `dq_wait_unused' isn't known
include/linux/quota.h:226: error: storage size of `dq_dqb' isn't known
include/linux/fs.h:400: error: storage size of `bd_sem' isn't known
include/linux/fs.h:401: error: storage size of `bd_mount_sem' isn't known
include/linux/fs.h:476: error: storage size of `i_atime' isn't known
include/linux/fs.h:477: error: storage size of `i_mtime' isn't known
include/linux/fs.h:478: error: storage size of `i_ctime' isn't known
include/linux/fs.h:485: error: storage size of `i_mutex' isn't known
include/linux/fs.h:486: error: storage size of `i_alloc_sem' isn't known
include/linux/fs.h:492: error: storage size of `i_data' isn't known
include/linux/fs.h:512: error: storage size of `inotify_sem' isn't known
include/linux/fs.h:633: error: storage size of `f_owner' isn't known
include/linux/fs.h:820: error: storage size of `s_umount' isn't known
include/linux/fs.h:821: error: storage size of `s_lock' isn't known
include/linux/fs.h:840: error: storage size of `s_wait_unfrozen' isn't known
include/linux/fs.h:850: error: storage size of `s_vfs_rename_sem' isn't known
include/linux/skbuff.h:142: error: storage size of `frags' isn't known
{standard input}: Assembler messages:
{standard input}:512: Error: symbol `seq' is already defined
{standard input}:560: Error: symbol `sem_nsems' is already defined
{standard input}:1605: Error: symbol `flags' is already defined
{standard input}:1921: Error: symbol `files' is already defined
include/linux/device.h:227: error: storage size of `uevent_attr' isn't known
include/linux/netdevice.h:504: error: storage size of `class_dev' isn't known
include/linux/in6.h:58: error: storage size of `sin6_addr' isn't known
include/linux/seq_file.h:22: error: storage size of `sem' isn't known
include/net/neighbour.h:139: error: storage size of `arp_queue' isn't known
include/net/neighbour.h:181: error: storage size of `parms' isn't known
include/net/neighbour.h:190: error: storage size of `proxy_queue' isn't known
{standard input}:2239: Error: symbol `blocks' is already defined
{standard input}:2431: Error: symbol `d_flags' is already defined
{standard input}:2988: Error: symbol `inotify_watches' is already defined
{standard input}:3126: Error: symbol `flags' is already defined
{standard input}:3202: Error: symbol `s_type' is already defined
{standard input}:3412: Error: symbol `mmap' is already defined
{standard input}:3454: Error: symbol `lock' is already defined
{standard input}:3525: Error: symbol `data' is already defined
{standard input}:3615: Error: symbol `truncate_count' is already defined
{standard input}:4141: Error: symbol `lock' is already defined
{standard input}:4231: Error: symbol `data' is already defined
{standard input}:4237: Error: symbol `tail' is already defined
{standard input}:4321: Error: symbol `parent' is already defined
{standard input}:4327: Error: symbol `release' is already defined
include/net/sock.h:81: error: storage size of `wq' isn't known
include/net/sock.h:206: error: storage size of `sk_receive_queue' isn't known
include/net/sock.h:207: error: storage size of `sk_write_queue' isn't known
include/net/sock.h:224: error: storage size of `sk_error_queue' isn't known
include/net/sock.h:232: error: storage size of `sk_peercred' isn't known
include/net/sock.h:239: error: storage size of `sk_stamp' isn't known
include/net/inet_sock.h:144: error: storage size of `fl' isn't known
include/linux/tcp.h:267: error: storage size of `rx_opt' isn't known
include/linux/tcp.h:279: error: storage size of `out_of_order_queue' isn't knowninclude/linux/tcp.h:288: error: storage size of `duplicate_sack' isn't known
include/linux/tcp.h:289: error: storage size of `selective_acks' isn't known
include/linux/tcp.h:291: error: storage size of `recv_sack_cache' isn't known
include/linux/wireless.h:754: error: storage size of `channel_list' isn't known
include/linux/wireless.h:885: error: storage size of `qual' isn't known
include/linux/wireless.h:847: error: storage size of `discard' isn't known
include/linux/wireless.h:848: error: storage size of `miss' isn't known
include/linux/wireless.h:881: error: storage size of `retry' isn't known
include/linux/wireless.h:883: error: storage size of `encoding' isn't known
include/linux/wireless.h:884: error: storage size of `power' isn't known
include/linux/wireless.h:890: error: storage size of `param' isn't known
include/linux/wireless.h:891: error: storage size of `data' isn't known
include/linux/wireless.h:951: error: storage size of `max_qual' isn't known
include/linux/wireless.h:961: error: storage size of `avg_qual' isn't known
include/linux/wireless.h:1012: error: storage size of `freq' isn't known
include/linux/wireless.h:1045: error: storage size of `u' isn't known
{standard input}:4362: Error: symbol `release' is already defined
{standard input}:4523: Error: symbol `destructor' is already defined
{standard input}:4529: Error: symbol `open' is already defined
{standard input}:4637: Error: symbol `dev' is already defined
{standard input}:4661: Error: symbol `func' is already defined
{standard input}:4667: Error: symbol `data' is already defined
{standard input}:4907: Error: symbol `nlink' is already defined
{standard input}:4913: Error: symbol `size' is already defined
{standard input}:4937: Error: symbol `owner' is already defined
{standard input}:4943: Error: symbol `next' is already defined
{standard input}:4949: Error: symbol `parent' is already defined
{standard input}:4961: Error: symbol `data' is already defined
{standard input}:4991: Error: symbol `seq' is already defined
{standard input}:5614: Error: symbol `u' is already defined
{standard input}:5980: Error: symbol `index' is already defined
{standard input}:6148: Error: symbol `id' is already defined
{standard input}:6262: Error: symbol `child' is already defined
{standard input}:6268: Error: symbol `error' is already defined
{standard input}:6346: Error: symbol `ops' is already defined
{standard input}:6357: Error: symbol `owner' is already defined
/var/tmp/portage/ieee80211-1.1.13-r1/work/ieee80211-1.1.13/net/ieee80211.h:676: error: storage size of `channel_switch' isn't known
/var/tmp/portage/ieee80211-1.1.13-r1/work/ieee80211-1.1.13/net/ieee80211.h:803: error: storage size of `ac_params_record' isn't known
/var/tmp/portage/ieee80211-1.1.13-r1/work/ieee80211-1.1.13/net/ieee80211.h:922: error: storage size of `qos_data' isn't known
/var/tmp/portage/ieee80211-1.1.13-r1/work/ieee80211-1.1.13/net/ieee80211.h:925: error: storage size of `stats' isn't known
/var/tmp/portage/ieee80211-1.1.13-r1/work/ieee80211-1.1.13/net/ieee80211.h:927: error: storage size of `rates' isn't known
/var/tmp/portage/ieee80211-1.1.13-r1/work/ieee80211-1.1.13/net/ieee80211.h:929: error: storage size of `rates_ex' isn't known
/var/tmp/portage/ieee80211-1.1.13-r1/work/ieee80211-1.1.13/net/ieee80211.h:944: error: storage size of `tim' isn't known
/var/tmp/portage/ieee80211-1.1.13-r1/work/ieee80211-1.1.13/net/ieee80211.h:952: error: storage size of `tpc_report' isn't known
/var/tmp/portage/ieee80211-1.1.13-r1/work/ieee80211-1.1.13/net/ieee80211.h:959: error: storage size of `csa' isn't known
/var/tmp/portage/ieee80211-1.1.13-r1/work/ieee80211-1.1.13/net/ieee80211.h:962: error: storage size of `quiet' isn't known
/var/tmp/portage/ieee80211-1.1.13-r1/work/ieee80211-1.1.13/net/ieee80211.h:1012: error: storage size of `bg' isn't known
/var/tmp/portage/ieee80211-1.1.13-r1/work/ieee80211-1.1.13/net/ieee80211.h:1013: error: storage size of `a' isn't known
/var/tmp/portage/ieee80211-1.1.13-r1/work/ieee80211-1.1.13/net/ieee80211.h:1076: error: storage size of `frag_cache' isn't known
{standard input}:6693: Error: symbol `owner' is already defined
{standard input}:6699: Error: symbol `name' is already defined
{standard input}:6711: Error: symbol `stats' is already defined
{standard input}:6997: Error: symbol `id' is already defined
{standard input}:7903: Error: symbol `key' is already defined
{standard input}:8172: Error: symbol `name' is already defined
{standard input}:8202: Error: symbol `private' is already defined
{standard input}:8268: Error: symbol `signal' is already defined
{standard input}:8304: Error: symbol `len' is already defined
{standard input}:8394: Error: symbol `data' is already defined
{standard input}:8561: Error: symbol `tx_op_limit' is already defined
{/var/tmp/portage/ieee80211-1.1.13-r1/work/ieee80211-1.1.13/net/ieee80211.h:1004: warning: type defaults to `int' in declaration of `flags'
/var/tmp/portage/ieee80211-1.1.13-r1/work/ieee80211-1.1.13/net/ieee80211.h:1004: warning: data definition has no type or storage class
/var/tmp/portage/ieee80211-1.1.13-r1/work/ieee80211-1.1.13/net/ieee80211.h:1005: error: parse error before "max_power"
/var/tmp/portage/ieee80211-1.1.13-r1/work/ieee80211-1.1.13/net/ieee80211.h:1005: warning: type defaults to `int' in declaration of `max_power'
/var/tmp/portage/ieee80211-1.1.13-r1/work/ieee80211-1.1.13/net/ieee80211.h:1005: warning: data definition has no type or storage class
/var/tmp/portage/ieee80211-1.1.13-r1/work/ieee80211-1.1.13/net/ieee80211.h:1009: error: parse error before "u8"
/var/tmp/portage/ieee80211-1.1.13-r1/work/ieee80211-1.1.13/net/ieee80211.h:1009: warning: no semicolon at end of struct or union
/var/tmp/portage/ieee80211-1.1.13-r1/work/ieee80211-1.1.13/net/ieee80211.h:1010: warning: type defaults to `int' in declaration of `bg_channels'
/var/tmp/portage/ieee80211-1.1.13-r1/work/ieee80211-1.1.13/net/ieee80211.h:1010: warning: data definition has no type or storage class
/var/tmp/portage/ieee80211-1.1.13-r1/work/ieee80211-1.1.13/net/ieee80211.h:1011: error: parse error before "a_channels"
/var/tmp/portage/ieee80211-1.1.13-r1/work/ieee80211-1.1.13/net/ieee80211.h:1011: warning: type defaults to `int' in declaration of `a_channels'
/var/tmp/portage/ieee80211-1.1.13-r1/work/ieee80211-1.1.13/net/ieee80211.h:1011: warning: data definition has no type or storage class
/var/tmp/portage/ieee80211-1.1.13-r1/work/ieee80211-1.1.13/net/ieee80211.h:1014: error: parse error before '}' token
/var/tmp/portage/ieee80211-1.1.13-r1/work/ieee80211-1.1.13/net/ieee80211.h:1018: error: field `sec' has incomplete type
/var/tmp/portage/ieee80211-1.1.13-r1/work/ieee80211-1.1.13/net/ieee80211.h:1024: error: field `geo' has incomplete type
/var/tmp/portage/ieee80211-1.1.13-r1/work/ieee80211-1.1.13/net/ieee80211.h:1036: error: parse error before "spinlock_t"
/var/tmp/portage/ieee80211-1.1.13-r1/work/ieee80211-1.1.13/net/ieee80211.h:1036: warning: no semicolon at end of struct or union
/var/tmp/portage/ieee80211-1.1.13-r1/work/ieee80211-1.1.13/net/ieee80211.h:1040: error: parse error before "config"
/var/tmp/portage/ieee80211-1.1.13-r1/work/ieee80211-1.1.13/net/ieee80211.h:1040: warning: type defaults to `int' in declaration of `config'
/var/tmp/portage/ieee80211-1.1.13-r1/work/ieee80211-1.1.13/net/ieee80211.h:1040: warning: data definition has no type or storage class
/var/tmp/portage/ieee80211-1.1.13-r1/work/ieee80211-1.1.13/net/ieee80211.h:1063: error: parse error before "wpa_ie_len"
/var/tmp/portage/ieee80211-1.1.13-r1/work/ieee80211-1.1.13/net/ieee80211.h:1063: warning: type defaults to `int' in declaration of `wpa_ie_len'
/var/tmp/portage/ieee80211-1.1.13-r1/work/ieee80211-1.1.13/net/ieee80211.h:1063: warning: data definition has no type or storage class
/var/tmp/portage/ieee80211-1.1.13-r1/work/ieee80211-1.1.13/net/ieee80211.h:1064: error: parse error before '*' token
/var/tmp/portage/ieee80211-1.1.13-r1/work/ieee80211-1.1.13/net/ieee80211.h:1064: warning: type defaults to `int' in declaration of `wpa_ie'
/var/tmp/portage/ieee80211-1.1.13-r1/work/ieee80211-1.1.13/net/ieee80211.h:1064: error: conflicting types for 'wpa_ie'
/var/tmp/portage/ieee80211-1.1.13-r1/work/ieee80211-1.1.13/net/ieee80211.h:940: error: previous declaration of 'wpa_ie' was here
/var/tmp/portage/ieee80211-1.1.13-r1/work/ieee80211-1.1.13/net/ieee80211.h:1064: warning: data definition has no type or storage class
/var/tmp/portage/ieee80211-1.1.13-r1/work/ieee80211-1.1.13/net/ieee80211.h:1078: error: parse error before "fts"
/var/tmp/portage/ieee80211-1.1.13-r1/work/ieee80211-1.1.13/net/ieee80211.h:1078: warning: type defaults to `int' in declaration of `fts'
/var/tmp/portage/ieee80211-1.1.13-r1/work/ieee80211-1.1.13/net/ieee80211.h:1078: warning: data definition has no type or storage class
/var/tmp/portage/ieee80211-1.1.13-r1/work/ieee80211-1.1.13/net/ieee80211.h:1079: error: parse error before "rts"
/var/tmp/portage/ieee80211-1.1.13-r1/work/ieee80211-1.1.13/net/ieee80211.h:1079: warning: type defaults to `int' in declaration of `rts'
/var/tmp/portage/ieee80211-1.1.13-r1/work/ieee80211-1.1.13/net/ieee80211.h:1079: warning: data definition has no type or storage class
/var/tmp/portage/ieee80211-1.1.13-r1/work/ieee80211-1.1.13/net/ieee80211.h:1082: error: parse error before "bssid"
/var/tmp/portage/ieee80211-1.1.13-r1/work/ieee80211-1.1.13/net/ieee80211.h:1082: warning: type defaults to `int' in declaration of `bssid'
/var/tmp/portage/ieee80211-1.1.13-r1/work/ieee80211-1.1.13/net/ieee80211.h:1082: error: conflicting types for 'bssid'
include/linux/wireless.h:833: error: previous declaration of 'bssid' was here
/var/tmp/portage/ieee80211-1.1.13-r1/work/ieee80211-1.1.13/net/ieee80211.h:1082: warning: data definition has no type or storage class
/var/tmp/portage/ieee80211-1.1.13-r1/work/ieee80211-1.1.13/net/ieee80211.h:1084: error: conflicting types for 'state'
include/linux/hrtimer.h:66: error: previous declaration of 'state' was here
/var/tmp/portage/ieee80211-1.1.13-r1/work/ieee80211-1.1.13/net/ieee80211.h:1098: error: conflicting types for 'hard_start_xmit'
include/linux/netdevice.h:412: error: previous declaration of 'hard_start_xmit' was here
/var/tmp/portage/ieee80211-1.1.13-r1/work/ieee80211-1.1.13/net/ieee80211.h:1103: error: parse error before "u16"
/var/tmp/portage/ieee80211-1.1.13-r1/work/ieee80211-1.1.13/net/ieee80211.h:1103: warning: function declaration isn't a prototype
/var/tmp/portage/ieee80211-1.1.13-r1/work/ieee80211-1.1.13/net/ieee80211.h:1136: error: parse error before "priv"
/var/tmp/portage/ieee80211-1.1.13-r1/work/ieee80211-1.1.13/net/ieee80211.h:1136: warning: type defaults to `int' in declaration of `priv'
/var/tmp/portage/ieee80211-1.1.13-r1/work/ieee80211-1.1.13/net/ieee80211.h:1136: error: conflicting types for 'priv'
include/linux/netdevice.h:410: error: previous declaration of 'priv' was here
/var/tmp/portage/ieee80211-1.1.13-r1/work/ieee80211-1.1.13/net/ieee80211.h:1136: warning: data definition has no type or storage class
/var/tmp/portage/ieee80211-1.1.13-r1/work/ieee80211-1.1.13/net/ieee80211.h:1137: error: parse error before '}' token
In file included from /var/tmp/portage/ieee80211-1.1.13-r1/work/ieee80211-1.1.13/ieee80211_module.c:53:
/var/tmp/portage/ieee80211-1.1.13-r1/work/ieee80211-1.1.13/net/ieee80211.h: In function `ieee80211_priv':
/var/tmp/portage/ieee80211-1.1.13-r1/work/ieee80211-1.1.13/net/ieee80211.h:1180: error: dereferencing pointer to incomplete type
/var/tmp/portage/ieee80211-1.1.13-r1/work/ieee80211-1.1.13/net/ieee80211.h: In function `ieee80211_is_valid_mode':
/var/tmp/portage/ieee80211-1.1.13-r1/work/ieee80211-1.1.13/net/ieee80211.h:1216: error: dereferencing pointer to incomplete type
/var/tmp/portage/ieee80211-1.1.13-r1/work/ieee80211-1.1.13/net/ieee80211.h:1217: error: dereferencing pointer to incomplete type
/var/tmp/portage/ieee80211-1.1.13-r1/work/ieee80211-1.1.13/net/ieee80211.h:1221: error: dereferencing pointer to incomplete type
/var/tmp/portage/ieee80211-1.1.13-r1/work/ieee80211-1.1.13/net/ieee80211.h:1222: error: dereferencing pointer to incomplete type
/var/tmp/portage/ieee80211-1.1.13-r1/work/ieee80211-1.1.13/net/ieee80211.h:1226: error: dereferencing pointer to incomplete type
/var/tmp/portage/ieee80211-1.1.13-r1/work/ieee80211-1.1.13/net/ieee80211.h:1227: error: dereferencing pointer to incomplete type
/var/tmp/portage/ieee80211-1.1.13-r1/work/ieee80211-1.1.13/net/ieee80211.h: At top level:
/var/tmp/portage/ieee80211-1.1.13-r1/work/ieee80211-1.1.13/net/ieee80211.h:1233: error: parse error before "fc"
/var/tmp/portage/ieee80211-1.1.13-r1/work/ieee80211-1.1.13/net/ieee80211.h:1234: warning: function declaration isn't a prototype
/var/tmp/portage/ieee80211-1.1.13-r1/work/ieee80211-1.1.13/net/ieee80211.h: In function `ieee80211_get_hdrlen':
/var/tmp/portage/ieee80211-1.1.13-r1/work/ieee80211-1.1.13/net/ieee80211.h:1236: error: `u16' undeclared (first use in this function)
/var/tmp/portage/ieee80211-1.1.13-r1/work/ieee80211-1.1.13/net/ieee80211.h:1236: error: parse error before "stype"
/var/tmp/portage/ieee80211-1.1.13-r1/work/ieee80211-1.1.13/net/ieee80211.h:1238: error: `fc' undeclared (first use in this function)
/var/tmp/portage/ieee80211-1.1.13-r1/work/ieee80211-1.1.13/net/ieee80211.h:1242: error: `stype' undeclared (first use in this function)
/var/tmp/portage/ieee80211-1.1.13-r1/work/ieee80211-1.1.13/net/ieee80211.h: At top level:
/var/tmp/portage/ieee80211-1.1.13-r1/work/ieee80211-1.1.13/net/ieee80211.h:1261: error: parse error before '*' token
/var/tmp/portage/ieee80211-1.1.13-r1/work/ieee80211-1.1.13/net/ieee80211.h:1262: warning: return type defaults to `int'
/var/tmp/portage/ieee80211-1.1.13-r1/work/ieee80211-1.1.13/net/ieee80211.h: In function `ieee80211_get_payload':
/var/tmp/portage/ieee80211-1.1.13-r1/work/ieee80211-1.1.13/net/ieee80211.h:1263: warning: implicit declaration of function `le16_to_cpu'
/var/tmp/portage/ieee80211-1.1.13-r1/work/ieee80211-1.1.13/net/ieee80211.h:1263: error: dereferencing pointer to incomplete type
/var/tmp/portage/ieee80211-1.1.13-r1/work/ieee80211-1.1.13/net/ieee80211.h:1265: error: dereferencing pointer to incomplete type
/var/tmp/portage/ieee80211-1.1.13-r1/work/ieee80211-1.1.13/net/ieee80211.h:1267: error: dereferencing pointer to incomplete type
/var/tmp/portage/ieee80211-1.1.13-r1/work/ieee80211-1.1.13/net/ieee80211.h:1269: error: dereferencing pointer to incomplete type
/var/tmp/portage/ieee80211-1.1.13-r1/work/ieee80211-1.1.13/net/ieee80211.h:1271: error: dereferencing pointer to incomplete type
/var/tmp/portage/ieee80211-1.1.13-r1/work/ieee80211-1.1.13/net/ieee80211.h: At top level:
/var/tmp/portage/ieee80211-1.1.13-r1/work/ieee80211-1.1.13/net/ieee80211.h:1276: error: parse error before "rate"
/var/tmp/portage/ieee80211-1.1.13-r1/work/ieee80211-1.1.13/net/ieee80211.h:1277: warning: function declaration isn't a prototype
/var/tmp/portage/ieee80211-1.1.13-r1/work/ieee80211-1.1.13/net/ieee80211.h:1292: error: parse error before "rate"
/var/tmp/portage/ieee80211-1.1.13-r1/work/ieee80211-1.1.13/net/ieee80211.h:1293: warning: function declaration isn't a prototype
/var/tmp/portage/ieee80211-1.1.13-r1/work/ieee80211-1.1.13/net/ieee80211.h:1332: error: parse error before "u8"
/var/tmp/portage/ieee80211-1.1.13-r1/work/ieee80211-1.1.13/net/ieee80211.h:1332: warning: function declaration isn't a prototype
/var/tmp/portage/ieee80211-1.1.13-r1/work/ieee80211-1.1.13/net/ieee80211.h:1334: error: parse error before "u8"
/var/tmp/portage/ieee80211-1.1.13-r1/work/ieee80211-1.1.13/net/ieee80211.h:1334: warning: function declaration isn't a prototype
/var/tmp/portage/ieee80211-1.1.13-r1/work/ieee80211-1.1.13/net/ieee80211.h:1335: error: parse error before "ieee80211_freq_to_channel"
/var/tmp/portage/ieee80211-1.1.13-r1/work/ieee80211-1.1.13/net/ieee80211.h:1335: error: parse error before "u32"
/var/tmp/portage/ieee80211-1.1.13-r1/work/ieee80211-1.1.13/net/ieee80211.h:1335: warning: type defaults to `int' in declaration of `ieee80211_freq_to_channel'
/var/tmp/portage/ieee80211-1.1.13-r1/work/ieee80211-1.1.13/net/ieee80211.h:1335: warning: function declaration isn't a prototype
/var/tmp/portage/ieee80211-1.1.13-r1/work/ieee80211-1.1.13/net/ieee80211.h:1335: warning: data definition has no type or storage class
/var/tmp/portage/ieee80211-1.1.13-r1/work/ieee80211-1.1.13/net/ieee80211.h:1336: error: parse error before "ieee80211_get_channel_flags"
/var/tmp/portage/ieee80211-1.1.13-r1/work/ieee80211-1.1.13/net/ieee80211.h:1337: error: parse error before "u8"
/var/tmp/portage/ieee80211-1.1.13-r1/work/ieee80211-1.1.13/net/ieee80211.h:1337: warning: type defaults to `int' in declaration of `ieee80211_get_channel_flags'/var/tmp/portage/ieee80211-1.1.13-r1/work/ieee80211-1.1.13/net/ieee80211.h:1337: warning: function declaration isn't a prototype
/var/tmp/portage/ieee80211-1.1.13-r1/work/ieee80211-1.1.13/net/ieee80211.h:1337: warning: data definition has no type or storage class
/var/tmp/portage/ieee80211-1.1.13-r1/work/ieee80211-1.1.13/net/ieee80211.h:1340: error: parse error before "u8"
/var/tmp/portage/ieee80211-1.1.13-r1/work/ieee80211-1.1.13/net/ieee80211.h:1340: warning: function declaration isn't a prototype
/var/tmp/portage/ieee80211-1.1.13-r1/work/ieee80211-1.1.13/net/ieee80211.h: In function `ieee80211_increment_scans':
/var/tmp/portage/ieee80211-1.1.13-r1/work/ieee80211-1.1.13/net/ieee80211.h:1369: error: dereferencing pointer to incomplete type
/var/tmp/portage/ieee80211-1.1.13-r1/work/ieee80211-1.1.13/net/ieee80211.h: In function `ieee80211_get_scans':
/var/tmp/portage/ieee80211-1.1.13-r1/work/ieee80211-1.1.13/net/ieee80211.h:1374: error: dereferencing pointer to incomplete type
/var/tmp/portage/ieee80211-1.1.13-r1/work/ieee80211-1.1.13/ieee80211_module.c: In function `ieee80211_networks_allocate':
/var/tmp/portage/ieee80211-1.1.13-r1/work/ieee80211-1.1.13/ieee80211_module.c:67: error: dereferencing pointer to incomplete type
/var/tmp/portage/ieee80211-1.1.13-r1/work/ieee80211-1.1.13/ieee80211_module.c:70: error: dereferencing pointer to incomplete type
/var/tmp/portage/ieee80211-1.1.13-r1/work/ieee80211-1.1.13/ieee80211_module.c:71: error: invalid application of `sizeof' to incomplete type `ieee80211_network'
/var/tmp/portage/ieee80211-1.1.13-r1/work/ieee80211-1.1.13/ieee80211_module.c:73: error: dereferencing pointer to incomplete type
/var/tmp/portage/ieee80211-1.1.13-r1/work/ieee80211-1.1.13/ieee80211_module.c:75: error: dereferencing pointer to incomplete type
/var/tmp/portage/ieee80211-1.1.13-r1/work/ieee80211-1.1.13/ieee80211_module.c:76: error: `ENOMEM' undeclared (first use in this function)
/var/tmp/portage/ieee80211-1.1.13-r1/work/ieee80211-1.1.13/ieee80211_module.c:79: error: dereferencing pointer to incomplete type
/var/tmp/portage/ieee80211-1.1.13-r1/work/ieee80211-1.1.13/ieee80211_module.c:80: error: invalid application of `sizeof' to incomplete type `ieee80211_network'
/var/tmp/portage/ieee80211-1.1.13-r1/work/ieee80211-1.1.13/ieee80211_module.c: In function `ieee80211_network_reset':
/var/tmp/portage/ieee80211-1.1.13-r1/work/ieee80211-1.1.13/ieee80211_module.c:90: error: dereferencing pointer to incomplete type
/var/tmp/portage/ieee80211-1.1.13-r1/work/ieee80211-1.1.13/ieee80211_module.c:91: error: dereferencing pointer to incomplete type
/var/tmp/portage/ieee80211-1.1.13-r1/work/ieee80211-1.1.13/ieee80211_module.c:92: error: dereferencing pointer to incomplete type
/var/tmp/portage/ieee80211-1.1.13-r1/work/ieee80211-1.1.13/ieee80211_module.c: In function `ieee80211_networks_free':
/var/tmp/portage/ieee80211-1.1.13-r1/work/ieee80211-1.1.13/ieee80211_module.c:100: error: dereferencing pointer to incomplete type
/var/tmp/portage/ieee80211-1.1.13-r1/work/ieee80211-1.1.13/ieee80211_module.c:104: error: dereferencing pointer to incomplete type
/var/tmp/portage/ieee80211-1.1.13-r1/work/ieee80211-1.1.13/ieee80211_module.c:105: error: dereferencing pointer to incomplete type
/var/tmp/portage/ieee80211-1.1.13-r1/work/ieee80211-1.1.13/ieee80211_module.c:107: error: dereferencing pointer to incomplete type
/var/tmp/portage/ieee80211-1.1.13-r1/work/ieee80211-1.1.13/ieee80211_module.c:108: error: dereferencing pointer to incomplete type
/var/tmp/portage/ieee80211-1.1.13-r1/work/ieee80211-1.1.13/ieee80211_module.c: In function `ieee80211_networks_initialize':
/var/tmp/portage/ieee80211-1.1.13-r1/work/ieee80211-1.1.13/ieee80211_module.c:115: error: dereferencing pointer to incomplete type
/var/tmp/portage/ieee80211-1.1.13-r1/work/ieee80211-1.1.13/ieee80211_module.c:116: error: dereferencing pointer to incomplete type
/var/tmp/portage/ieee80211-1.1.13-r1/work/ieee80211-1.1.13/ieee80211_module.c:118: error: dereferencing pointer to incomplete type
/var/tmp/portage/ieee80211-1.1.13-r1/work/ieee80211-1.1.13/ieee80211_module.c:119: error: dereferencing pointer to incomplete type
/var/tmp/portage/ieee80211-1.1.13-r1/work/ieee80211-1.1.13/ieee80211_module.c: In function `alloc_ieee80211':
/var/tmp/portage/ieee80211-1.1.13-r1/work/ieee80211-1.1.13/ieee80211_module.c:130: error: invalid application of `sizeof' to incomplete type `ieee80211_device'
/var/tmp/portage/ieee80211-1.1.13-r1/work/ieee80211-1.1.13/ieee80211_module.c:136: error: dereferencing pointer to incomplete type
/var/tmp/portage/ieee80211-1.1.13-r1/work/ieee80211-1.1.13/ieee80211_module.c:138: error: dereferencing pointer to incomplete type
/var/tmp/portage/ieee80211-1.1.13-r1/work/ieee80211-1.1.13/ieee80211_module.c:148: error: dereferencing pointer to incomplete type
/var/tmp/portage/ieee80211-1.1.13-r1/work/ieee80211-1.1.13/ieee80211_module.c:149: error: dereferencing pointer to incomplete type
/var/tmp/portage/ieee80211-1.1.13-r1/work/ieee80211-1.1.13/ieee80211_module.c:150: error: dereferencing pointer to incomplete type
/var/tmp/portage/ieee80211-1.1.13-r1/work/ieee80211-1.1.13/ieee80211_module.c:150: error: `HZ' undeclared (first use in this function)
/var/tmp/portage/ieee80211-1.1.13-r1/work/ieee80211-1.1.13/ieee80211_module.c:151: error: dereferencing pointer to incomplete type
/var/tmp/portage/ieee80211-1.1.13-r1/work/ieee80211-1.1.13/ieee80211_module.c:154: error: dereferencing pointer to incomplete type
/var/tmp/portage/ieee80211-1.1.13-r1/work/ieee80211-1.1.13/ieee80211_module.c:155: error: dereferencing pointer to incomplete type
/var/tmp/portage/ieee80211-1.1.13-r1/work/ieee80211-1.1.13/ieee80211_module.c:156: error: dereferencing pointer to incomplete type
/var/tmp/portage/ieee80211-1.1.13-r1/work/ieee80211-1.1.13/ieee80211_module.c:163: error: dereferencing pointer to incomplete type
/var/tmp/portage/ieee80211-1.1.13-r1/work/ieee80211-1.1.13/ieee80211_module.c:164: error: dereferencing pointer to incomplete type
/var/tmp/portage/ieee80211-1.1.13-r1/work/ieee80211-1.1.13/ieee80211_module.c:166: error: dereferencing pointer to incomplete type
/var/tmp/portage/ieee80211-1.1.13-r1/work/ieee80211-1.1.13/ieee80211_module.c:167: error: dereferencing pointer to incomplete type
/var/tmp/portage/ieee80211-1.1.13-r1/work/ieee80211-1.1.13/ieee80211_module.c:168: error: dereferencing pointer to incomplete type
/var/tmp/portage/ieee80211-1.1.13-r1/work/ieee80211-1.1.13/ieee80211_module.c:169: error: dereferencing pointer to incomplete type
/var/tmp/portage/ieee80211-1.1.13-r1/work/ieee80211-1.1.13/ieee80211_module.c:170: error: dereferencing pointer to incomplete type
/var/tmp/portage/ieee80211-1.1.13-r1/work/ieee80211-1.1.13/ieee80211_module.c:172: error: dereferencing pointer to incomplete type
/var/tmp/portage/ieee80211-1.1.13-r1/work/ieee80211-1.1.13/ieee80211_module.c:172: error: parse error before '{' token
/var/tmp/portage/ieee80211-1.1.13-r1/work/ieee80211-1.1.13/ieee80211_module.c:174: error: dereferencing pointer to incomplete type
/var/tmp/portage/ieee80211-1.1.13-r1/work/ieee80211-1.1.13/ieee80211_module.c:175: error: dereferencing pointer to incomplete type
/var/tmp/portage/ieee80211-1.1.13-r1/work/ieee80211-1.1.13/ieee80211_module.c:176: error: dereferencing pointer to incomplete type
/var/tmp/portage/ieee80211-1.1.13-r1/work/ieee80211-1.1.13/ieee80211_module.c: In function `free_ieee80211':
/var/tmp/portage/ieee80211-1.1.13-r1/work/ieee80211-1.1.13/ieee80211_module.c:193: error: dereferencing pointer to incomplete type
/var/tmp/portage/ieee80211-1.1.13-r1/work/ieee80211-1.1.13/ieee80211_module.c:197: error: dereferencing pointer to incomplete type
/var/tmp/portage/ieee80211-1.1.13-r1/work/ieee80211-1.1.13/ieee80211_module.c:199: error: dereferencing pointer to incomplete type
/var/tmp/portage/ieee80211-1.1.13-r1/work/ieee80211-1.1.13/ieee80211_module.c:200: error: dereferencing pointer to incomplete type
/var/tmp/portage/ieee80211-1.1.13-r1/work/ieee80211-1.1.13/ieee80211_module.c:200: error: dereferencing pointer to incomplete type
/var/tmp/portage/ieee80211-1.1.13-r1/work/ieee80211-1.1.13/ieee80211_module.c:201: error: dereferencing pointer to incomplete type
/var/tmp/portage/ieee80211-1.1.13-r1/work/ieee80211-1.1.13/ieee80211_module.c:204: error: dereferencing pointer to incomplete type
/var/tmp/portage/ieee80211-1.1.13-r1/work/ieee80211-1.1.13/ieee80211_module.c: At top level:
/var/tmp/portage/ieee80211-1.1.13-r1/work/ieee80211-1.1.13/ieee80211_module.c:294: error: parse error before "u8"
/var/tmp/portage/ieee80211-1.1.13-r1/work/ieee80211-1.1.13/ieee80211_module.c:295: warning: function declaration isn't a prototype
/var/tmp/portage/ieee80211-1.1.13-r1/work/ieee80211-1.1.13/ieee80211_module.c: In function `escape_essid':
/var/tmp/portage/ieee80211-1.1.13-r1/work/ieee80211-1.1.13/ieee80211_module.c:297: warning: initialization from incompatible pointer type
/var/tmp/portage/ieee80211-1.1.13-r1/work/ieee80211-1.1.13/ieee80211_module.c:300: warning: passing arg 1 of `ieee80211_is_empty_essid' from incompatible pointer type
/var/tmp/portage/ieee80211-1.1.13-r1/work/ieee80211-1.1.13/ieee80211_module.c:305: error: parse error before numeric constant
/var/tmp/portage/ieee80211-1.1.13-r1/work/ieee80211-1.1.13/ieee80211_module.c:305: error: `_y' undeclared (first use in this function)
/var/tmp/portage/ieee80211-1.1.13-r1/work/ieee80211-1.1.13/ieee80211_module.c: At top level:
include/linux/elf.h:421: warning: array '_DYNAMIC' assumed to have one element
include/linux/aio.h:180: error: storage size of `wait' isn't known
include/linux/aio.h:191: error: storage size of `ring_info' isn't known
include/linux/sched.h:309: error: storage size of `mmap_sem' isn't known
include/linux/sched.h:355: error: storage size of `action' isn't known
include/linux/sched.h:378: error: storage size of `wait_chldexit' isn't known
include/linux/sched.h:384: error: storage size of `shared_pending' isn't known
include/linux/sched.h:404: error: storage size of `real_timer' isn't known
include/linux/sched.h:447: error: storage size of `rlim' isn't known
include/linux/sched.h:768: error: storage size of `start_time' isn't known
include/linux/sched.h:798: error: storage size of `thread' isn't known
include/linux/sched.h:811: error: storage size of `pending' isn't known
include/linux/stat.h:68: error: storage size of `atime' isn't known
include/linux/stat.h:69: error: storage size of `mtime' isn't known
include/linux/stat.h:70: error: storage size of `ctime' isn't known
include/linux/fs.h:284: error: storage size of `ia_atime' isn't known
include/linux/fs.h:285: error: storage size of `ia_mtime' isn't known
include/linux/fs.h:286: error: storage size of `ia_ctime' isn't known
include/linux/quota.h:220: error: storage size of `dq_wait_unused' isn't known
include/linux/quota.h:226: error: storage size of `dq_dqb' isn't known
include/linux/fs.h:400: error: storage size of `bd_sem' isn't known
include/linux/fs.h:401: error: storage size of `bd_mount_sem' isn't known
include/linux/fs.h:476: error: storage size of `i_atime' isn't known
include/linux/fs.h:477: error: storage size of `i_mtime' isn't known
include/linux/fs.h:478: error: storage size of `i_ctime' isn't known
include/linux/fs.h:485: error: storage size of `i_mutex' isn't known
include/linux/fs.h:486: error: storage size of `i_alloc_sem' isn't known
include/linux/fs.h:492: error: storage size of `i_data' isn't known
include/linux/fs.h:512: error: storage size of `inotify_sem' isn't known
include/linux/fs.h:633: error: storage size of `f_owner' isn't known
include/linux/fs.h:820: error: storage size of `s_umount' isn't known
include/linux/fs.h:821: error: storage size of `s_lock' isn't known
include/linux/fs.h:840: error: storage size of `s_wait_unfrozen' isn't known
include/linux/fs.h:850: error: storage size of `s_vfs_rename_sem' isn't known
include/linux/skbuff.h:142: error: storage size of `frags' isn't known
{standard input}: Assembler messages:
{standard input}:512: Error: symbol `seq' is already defined
{standard input}:560: Error: symbol `sem_nsems' is already defined
{standard input}:1605: Error: symbol `flags' is already defined
{standard input}:1921: Error: symbol `files' is already defined
include/linux/device.h:227: error: storage size of `uevent_attr' isn't known
include/linux/netdevice.h:504: error: storage size of `class_dev' isn't known
include/linux/in6.h:58: error: storage size of `sin6_addr' isn't known
include/linux/seq_file.h:22: error: storage size of `sem' isn't known
include/net/neighbour.h:139: error: storage size of `arp_queue' isn't known
include/net/neighbour.h:181: error: storage size of `parms' isn't known
include/net/neighbour.h:190: error: storage size of `proxy_queue' isn't known
{standard input}:2239: Error: symbol `blocks' is already defined
{standard input}:2431: Error: symbol `d_flags' is already defined
{standard input}:2988: Error: symbol `inotify_watches' is already defined
{standard input}:3126: Error: symbol `flags' is already defined
{standard input}:3202: Error: symbol `s_type' is already defined
{standard input}:3412: Error: symbol `mmap' is already defined
{standard input}:3454: Error: symbol `lock' is already defined
{standard input}:3525: Error: symbol `data' is already defined
{standard input}:3615: Error: symbol `truncate_count' is already defined
{standard input}:4141: Error: symbol `lock' is already defined
{standard input}:4231: Error: symbol `data' is already defined
{standard input}:4237: Error: symbol `tail' is already defined
{standard input}:4321: Error: symbol `parent' is already defined
{standard input}:4327: Error: symbol `release' is already defined
include/net/sock.h:81: error: storage size of `wq' isn't known
include/net/sock.h:206: error: storage size of `sk_receive_queue' isn't known
include/net/sock.h:207: error: storage size of `sk_write_queue' isn't known
include/net/sock.h:224: error: storage size of `sk_error_queue' isn't known
include/net/sock.h:232: error: storage size of `sk_peercred' isn't known
include/net/sock.h:239: error: storage size of `sk_stamp' isn't known
include/net/inet_sock.h:144: error: storage size of `fl' isn't known
include/linux/tcp.h:267: error: storage size of `rx_opt' isn't known
include/linux/tcp.h:279: error: storage size of `out_of_order_queue' isn't knowninclude/linux/tcp.h:288: error: storage size of `duplicate_sack' isn't known
include/linux/tcp.h:289: error: storage size of `selective_acks' isn't known
include/linux/tcp.h:291: error: storage size of `recv_sack_cache' isn't known
include/linux/wireless.h:754: error: storage size of `channel_list' isn't known
include/linux/wireless.h:885: error: storage size of `qual' isn't known
include/linux/wireless.h:847: error: storage size of `discard' isn't known
include/linux/wireless.h:848: error: storage size of `miss' isn't known
include/linux/wireless.h:881: error: storage size of `retry' isn't known
include/linux/wireless.h:883: error: storage size of `encoding' isn't known
include/linux/wireless.h:884: error: storage size of `power' isn't known
include/linux/wireless.h:890: error: storage size of `param' isn't known
include/linux/wireless.h:891: error: storage size of `data' isn't known
include/linux/wireless.h:951: error: storage size of `max_qual' isn't known
include/linux/wireless.h:961: error: storage size of `avg_qual' isn't known
include/linux/wireless.h:1012: error: storage size of `freq' isn't known
include/linux/wireless.h:1045: error: storage size of `u' isn't known
{standard input}:4362: Error: symbol `release' is already defined
{standard input}:4523: Error: symbol `destructor' is already defined
{standard input}:4529: Error: symbol `open' is already defined
{standard input}:4637: Error: symbol `dev' is already defined
{standard input}:4661: Error: symbol `func' is already defined
{standard input}:4667: Error: symbol `data' is already defined
{standard input}:4907: Error: symbol `nlink' is already defined
{standard input}:4913: Error: symbol `size' is already defined
{standard input}:4937: Error: symbol `owner' is already defined
{standard input}:4943: Error: symbol `next' is already defined
{standard input}:4949: Error: symbol `parent' is already defined
{standard input}:4961: Error: symbol `data' is already defined
{standard input}:4991: Error: symbol `seq' is already defined
{standard input}:5614: Error: symbol `u' is already defined
{standard input}:5980: Error: symbol `index' is already defined
{standard input}:6148: Error: symbol `id' is already defined
{standard input}:6262: Error: symbol `child' is already defined
{standard input}:6268: Error: symbol `error' is already defined
{standard input}:6346: Error: symbol `ops' is already defined
{standard input}:6357: Error: symbol `owner' is already defined
/var/tmp/portage/ieee80211-1.1.13-r1/work/ieee80211-1.1.13/net/ieee80211.h:676: error: storage size of `channel_switch' isn't known
/var/tmp/portage/ieee80211-1.1.13-r1/work/ieee80211-1.1.13/net/ieee80211.h:803: error: storage size of `ac_params_record' isn't known
/var/tmp/portage/ieee80211-1.1.13-r1/work/ieee80211-1.1.13/net/ieee80211.h:922: error: storage size of `qos_data' isn't known
/var/tmp/portage/ieee80211-1.1.13-r1/work/ieee80211-1.1.13/net/ieee80211.h:925: error: storage size of `stats' isn't known
/var/tmp/portage/ieee80211-1.1.13-r1/work/ieee80211-1.1.13/net/ieee80211.h:927: error: storage size of `rates' isn't known
/var/tmp/portage/ieee80211-1.1.13-r1/work/ieee80211-1.1.13/net/ieee80211.h:929: error: storage size of `rates_ex' isn't known
/var/tmp/portage/ieee80211-1.1.13-r1/work/ieee80211-1.1.13/net/ieee80211.h:944: error: storage size of `tim' isn't known
/var/tmp/portage/ieee80211-1.1.13-r1/work/ieee80211-1.1.13/net/ieee80211.h:952: error: storage size of `tpc_report' isn't known
/var/tmp/portage/ieee80211-1.1.13-r1/work/ieee80211-1.1.13/net/ieee80211.h:959: error: storage size of `csa' isn't known
/var/tmp/portage/ieee80211-1.1.13-r1/work/ieee80211-1.1.13/net/ieee80211.h:962: error: storage size of `quiet' isn't known
/var/tmp/portage/ieee80211-1.1.13-r1/work/ieee80211-1.1.13/net/ieee80211.h:1012: error: storage size of `bg' isn't known
/var/tmp/portage/ieee80211-1.1.13-r1/work/ieee80211-1.1.13/net/ieee80211.h:1013: error: storage size of `a' isn't known
/var/tmp/portage/ieee80211-1.1.13-r1/work/ieee80211-1.1.13/net/ieee80211.h:1076: error: storage size of `frag_cache' isn't known
{standard input}:6693: Error: symbol `owner' is already defined
{standard input}:6699: Error: symbol `name' is already defined
{standard input}:6711: Error: symbol `stats' is already defined
{standard input}:6997: Error: symbol `id' is already defined
{standard input}:7903: Error: symbol `key' is already defined
{standard input}:8172: Error: symbol `name' is already defined
{standard input}:8202: Error: symbol `private' is already defined
{standard input}:8268: Error: symbol `signal' is already defined
{standard input}:8304: Error: symbol `len' is already defined
{standard input}:8394: Error: symbol `data' is already defined
{standard input}:8561: Error: symbol `tx_op_limit' is already defined
{standard input}:8601: Error: symbol `u' is already defined
{standard input}:8822: Error: symbol `wpa_ie' is already defined
{standard input}:8882: Error: symbol `bssid' is already defined
{standard input}:8888: Error: symbol `state' is already defined
{standard input}:8930: Error: symbol `hard_start_xmit' is already defined
{standard input}:9020: Error: symbol `priv' is already defined
make[2]: *** [/var/tmp/portage/ieee80211-1.1.13-r1/work/ieee80211-1.1.13/ieee80211_module.o] Error 1
make[1]: *** [_module_/var/tmp/portage/ieee80211-1.1.13-r1/work/ieee80211-1.1.13] Error 2
make[1]: Leaving directory `/usr/src/linux-2.6.16-gentoo-r3'
make: *** [modules] Error 2
!!! ERROR: net-wireless/ieee80211-1.1.13-r1 failed.
!!! Function linux-mod_src_compile, Line 512, Exitcode 2
!!! Unable to make KSRC=/usr/src/linux KSRC_OUTPUT=/usr/src/linux modules.
!!! If you need support, post the topmost build error, NOT this status message.
standard input}:8601: Error: symbol `u' is already defined
{standard input}:8822: Error: symbol `wpa_ie' is already defined
{standard input}:8882: Error: symbol `bssid' is already defined
{standard input}:8888: Error: symbol `state' is already defined
{standard input}:8930: Error: symbol `hard_start_xmit' is already defined
{standard input}:9020: Error: symbol `priv' is already defined
make[2]: *** [/var/tmp/portage/ieee80211-1.1.13-r1/work/ieee80211-1.1.13/ieee80211_module.o] Error 1
make[1]: *** [_module_/var/tmp/portage/ieee80211-1.1.13-r1/work/ieee80211-1.1.13] Error 2
make[1]: Leaving directory `/usr/src/linux-2.6.16-gentoo-r3'
make: *** [modules] Error 2
!!! ERROR: net-wireless/ieee80211-1.1.13-r1 failed.
!!! Function linux-mod_src_compile, Line 512, Exitcode 2
!!! Unable to make KSRC=/usr/src/linux KSRC_OUTPUT=/usr/src/linux modules.
!!! If you need support, post the topmost build error, NOT this status message.