All pastes #522997 Raw Edit

Han Sooloo

public text v1 · immutable
#522997 ·published 2007-05-30 16:56 UTC
rendered paste body
  HOSTCC  scripts/basic/fixdep
In file included from /usr/include/bits/local_lim.h:4,
                 from /usr/include/gentoo-multilib/ppc/bits/posix1_lim.h:153,
                 from /usr/include/bits/posix1_lim.h:4,
                 from /usr/include/gentoo-multilib/ppc/limits.h:145,
                 from /usr/include/limits.h:4,
                 from /usr/lib/gcc/powerpc-unknown-linux-gnu/4.1.2/include/limits.h:122,
                 from /usr/lib/gcc/powerpc-unknown-linux-gnu/4.1.2/include/syslimits.h:7,
                 from /usr/lib/gcc/powerpc-unknown-linux-gnu/4.1.2/include/limits.h:11,
                 from scripts/basic/fixdep.c:115:
/usr/include/gentoo-multilib/ppc/bits/local_lim.h:36:26: error: linux/limits.h: No such file or directory
In file included from /usr/include/bits/socket.h:4,
                 from /usr/include/gentoo-multilib/ppc/sys/socket.h:35,
                 from /usr/include/sys/socket.h:4,
                 from /usr/include/gentoo-multilib/ppc/netinet/in.h:24,
                 from /usr/include/netinet/in.h:4,
                 from /usr/include/gentoo-multilib/ppc/arpa/inet.h:23,
                 from /usr/include/arpa/inet.h:4,
                 from scripts/basic/fixdep.c:117:
/usr/include/gentoo-multilib/ppc/bits/socket.h:310:24: error: asm/socket.h: No such file or directory
scripts/basic/fixdep.c: In function 'use_config':
scripts/basic/fixdep.c:206: error: 'PATH_MAX' undeclared (first use in this function)
scripts/basic/fixdep.c:206: error: (Each undeclared identifier is reported only once
scripts/basic/fixdep.c:206: error: for each function it appears in.)
scripts/basic/fixdep.c:206: warning: unused variable 's'
scripts/basic/fixdep.c: In function 'parse_dep_file':
scripts/basic/fixdep.c:306: error: 'PATH_MAX' undeclared (first use in this function)
scripts/basic/fixdep.c:306: warning: unused variable 's'
make[1]: *** [scripts/basic/fixdep] Error 1
make: *** [scripts_basic] Error 2