[root@LinuxCel333 Module]# make -C /usr/src/linux SUBDIRS=$PWD modules
make: Entering directory `/usr/src/linux-2.6.12-12mdk'
WARNING: Symbol version dump /usr/src/linux-2.6.12-12mdk/Module.symvers
is missing; modules will have no dependencies and modversions.
CC [M] /home/nikos/Download/RT2500-Linux-STA-1.4.6.4/Module/rtmp_main.o
In file included from /home/nikos/Download/RT2500-Linux-STA-1.4.6.4/Module/mlme.h:39,
from /home/nikos/Download/RT2500-Linux-STA-1.4.6.4/Module/rtmp.h:41,
from /home/nikos/Download/RT2500-Linux-STA-1.4.6.4/Module/rt_config.h:138,
from /home/nikos/Download/RT2500-Linux-STA-1.4.6.4/Module/rtmp_main.c:38:
/home/nikos/Download/RT2500-Linux-STA-1.4.6.4/Module/oid.h:276: warning: 'packed' attribute ignored
/home/nikos/Download/RT2500-Linux-STA-1.4.6.4/Module/oid.h:277: warning: 'packed' attribute ignored
/home/nikos/Download/RT2500-Linux-STA-1.4.6.4/Module/rtmp_main.c: In function 'RT2500_probe':
/home/nikos/Download/RT2500-Linux-STA-1.4.6.4/Module/rtmp_main.c:121: error: 'struct pci_dev' has no member named 'slot_name'
make[1]: *** [/home/nikos/Download/RT2500-Linux-STA-1.4.6.4/Module/rtmp_main.o] Error 1
make: *** [_module_/home/nikos/Download/RT2500-Linux-STA-1.4.6.4/Module] Error 2
make: Leaving directory `/usr/src/linux-2.6.12-12mdk'