In file included from bcsubwindow.h:4,
from bcbar.h:5,
from bcbar.c:1:
arraylist.h:13: error: expected '=', ',', ';', 'asm' or '__attribute__' before '<' token
arraylist.h:60: error: expected '=', ',', ';', 'asm' or '__attribute__' before '<' token
arraylist.h:70: error: expected '=', ',', ';', 'asm' or '__attribute__' before '<' token
arraylist.h:78: error: expected '=', ',', ';', 'asm' or '__attribute__' before '<' token
arraylist.h:85: error: expected '=', ',', ';', 'asm' or '__attribute__' before '<' token
arraylist.h:93: error: expected '=', ',', ';', 'asm' or '__attribute__' before '<' token
arraylist.h:106: error: expected '=', ',', ';', 'asm' or '__attribute__' before '<' token
arraylist.h:122: error: expected '=', ',', ';', 'asm' or '__attribute__' before '<' token
arraylist.h:138: error: expected '=', ',', ';', 'asm' or '__attribute__' before '<' token
arraylist.h:149: error: expected '=', ',', ';', 'asm' or '__attribute__' before '<' token
arraylist.h:165: error: expected '=', ',', ';', 'asm' or '__attribute__' before '<' token
arraylist.h:173: error: expected '=', ',', ';', 'asm' or '__attribute__' before '<' token
arraylist.h:194: error: expected '=', ',', ';', 'asm' or '__attribute__' before '<' token
arraylist.h:222: error: expected '=', ',', ';', 'asm' or '__attribute__' before '<' token
arraylist.h:251: error: expected '=', ',', ';', 'asm' or '__attribute__' before '<' token
arraylist.h:258: error: expected '=', ',', ';', 'asm' or '__attribute__' before '<' token
arraylist.h:273: error: expected '=', ',', ';', 'asm' or '__attribute__' before '<' token
arraylist.h:298: error: expected '=', ',', ';', 'asm' or '__attribute__' before '<' token
arraylist.h:305: error: expected '=', ',', ';', 'asm' or '__attribute__' before '<' token
arraylist.h:327: error: expected '=', ',', ';', 'asm' or '__attribute__' before '<' token
In file included from bcwindowbase.h:21,
from bcsubwindow.h:5,
from bcbar.h:5,
from bcbar.c:1:
bcbar.inc:5: error: expected '=', ',', ';', 'asm' or '__attribute__' before 'BC_Bar'
In file included from bcwindowbase.h:22,
from bcsubwindow.h:5,
from bcbar.h:5,
from bcbar.c:1:
bcbitmap.inc:5: error: expected '=', ',', ';', 'asm' or '__attribute__' before 'BC_Bitmap'
In file included from bcwindowbase.h:23,
from bcsubwindow.h:5,
from bcbar.h:5,
from bcbar.c:1:
bcbutton.inc:5: error: expected '=', ',', ';', 'asm' or '__attribute__' before 'BC_Button'
bcbutton.inc:6: error: expected '=', ',', ';', 'asm' or '__attribute__' before 'BC_GenericButton'
In file included from bcwindowbase.h:24,
from bcsubwindow.h:5,
from bcbar.h:5,
from bcbar.c:1:
bccapture.inc:5: error: expected '=', ',', ';', 'asm' or '__attribute__' before 'BC_Capture'
In file included from bcwindowbase.h:25,
from bcsubwindow.h:5,
from bcbar.h:5,
from bcbar.c:1:
bcclipboard.inc:4: error: expected '=', ',', ';', 'asm' or '__attribute__' before 'BC_Clipboard'
In file included from bcwindowbase.h:26,
from bcsubwindow.h:5,
from bcbar.h:5,
from bcbar.c:1:
bcdragwindow.inc:5: error: expected '=', ',', ';', 'asm' or '__attribute__' before 'BC_DragWindow'
In file included from bcwindowbase.h:27,
from bcsubwindow.h:5,
from bcbar.h:5,
from bcbar.c:1:
bcfilebox.inc:4: error: expected '=', ',', ';', 'asm' or '__attribute__' before 'BC_FileBox'
In file included from bcwindowbase.h:28,
from bcsubwindow.h:5,
from bcbar.h:5,
from bcbar.c:1:
bclistbox.inc:27: error: expected '=', ',', ';', 'asm' or '__attribute__' before 'BC_ListBoxItem'
bclistbox.inc:28: error: expected '=', ',', ';', 'asm' or '__attribute__' before 'BC_ListBox'
In file included from bcwindowbase.h:29,
from bcsubwindow.h:5,
from bcbar.h:5,
from bcbar.c:1:
bcmenubar.inc:4: error: expected '=', ',', ';', 'asm' or '__attribute__' before 'BC_MenuBar'
In file included from bcwindowbase.h:30,
from bcsubwindow.h:5,
from bcbar.h:5,
from bcbar.c:1:
bcmeter.inc:4: error: expected '=', ',', ';', 'asm' or '__attribute__' before 'BC_Meter'
In file included from bcwindowbase.h:31,
from bcsubwindow.h:5,
from bcbar.h:5,
from bcbar.c:1:
bcpan.inc:5: error: expected '=', ',', ';', 'asm' or '__attribute__' before 'BC_Pan'
In file included from bcwindowbase.h:32,
from bcsubwindow.h:5,
from bcbar.h:5,
from bcbar.c:1:
bcpbuffer.inc:7: error: expected '=', ',', ';', 'asm' or '__attribute__' before 'BC_PBuffer'
In file included from bcwindowbase.h:33,
from bcsubwindow.h:5,
from bcbar.h:5,
from bcbar.c:1:
bcpixmap.inc:4: error: expected '=', ',', ';', 'asm' or '__attribute__' before 'BC_Pixmap'
In file included from bcwindowbase.h:34,
from bcsubwindow.h:5,
from bcbar.h:5,
from bcbar.c:1:
bcpopup.inc:4: error: expected '=', ',', ';', 'asm' or '__attribute__' before 'BC_Popup'
bcpopup.inc:5: error: expected '=', ',', ';', 'asm' or '__attribute__' before 'BC_FullScreen'
In file included from bcwindowbase.h:35,
from bcsubwindow.h:5,
from bcbar.h:5,
from bcbar.c:1:
bcpopupmenu.inc:4: error: expected '=', ',', ';', 'asm' or '__attribute__' before 'BC_PopupMenu'
In file included from bcwindowbase.h:36,
from bcsubwindow.h:5,
from bcbar.h:5,
from bcbar.c:1:
bcpot.inc:4: error: expected '=', ',', ';', 'asm' or '__attribute__' before 'BC_Pot'
In file included from bcwindowbase.h:37,
from bcsubwindow.h:5,
from bcbar.h:5,
from bcbar.c:1:
bcprogress.inc:4: error: expected '=', ',', ';', 'asm' or '__attribute__' before 'BC_ProgressBar'
In file included from bcwindowbase.h:38,
from bcsubwindow.h:5,
from bcbar.h:5,
from bcbar.c:1:
bcrelocatablewidget.h:4: error: expected '=', ',', ';', 'asm' or '__attribute__' before 'BC_RelocatableWidget'
In file included from bcwindowbase.h:39,
from bcsubwindow.h:5,
from bcbar.h:5,
from bcbar.c:1:
bcrepeater.inc:5: error: expected '=', ',', ';', 'asm' or '__attribute__' before 'BC_Repeater'
In file included from bcwindowbase.h:40,
from bcsubwindow.h:5,
from bcbar.h:5,
from bcbar.c:1:
bcresources.inc:5: error: expected '=', ',', ';', 'asm' or '__attribute__' before 'BC_Resources'
In file included from bcwindowbase.h:41,
from bcsubwindow.h:5,
from bcbar.h:5,
from bcbar.c:1:
bcscrollbar.inc:4: error: expected '=', ',', ';', 'asm' or '__attribute__' before 'BC_ScrollBar'
In file included from bcwindowbase.h:42,
from bcsubwindow.h:5,
from bcbar.h:5,
from bcbar.c:1:
bcslider.inc:5: error: expected '=', ',', ';', 'asm' or '__attribute__' before 'BC_Slider'
In file included from bcwindowbase.h:43,
from bcsubwindow.h:5,
from bcbar.h:5,
from bcbar.c:1:
bcsubwindow.inc:5: error: expected '=', ',', ';', 'asm' or '__attribute__' before 'BC_SubWindow'
bcsubwindow.inc:6: error: expected '=', ',', ';', 'asm' or '__attribute__' before 'BC_SubWindowList'
In file included from bcwindowbase.h:44,
from bcsubwindow.h:5,
from bcbar.h:5,
from bcbar.c:1:
bcsynchronous.inc:7: error: expected '=', ',', ';', 'asm' or '__attribute__' before 'BC_Synchronous'
In file included from bcwindowbase.h:45,
from bcsubwindow.h:5,
from bcbar.h:5,
from bcbar.c:1:
bctextbox.inc:4: error: expected '=', ',', ';', 'asm' or '__attribute__' before 'BC_TextBox'
In file included from bcwindowbase.h:46,
from bcsubwindow.h:5,
from bcbar.h:5,
from bcbar.c:1:
bctimer.inc:4: error: expected '=', ',', ';', 'asm' or '__attribute__' before 'Timer'
In file included from bcwindowbase.h:47,
from bcsubwindow.h:5,
from bcbar.h:5,
from bcbar.c:1:
bctitle.inc:4: error: expected '=', ',', ';', 'asm' or '__attribute__' before 'BC_Title'
In file included from bcwindowbase.h:48,
from bcsubwindow.h:5,
from bcbar.h:5,
from bcbar.c:1:
bctoggle.inc:4: error: expected '=', ',', ';', 'asm' or '__attribute__' before 'BC_Toggle'
In file included from bcwindowbase.h:49,
from bcsubwindow.h:5,
from bcbar.h:5,
from bcbar.c:1:
bctumble.inc:5: error: expected '=', ',', ';', 'asm' or '__attribute__' before 'BC_Tumbler'
In file included from bcwindowbase.h:50,
from bcsubwindow.h:5,
from bcbar.h:5,
from bcbar.c:1:
bcwidgetgrid.inc:5: error: expected '=', ',', ';', 'asm' or '__attribute__' before 'BC_WidgetGrid'
bcwidgetgrid.inc:6: error: expected '=', ',', ';', 'asm' or '__attribute__' before 'BC_WidgetGridList'
In file included from bcwindowbase.h:51,
from bcsubwindow.h:5,
from bcbar.h:5,
from bcbar.c:1:
bcwindow.inc:5: error: expected '=', ',', ';', 'asm' or '__attribute__' before 'BC_Window'
In file included from bcwindowbase.h:52,
from bcsubwindow.h:5,
from bcbar.h:5,
from bcbar.c:1:
bcwindowbase.inc:4: error: expected '=', ',', ';', 'asm' or '__attribute__' before 'BC_WindowBase'
bcwindowbase.inc:5: error: expected '=', ',', ';', 'asm' or '__attribute__' before 'BC_WindowList'
In file included from bcwindowbase.h:53,
from bcsubwindow.h:5,
from bcbar.h:5,
from bcbar.c:1:
bcwindowevents.inc:4: error: expected '=', ',', ';', 'asm' or '__attribute__' before 'BC_WindowEvents'
In file included from bcwindowbase.h:54,
from bcsubwindow.h:5,
from bcbar.h:5,
from bcbar.c:1:
condition.inc:5: error: expected '=', ',', ';', 'asm' or '__attribute__' before 'Condition'
In file included from bcwindowbase.h:55,
from bcsubwindow.h:5,
from bcbar.h:5,
from bcbar.c:1:
bchash.inc:4: error: expected '=', ',', ';', 'asm' or '__attribute__' before 'BC_Hash'
In file included from bcwindowbase.h:56,
from bcsubwindow.h:5,
from bcbar.h:5,
from bcbar.c:1:
linklist.h:4: error: expected '=', ',', ';', 'asm' or '__attribute__' before '<' token
linklist.h:7: error: expected '=', ',', ';', 'asm' or '__attribute__' before '<' token
linklist.h:42: error: expected '=', ',', ';', 'asm' or '__attribute__' before '<' token
linklist.h:55: error: expected '=', ',', ';', 'asm' or '__attribute__' before '<' token
linklist.h:61: error: expected '=', ',', ';', 'asm' or '__attribute__' before '<' token
linklist.h:70: error: expected '=', ',', ';', 'asm' or '__attribute__' before '<' token
linklist.h:83: error: expected '=', ',', ';', 'asm' or '__attribute__' before '<' token
linklist.h:96: error: expected '=', ',', ';', 'asm' or '__attribute__' before '<' token
linklist.h:108: error: expected '=', ',', ';', 'asm' or '__attribute__' before '<' token
linklist.h:121: error: expected '=', ',', ';', 'asm' or '__attribute__' before '<' token
linklist.h:144: error: expected '=', ',', ';', 'asm' or '__attribute__' before '<' token
linklist.h:167: error: expected '=', ',', ';', 'asm' or '__attribute__' before '<' token
linklist.h:174: error: expected '=', ',', ';', 'asm' or '__attribute__' before '<' token
linklist.h:194: error: expected '=', ',', ';', 'asm' or '__attribute__' before '<' token
linklist.h:201: error: expected '=', ',', ';', 'asm' or '__attribute__' before '<' token
linklist.h:221: error: expected '=', ',', ';', 'asm' or '__attribute__' before '<' token
linklist.h:271: error: expected '=', ',', ';', 'asm' or '__attribute__' before '<' token
linklist.h:278: error: expected '=', ',', ';', 'asm' or '__attribute__' before '<' token
linklist.h:302: error: expected '=', ',', ';', 'asm' or '__attribute__' before '<' token
linklist.h:310: error: expected '=', ',', ';', 'asm' or '__attribute__' before '<' token
linklist.h:317: error: expected '=', ',', ';', 'asm' or '__attribute__' before '<' token
In file included from bcwindowbase.h:57,
from bcsubwindow.h:5,
from bcbar.h:5,
from bcbar.c:1:
mutex.inc:4: error: expected '=', ',', ';', 'asm' or '__attribute__' before 'Mutex'
In file included from bcwindowbase.h:58,
from bcsubwindow.h:5,
from bcbar.h:5,
from bcbar.c:1:
vframe.inc:4: error: expected '=', ',', ';', 'asm' or '__attribute__' before 'VFrame'
In file included from bcsubwindow.h:5,
from bcbar.h:5,
from bcbar.c:1:
bcwindowbase.h:104: error: expected '=', ',', ';', 'asm' or '__attribute__' before 'BC_ResizeCall'
bcwindowbase.h:113: error: expected '=', ',', ';', 'asm' or '__attribute__' before 'BC_WindowBase'
In file included from bcbar.h:5,
from bcbar.c:1:
bcsubwindow.h:7: error: expected '=', ',', ';', 'asm' or '__attribute__' before 'BC_SubWindow'
bcsubwindow.h:17: error: expected '=', ',', ';', 'asm' or '__attribute__' before 'BC_SubWindowList'
In file included from bcbar.c:1:
bcbar.h:8: error: expected '=', ',', ';', 'asm' or '__attribute__' before 'BC_Bar'
In file included from bcbar.c:2:
bcpixmap.h:23: error: expected '=', ',', ';', 'asm' or '__attribute__' before 'BC_Pixmap'
In file included from bcresources.h:11,
from bcbar.c:3:
bcdisplayinfo.inc:4: error: expected '=', ',', ';', 'asm' or '__attribute__' before 'BC_DisplayInfo'
In file included from bcfilebox.h:4,
from bcresources.h:12,
from bcbar.c:3:
bcbutton.h:11: error: expected '=', ',', ';', 'asm' or '__attribute__' before 'BC_Button'
bcbutton.h:51: error: expected '=', ',', ';', 'asm' or '__attribute__' before 'BC_GenericButton'
bcbutton.h:65: error: expected '=', ',', ';', 'asm' or '__attribute__' before 'BC_OKTextButton'
bcbutton.h:75: error: expected '=', ',', ';', 'asm' or '__attribute__' before 'BC_CancelTextButton'
bcbutton.h:85: error: expected '=', ',', ';', 'asm' or '__attribute__' before 'BC_OKButton'
bcbutton.h:98: error: expected '=', ',', ';', 'asm' or '__attribute__' before 'BC_CancelButton'
In file included from bcfilebox.h:5,
from bcresources.h:12,
from bcbar.c:3:
bcdelete.inc:5: error: expected '=', ',', ';', 'asm' or '__attribute__' before 'BC_DeleteThread'
In file included from bcfilebox.h:8,
from bcresources.h:12,
from bcbar.c:3:
bclistboxitem.inc:6: error: expected '=', ',', ';', 'asm' or '__attribute__' before 'BC_ListBoxItem'
In file included from bcfilebox.h:9,
from bcresources.h:12,
from bcbar.c:3:
bcnewfolder.inc:5: error: expected '=', ',', ';', 'asm' or '__attribute__' before 'BC_NewFolder'
bcnewfolder.inc:6: error: expected '=', ',', ';', 'asm' or '__attribute__' before 'BC_NewFolderThread'
In file included from bclistbox.h:7,
from bctextbox.h:4,
from bcfilebox.h:11,
from bcresources.h:12,
from bcbar.c:3:
bcscrollbar.h:39: error: expected '=', ',', ';', 'asm' or '__attribute__' before 'BC_ScrollBar'
In file included from bclistbox.h:9,
from bctextbox.h:4,
from bcfilebox.h:11,
from bcresources.h:12,
from bcbar.c:3:
bctoggle.h:11: error: expected '=', ',', ';', 'asm' or '__attribute__' before 'BC_Toggle'
bctoggle.h:95: error: expected '=', ',', ';', 'asm' or '__attribute__' before 'BC_Radial'
bctoggle.h:106: error: expected '=', ',', ';', 'asm' or '__attribute__' before 'BC_CheckBox'
bctoggle.h:127: error: expected '=', ',', ';', 'asm' or '__attribute__' before 'BC_Label'
In file included from bctextbox.h:4,
from bcfilebox.h:11,
from bcresources.h:12,
from bcbar.c:3:
bclistbox.h:19: error: expected '=', ',', ';', 'asm' or '__attribute__' before 'BC_ListBoxYScroll'
bclistbox.h:32: error: expected '=', ',', ';', 'asm' or '__attribute__' before 'BC_ListBoxXScroll'
bclistbox.h:45: error: expected '=', ',', ';', 'asm' or '__attribute__' before 'BC_ListBoxToggle'
bclistbox.h:79: error: expected '=', ',', ';', 'asm' or '__attribute__' before 'BC_ListBox'
In file included from bctextbox.h:6,
from bcfilebox.h:11,
from bcresources.h:12,
from bcbar.c:3:
bctumble.h:6: error: expected '=', ',', ';', 'asm' or '__attribute__' before 'BC_Tumbler'
bctumble.h:39: error: expected '=', ',', ';', 'asm' or '__attribute__' before 'BC_ITumbler'
bctumble.h:55: error: expected '=', ',', ';', 'asm' or '__attribute__' before 'BC_FTumbler'
In file included from bcfilebox.h:11,
from bcresources.h:12,
from bcbar.c:3:
bctextbox.h:14: error: expected '=', ',', ';', 'asm' or '__attribute__' before 'BC_TextBox'
bctextbox.h:153: error: expected '=', ',', ';', 'asm' or '__attribute__' before 'BC_ScrollTextBoxText'
bctextbox.h:154: error: expected '=', ',', ';', 'asm' or '__attribute__' before 'BC_ScrollTextBoxYScroll'
bctextbox.h:157: error: expected '=', ',', ';', 'asm' or '__attribute__' before 'BC_ScrollTextBox'
bctextbox.h:190: error: expected '=', ',', ';', 'asm' or '__attribute__' before 'BC_ScrollTextBoxText'
bctextbox.h:200: error: expected '=', ',', ';', 'asm' or '__attribute__' before 'BC_ScrollTextBoxYScroll'
bctextbox.h:212: error: expected '=', ',', ';', 'asm' or '__attribute__' before 'BC_PopupTextBoxText'
bctextbox.h:213: error: expected '=', ',', ';', 'asm' or '__attribute__' before 'BC_PopupTextBoxList'
bctextbox.h:215: error: expected '=', ',', ';', 'asm' or '__attribute__' before 'BC_PopupTextBox'
bctextbox.h:251: error: expected '=', ',', ';', 'asm' or '__attribute__' before 'BC_PopupTextBoxText'
bctextbox.h:260: error: expected '=', ',', ';', 'asm' or '__attribute__' before 'BC_PopupTextBoxList'
bctextbox.h:269: error: expected '=', ',', ';', 'asm' or '__attribute__' before 'BC_TumbleTextBoxText'
bctextbox.h:270: error: expected '=', ',', ';', 'asm' or '__attribute__' before 'BC_TumbleTextBoxTumble'
bctextbox.h:272: error: expected '=', ',', ';', 'asm' or '__attribute__' before 'BC_TumbleTextBox'
bctextbox.h:333: error: expected '=', ',', ';', 'asm' or '__attribute__' before 'BC_TumbleTextBoxText'
In file included from bcfilebox.h:12,
from bcresources.h:12,
from bcbar.c:3:
bcwindow.h:6: error: expected '=', ',', ';', 'asm' or '__attribute__' before 'BC_Window'
In file included from bcfilebox.h:14,
from bcresources.h:12,
from bcbar.c:3:
filesystem.inc:5: error: expected '=', ',', ';', 'asm' or '__attribute__' before 'FileItem'
filesystem.inc:6: error: expected '=', ',', ';', 'asm' or '__attribute__' before 'FileSystem'
In file included from bcfilebox.h:16,
from bcresources.h:12,
from bcbar.c:3:
thread.h:12: error: expected '=', ',', ';', 'asm' or '__attribute__' before 'Thread'
In file included from bcresources.h:12,
from bcbar.c:3:
bcfilebox.h:33: error: expected '=', ',', ';', 'asm' or '__attribute__' before 'BC_FileBoxListBox'
bcfilebox.h:49: error: expected '=', ',', ';', 'asm' or '__attribute__' before 'BC_FileBoxTextBox'
bcfilebox.h:59: error: expected '=', ',', ';', 'asm' or '__attribute__' before 'BC_FileBoxOK'
bcfilebox.h:70: error: expected '=', ',', ';', 'asm' or '__attribute__' before 'BC_FileBoxUseThis'
bcfilebox.h:80: error: expected '=', ',', ';', 'asm' or '__attribute__' before 'BC_FileBoxCancel'
bcfilebox.h:91: error: expected '=', ',', ';', 'asm' or '__attribute__' before 'BC_FileBoxText'
bcfilebox.h:99: error: expected '=', ',', ';', 'asm' or '__attribute__' before 'BC_FileBoxDirectoryText'
bcfilebox.h:107: error: expected '=', ',', ';', 'asm' or '__attribute__' before 'BC_FileBoxFilterText'
bcfilebox.h:115: error: expected '=', ',', ';', 'asm' or '__attribute__' before 'BC_FileBoxFilterMenu'
bcfilebox.h:123: error: expected '=', ',', ';', 'asm' or '__attribute__' before 'BC_FileBoxIcons'
bcfilebox.h:131: error: expected '=', ',', ';', 'asm' or '__attribute__' before 'BC_FileBoxNewfolder'
bcfilebox.h:139: error: expected '=', ',', ';', 'asm' or '__attribute__' before 'BC_FileBoxUpdir'
bcfilebox.h:148: error: expected '=', ',', ';', 'asm' or '__attribute__' before 'BC_FileBoxDelete'
bcfilebox.h:156: error: expected '=', ',', ';', 'asm' or '__attribute__' before 'BC_FileBoxReload'
bcfilebox.h:166: error: expected '=', ',', ';', 'asm' or '__attribute__' before 'BC_FileBoxRecent'
bcfilebox.h:177: error: expected '=', ',', ';', 'asm' or '__attribute__' before 'BC_FileBox'
In file included from bcresources.h:14,
from bcbar.c:3:
bcsignals.inc:4: error: expected '=', ',', ';', 'asm' or '__attribute__' before 'BC_Signals'
bcsignals.inc:5: error: expected '=', ',', ';', 'asm' or '__attribute__' before 'BC_LockTrace'
bcsignals.inc:6: error: expected '=', ',', ';', 'asm' or '__attribute__' before 'BC_BufferTrace'
In file included from bcbar.c:3:
bcresources.h:29: error: expected '=', ',', ';', 'asm' or '__attribute__' before 'BC_Resources'
In file included from vframe.h:7,
from bcbar.c:4:
bctexture.inc:5: error: expected '=', ',', ';', 'asm' or '__attribute__' before 'BC_Texture'
In file included from bcbar.c:4:
vframe.h:12: error: expected '=', ',', ';', 'asm' or '__attribute__' before 'PngReadFunction'
vframe.h:20: error: expected '=', ',', ';', 'asm' or '__attribute__' before 'VFrame'
bcbar.c:9: error: expected '=', ',', ';', 'asm' or '__attribute__' before ':' token
bcbar.c:16: error: expected '=', ',', ';', 'asm' or '__attribute__' before ':' token
bcbar.c:21: error: expected '=', ',', ';', 'asm' or '__attribute__' before ':' token
bcbar.c:35: error: expected '=', ',', ';', 'asm' or '__attribute__' before ':' token
bcbar.c:42: error: expected '=', ',', ';', 'asm' or '__attribute__' before ':' token
bcbar.c:49: error: expected '=', ',', ';', 'asm' or '__attribute__' before ':' token
bcbar.c:56: error: expected '=', ',', ';', 'asm' or '__attribute__' before ':' token
make[2]: *** [bcbar.lo] Error 1
make[1]: *** [all-recursive] Error 1
make: *** [all] Error 2