All pastes #521024 Raw Edit

Anonymous

public text v1 · immutable
#521024 ·published 2007-05-30 02:46 UTC
rendered paste body
[kcbanner@kc mk]$ make | tee outfile
==== Building ttogl ====
icConsole.cpp
vex.cpp
In file included from ../Utility/icConsole.cpp:9:
../deps/nvsg/include/nvsg/nvsgcommon.h:17: warning: ignoring #pragma warning 
In file included from ../deps/nvsg/include/nvsg/nvgl/nvgl.h:14,
                 from ../Utility/vex.h:15,
                 from ../Utility/vex.cpp:9:
../deps/nvsg/include/nvsg/nvsgcommon.h:17: warning: ignoring #pragma warning 
In file included from ../Utility/icConsole.cpp:10:
../Utility/icConsole.h:36:7: warning: no newline at end of file
../Utility/icConsole.cpp:70:2: warning: no newline at end of file
In file included from ../Utility/vex.h:15,
                 from ../Utility/vex.cpp:9:
../deps/nvsg/include/nvsg/nvgl/nvgl.h:24:1: warning: "GLAPI" redefined
In file included from ../deps/nvsg/include/nvsg/nvgl/nvgl.h:16,
                 from ../Utility/vex.h:15,
                 from ../Utility/vex.cpp:9:
/usr/include/GL/gl.h:66:1: warning: this is the location of the previous definition
../Utility/vex.cpp:66:2: warning: no newline at end of file
../Utility/icConsole.cpp: In function ‘bool icConsoleAttribute(int)’:
../Utility/icConsole.cpp:24: error: ‘HANDLE’ was not declared in this scope
../Utility/icConsole.cpp:24: error: expected `;' before ‘hConsole’
../Utility/icConsole.cpp:26: error: ‘hConsole’ was not declared in this scope
../Utility/icConsole.cpp:26: error: ‘STD_OUTPUT_HANDLE’ was not declared in this scope
../Utility/icConsole.cpp:26: error: ‘GetStdHandle’ was not declared in this scope
../Utility/icConsole.cpp:28: error: ‘SetConsoleTextAttribute’ was not declared in this scope
../Utility/icConsole.cpp: In function ‘bool icConsoleReset()’:
../Utility/icConsole.cpp:33: error: ‘HANDLE’ was not declared in this scope
../Utility/icConsole.cpp:33: error: expected `;' before ‘hConsole’
../Utility/icConsole.cpp:35: error: ‘hConsole’ was not declared in this scope
../Utility/icConsole.cpp:35: error: ‘STD_OUTPUT_HANDLE’ was not declared in this scope
../Utility/icConsole.cpp:35: error: ‘GetStdHandle’ was not declared in this scope
../Utility/icConsole.cpp:37: error: ‘SetConsoleTextAttribute’ was not declared in this scope
../Utility/icConsole.cpp: In function ‘bool icPrintError(const char*)’:
../Utility/icConsole.cpp:42: error: ‘HANDLE’ was not declared in this scope
../Utility/icConsole.cpp:42: error: expected `;' before ‘hConsole’
../Utility/icConsole.cpp:45: error: ‘hConsole’ was not declared in this scope
../Utility/icConsole.cpp:45: error: ‘STD_OUTPUT_HANDLE’ was not declared in this scope
../Utility/icConsole.cpp:45: error: ‘GetStdHandle’ was not declared in this scope
../Utility/icConsole.cpp:47: error: ‘SetConsoleTextAttribute’ was not declared in this scope
../Utility/icConsole.cpp: In function ‘bool icPrintAttribute(const char*, int)’:
../Utility/icConsole.cpp:58: error: ‘HANDLE’ was not declared in this scope
../Utility/icConsole.cpp:58: error: expected `;' before ‘hConsole’
../Utility/icConsole.cpp:61: error: ‘hConsole’ was not declared in this scope
../Utility/icConsole.cpp:61: error: ‘STD_OUTPUT_HANDLE’ was not declared in this scope
../Utility/icConsole.cpp:61: error: ‘GetStdHandle’ was not declared in this scope
../Utility/icConsole.cpp:63: error: ‘SetConsoleTextAttribute’ was not declared in this scope
make[1]: *** [obj/Debug/icConsole.o] Error 1
make[1]: *** Waiting for unfinished jobs....
make: *** [ttogl] Error 2