rendered paste body gcc -std=gnu99 -DHAVE_CONFIG_H -I. -I. -I.. -Wall -Werror -Wextra -Wno-missing-field-initializers -Wno-unused-parameter -I.. -I.. -I/home/ryan/srctrees/sugar-jhbuild/build/include/dbus-1.0 -I/home/ryan/srctrees/sugar-jhbuild/build/lib64/dbus-1.0/include -I/home/ryan/srctrees/sugar-jhbuild/build/include/glib-2.0 -I/home/ryan/srctrees/sugar-jhbuild/build/lib64/glib-2.0/include -I/home/ryan/srctrees/sugar-jhbuild/build/include/glib-2.0 -I/home/ryan/srctrees/sugar-jhbuild/build/lib64/glib-2.0/include -I/home/ryan/srctrees/sugar-jhbuild/build/include/loudmouth-1.0 -I/home/ryan/srctrees/sugar-jhbuild/build/include/glib-2.0 -I/home/ryan/srctrees/sugar-jhbuild/build/lib64/glib-2.0/include -I/home/ryan/srctrees/sugar-jhbuild/build/include/telepathy-1.0 -I/home/ryan/srctrees/sugar-jhbuild/build/include/dbus-1.0 -I/home/ryan/srctrees/sugar-jhbuild/build/include/glib-2.0 -I/home/ryan/srctrees/sugar-jhbuild/build/lib64/glib-2.0/include -I/home/ryan/srctrees/sugar-jhbuild/build/lib64/dbus-1.0/include -I/home/ryan/srctrees/sugar-jhbuild/build/include/telepathy-unstable -I/home/ryan/srctrees/sugar-jhbuild/build/include/dbus-1.0 -I/home/ryan/srctrees/sugar-jhbuild/build/include/glib-2.0 -I/home/ryan/srctrees/sugar-jhbuild/build/lib64/glib-2.0/include -I/home/ryan/srctrees/sugar-jhbuild/build/include/telepathy-1.0 -I/home/ryan/srctrees/sugar-jhbuild/build/lib64/dbus-1.0/include -g -O2 -MT roster.lo -MD -MP -MF .deps/roster.Tpo -c roster.c -fPIC -DPIC -o .libs/roster.o
cc1: warnings being treated as errors
roster.c: In function 'item_handle_unref_foreach':
roster.c:226: warning: cast from pointer to integer of different size
make[3]: *** [roster.lo] Error 1
make[3]: Leaving directory `/home/ryan/srctrees/sugar-jhbuild/source/telepathy-gabble-olpc-rollup/src'
make[2]: *** [all] Error 2
make[2]: Leaving directory `/home/ryan/srctrees/sugar-jhbuild/source/telepathy-gabble-olpc-rollup/src'
make[1]: *** [all-recursive] Error 1
make[1]: Leaving directory `/home/ryan/srctrees/sugar-jhbuild/source/telepathy-gabble-olpc-rollup'
make: *** [all] Error 2
*** error during stage build of telepathy-gabble: ########## Error running make *** [29/71]
[1] rerun stage build
[2] ignore error and continue to install
[3] give up on module
[4] start shell
[5] go to stage force_checkout
[6] go to stage configure
choice: