All pastes #519636 Raw Edit

Stuff

public text v1 · immutable
#519636 ·published 2007-05-29 18:40 UTC
rendered paste body
gcc -DHAVE_CONFIG_H -I. -I. -I. -Icompat -g -O2 -Wall -c http.c  -fPIC -DPIC -o .libs/http.o
http.c: In function `evhttp_decode_uri':
http.c:1737: warning: subscript has type `char'
http.c:1738: warning: subscript has type `char'
http.c: At top level:
http.c:2153: warning: `addr_from_name' defined but not used
 gcc -DHAVE_CONFIG_H -I. -I. -I. -Icompat -g -O2 -Wall -c http.c -o http.o >/dev/null 2>&1
/bin/bash ./libtool --tag=CC --mode=compile gcc -DHAVE_CONFIG_H -I. -I. -I. -Icompat     -g -O2 -Wall -c -o evdns.lo evdns.c
 gcc -DHAVE_CONFIG_H -I. -I. -I. -Icompat -g -O2 -Wall -c evdns.c  -fPIC -DPIC -o .libs/evdns.o
evdns.c: In function `resolv_conf_parse_line':
evdns.c:2606: warning: implicit declaration of function `strtok_r'
evdns.c:2606: warning: initialization makes pointer from integer without a cast
evdns.c:2610: warning: initialization makes pointer from integer without a cast
evdns.c:2618: warning: initialization makes pointer from integer without a cast
evdns.c:2627: warning: assignment makes pointer from integer without a cast
evdns.c:2633: warning: assignment makes pointer from integer without a cast


gcc -DHAVE_CONFIG_H -I. -I. -I..     -I../compat -c event-test.c
In file included from event-test.c:21:
../event.h:302: error: parse error before "u_int8_t"
../event.h:305: error: parse error before "u_int32_t"
../event.h:307: error: parse error before "u_int8_t"
../event.h:310: error: parse error before "u_int8_t"
../event.h:313: error: parse error before "u_int8_t"
../event.h:318: error: parse error before "u_int8_t"
../event.h:320: error: parse error before "u_int8_t"
../event.h:321: error: parse error before "u_int32_t"
../event.h:322: error: parse error before "u_int32_t"
../event.h:325: error: parse error before "u_int8_t"
../event.h:328: error: parse error before "u_int8_t"
../event.h:331: error: parse error before "u_int8_t"
../event.h:334: error: parse error before "u_int8_t"
make[2]: *** [event-test.o] Error 1