rendered paste body3rdparty/boost/detail/shared_count.hpp: In constructor boost::detail::shared_count::shared_count(P, D, A):
3rdparty/boost/detail/shared_count.hpp:138: error: expected initializer before < token
3rdparty/boost/detail/shared_count.hpp:139: error: impl_type was not declared in this scope
3rdparty/boost/detail/shared_count.hpp:147: error: expected type-specifier before impl_type
3rdparty/boost/detail/shared_count.hpp:147: error: expected `>' before impl_type
3rdparty/boost/detail/shared_count.hpp:147: error: expected `(' before impl_type
3rdparty/boost/detail/shared_count.hpp:147: error: expected primary-expression before > token
3rdparty/boost/detail/shared_count.hpp:148: error: expected type-specifier before impl_type
3rdparty/boost/detail/shared_count.hpp:148: error: expected `;' before impl_type
3rdparty/boost/detail/shared_count.hpp:156: error: expected type-specifier before impl_type
3rdparty/boost/detail/shared_count.hpp:156: error: expected `>' before impl_type
3rdparty/boost/detail/shared_count.hpp:156: error: expected `(' before impl_type
3rdparty/boost/detail/shared_count.hpp:156: error: expected primary-expression before > token
make: *** [tmp/main.o] Fehler 1