All pastes #518374 Raw Edit

Untitled

public text v1 · immutable
#518374 ·published 2007-05-29 09:00 UTC
rendered paste body
avformatdecoder.cpp: In member function 'int AvFormatDecoder::ScanStreams(bool)':
avformatdecoder.cpp:1378: error: expected primary-expression before 'else'
avformatdecoder.cpp:1378: error: expected `;' before 'else'
make[2]: *** [avformatdecoder.o] Error 1
make[2]: Leaving directory `/home/stuarta/Projects/MythTV/build/mythtv/libs/libmythtv'
make[1]: *** [sub-libmythtv] Error 2
make[1]: Leaving directory `/home/stuarta/Projects/MythTV/build/mythtv/libs'
make: *** [sub-libs] Error 2