e/libglade-2.0 -I/usr/include/gtk-2.0 -I/usr/include/libxml2 -I/usr/lib/gtk-2.0/include -I/usr/X11R6/include -I/usr/include/atk-1.0 -I/usr/include/pango-1.0 -I/usr/include/freetype2 -I/usr/include/freetype2/config -I/usr/include/glib-2.0 -I/usr/lib/glib-2.0/include -I/usr/include/mozilla-1.7.13/xpcom -I/usr/include/mozilla-1.7.13/string -I/usr/include/mozilla-1.7.13/dom -I/usr/include/mozilla-1.7.13/gtkembedmoz -I/usr/include/mozilla-1.7.13 -I/usr/include/mozilla-1.7.13/nspr -fPIC -fno-rtti -fno-exceptions -Wall -Wconversion -Wpointer-arith -Wcast-align -Woverloaded-virtual -Wsynth -Wno-non-virtual-dtor -Wno-long-long -pedantic -fshort-wchar -pthread -pipe -DNDEBUG -DTRIMMED -O -DXTHREADS -D_REENTRANT -DXUSE_MTSAFE_API -DMOZILLA_CLIENT -L/usr/lib/mozilla-1.7.13 -L/usr/lib/firefox -lgtkembedmoz -I/usr/local/include -g -O2 -MT guxine.o -MD -MP -MF ".deps/guxine.Tpo" -c -o guxine.o guxine.cpp; \
then mv -f ".deps/guxine.Tpo" ".deps/guxine.Po"; else rm -f ".deps/guxine.Tpo"; exit 1; fi
guxine.cpp:28:25: error: gtkmozembed.h: No such file or directory
guxine.cpp:43:28: error: nsIDOMKeyEvent.h: No such file or directory
guxine.cpp:44:30: error: nsIDOMMouseEvent.h: No such file or directory
guxine.cpp:45:19: error: prenv.h: No such file or directory
guxine.cpp:133: error: variable or field load_started_cb declared void
guxine.cpp:133: error: GtkMozEmbed was not declared in this scope
guxine.cpp:133: error: embed was not declared in this scope
guxine.cpp:133: error: expected primary-expression before * token
guxine.cpp:133: error: browser was not declared in this scope
guxine.cpp:133: error: initializer expression list treated as compound expression
guxine.cpp:134: error: variable or field load_finished_cb declared void
guxine.cpp:134: error: GtkMozEmbed was not declared in this scope
guxine.cpp:134: error: embed was not declared in this scope
guxine.cpp:134: error: expected primary-expression before * token
guxine.cpp:134: error: browser was not declared in this scope
guxine.cpp:134: error: initializer expression list treated as compound expression
guxine.cpp:136: error: variable or field new_window_cb declared void
guxine.cpp:136: error: GtkMozEmbed was not declared in this scope
guxine.cpp:136: error: embed was not declared in this scope
guxine.cpp:137: error: GtkMozEmbed was not declared in this scope
guxine.cpp:137: error: retval was not declared in this scope
guxine.cpp:137: error: expected primary-expression before chromemask
guxine.cpp:138: error: expected primary-expression before * token
guxine.cpp:138: error: browser was not declared in this scope
guxine.cpp:138: error: initializer expression list treated as compound expression
guxine.cpp:139: error: variable or field visibility_cb declared void
guxine.cpp:139: error: GtkMozEmbed was not declared in this scope
guxine.cpp:139: error: embed was not declared in this scope
guxine.cpp:140: error: expected primary-expression before visibility
guxine.cpp:141: error: expected primary-expression before * token
guxine.cpp:141: error: browser was not declared in this scope
guxine.cpp:141: error: initializer expression list treated as compound expression
guxine.cpp:142: error: variable or field destroy_brsr_cb declared void
guxine.cpp:142: error: GtkMozEmbed was not declared in this scope
guxine.cpp:142: error: embed was not declared in this scope
guxine.cpp:142: error: expected primary-expression before * token
guxine.cpp:142: error: browser was not declared in this scope
guxine.cpp:142: error: initializer expression list treated as compound expression
guxine.cpp:143: error: GtkMozEmbed was not declared in this scope
guxine.cpp:143: error: embed was not declared in this scope
guxine.cpp:143: error: expected primary-expression before const
guxine.cpp:144: error: expected primary-expression before * token
guxine.cpp:144: error: browser was not declared in this scope
guxine.cpp:144: error: initializer expression list treated as compound expression
guxine.cpp:145: error: variable or field size_to_cb declared void
guxine.cpp:145: error: GtkMozEmbed was not declared in this scope
guxine.cpp:145: error: embed was not declared in this scope
guxine.cpp:145: error: expected primary-expression before width
guxine.cpp:146: error: expected primary-expression before height
guxine.cpp:146: error: expected primary-expression before * token
guxine.cpp:146: error: browser was not declared in this scope
guxine.cpp:146: error: initializer expression list treated as compound expression
guxine.cpp:147: error: GtkMozEmbed was not declared in this scope
guxine.cpp:147: error: embed was not declared in this scope
guxine.cpp:147: error: nsIDOMKeyEvent was not declared in this scope
guxine.cpp:147: error: event was not declared in this scope
guxine.cpp:148: error: expected primary-expression before * token
guxine.cpp:148: error: browser was not declared in this scope
guxine.cpp:148: error: initializer expression list treated as compound expression
guxine.cpp:149: error: GtkMozEmbed was not declared in this scope
guxine.cpp:149: error: embed was not declared in this scope
guxine.cpp:149: error: nsIDOMKeyEvent was not declared in this scope
guxine.cpp:149: error: event was not declared in this scope
guxine.cpp:150: error: expected primary-expression before * token
guxine.cpp:150: error: browser was not declared in this scope
guxine.cpp:150: error: initializer expression list treated as compound expression
guxine.cpp:151: error: GtkMozEmbed was not declared in this scope
guxine.cpp:151: error: embed was not declared in this scope
guxine.cpp:151: error: nsIDOMKeyEvent was not declared in this scope
guxine.cpp:151: error: event was not declared in this scope
guxine.cpp:152: error: expected primary-expression before * token
guxine.cpp:152: error: browser was not declared in this scope
guxine.cpp:152: error: initializer expression list treated as compound expression
guxine.cpp:153: error: GtkMozEmbed was not declared in this scope
guxine.cpp:153: error: embed was not declared in this scope
guxine.cpp:153: error: nsIDOMMouseEvent was not declared in this scope
guxine.cpp:153: error: event was not declared in this scope
guxine.cpp:154: error: expected primary-expression before * token
guxine.cpp:154: error: browser was not declared in this scope
guxine.cpp:154: error: initializer expression list treated as compound expression
guxine.cpp:155: error: GtkMozEmbed was not declared in this scope
guxine.cpp:155: error: embed was not declared in this scope
guxine.cpp:155: error: nsIDOMMouseEvent was not declared in this scope
guxine.cpp:155: error: event was not declared in this scope
guxine.cpp:156: error: expected primary-expression before * token
guxine.cpp:156: error: browser was not declared in this scope
guxine.cpp:156: error: initializer expression list treated as compound expression
guxine.cpp:157: error: GtkMozEmbed was not declared in this scope
guxine.cpp:157: error: embed was not declared in this scope
guxine.cpp:157: error: nsIDOMMouseEvent was not declared in this scope
guxine.cpp:157: error: event was not declared in this scope
guxine.cpp:158: error: expected primary-expression before * token
guxine.cpp:158: error: browser was not declared in this scope
guxine.cpp:158: error: initializer expression list treated as compound expression
guxine.cpp:159: error: GtkMozEmbed was not declared in this scope
guxine.cpp:159: error: embed was not declared in this scope
guxine.cpp:160: error: nsIDOMMouseEvent was not declared in this scope
guxine.cpp:160: error: event was not declared in this scope
guxine.cpp:161: error: expected primary-expression before * token
guxine.cpp:161: error: browser was not declared in this scope
guxine.cpp:161: error: initializer expression list treated as compound expression
guxine.cpp:162: error: GtkMozEmbed was not declared in this scope
guxine.cpp:162: error: embed was not declared in this scope
guxine.cpp:162: error: nsIDOMMouseEvent was not declared in this scope
guxine.cpp:162: error: event was not declared in this scope
guxine.cpp:163: error: expected primary-expression before * token
guxine.cpp:163: error: browser was not declared in this scope
guxine.cpp:163: error: initializer expression list treated as compound expression
guxine.cpp:164: error: GtkMozEmbed was not declared in this scope
guxine.cpp:164: error: embed was not declared in this scope
guxine.cpp:164: error: nsIDOMMouseEvent was not declared in this scope
guxine.cpp:164: error: event was not declared in this scope
guxine.cpp:165: error: expected primary-expression before * token
guxine.cpp:165: error: browser was not declared in this scope
guxine.cpp:165: error: initializer expression list treated as compound expression
guxine.cpp:168: error: variable or field new_window_orphan_cb declared void
guxine.cpp:168: error: GtkMozEmbedSingle was not declared in this scope
guxine.cpp:168: error: embed was not declared in this scope
guxine.cpp:169: error: GtkMozEmbed was not declared in this scope
guxine.cpp:169: error: retval was not declared in this scope
guxine.cpp:169: error: expected primary-expression before chromemask
guxine.cpp:170: error: expected primary-expression before data
guxine.cpp:170: error: initializer expression list treated as compound expression
guxine.cpp: In function gboolean check_flash_flag(void*):
guxine.cpp:223: warning: unused variable time_elapsed
guxine.cpp: In function gboolean wait_for_time_period(void*):
guxine.cpp:241: warning: unused variable time_elapsed
guxine.cpp: In function void Helix_playnext(GXineStream*, TestGtkBrowser*):
guxine.cpp:299: error: GTK_MOZ_EMBED was not declared in this scope
guxine.cpp:299: error: gtk_moz_embed_load_url was not declared in this scope
guxine.cpp:302: error: GTK_MOZ_EMBED was not declared in this scope
guxine.cpp:302: error: gtk_moz_embed_load_url was not declared in this scope
guxine.cpp:317: error: GTK_MOZ_EMBED was not declared in this scope
guxine.cpp:317: error: gtk_moz_embed_load_url was not declared in this scope
guxine.cpp:373: error: GTK_MOZ_EMBED was not declared in this scope
guxine.cpp:373: error: gtk_moz_embed_load_url was not declared in this scope
guxine.cpp:395: error: GTK_MOZ_EMBED was not declared in this scope
guxine.cpp:395: error: gtk_moz_embed_load_url was not declared in this scope
guxine.cpp:429: error: GTK_MOZ_EMBED was not declared in this scope
guxine.cpp:429: error: gtk_moz_embed_load_url was not declared in this scope
guxine.cpp:462: error: GTK_MOZ_EMBED was not declared in this scope
guxine.cpp:462: error: gtk_moz_embed_load_url was not declared in this scope
guxine.cpp:465: error: GTK_MOZ_EMBED was not declared in this scope
guxine.cpp:465: error: gtk_moz_embed_load_url was not declared in this scope
guxine.cpp:475: error: GTK_MOZ_EMBED was not declared in this scope
guxine.cpp:475: error: gtk_moz_embed_load_url was not declared in this scope
guxine.cpp:504: error: GTK_MOZ_EMBED was not declared in this scope
guxine.cpp:504: error: gtk_moz_embed_load_url was not declared in this scope
guxine.cpp:281: warning: unused variable fp
guxine.cpp:282: warning: unused variable casetype
guxine.cpp: In function void guxine_create_main():
guxine.cpp:590: error: GTK_MOZ_EMBED_FLAG_DEFAULTCHROME was not declared in this scope
guxine.cpp:601: error: GTK_MOZ_EMBED was not declared in this scope
guxine.cpp:601: error: gtk_moz_embed_load_url was not declared in this scope
guxine.cpp:567: warning: unused variable size
guxine.cpp: In function int create_playlist(char*):
guxine.cpp:707: warning: unused variable tempslitcount
guxine.cpp:708: warning: unused variable buffer1
guxine.cpp:708: warning: unused variable temporarysplit
guxine.cpp: In function void remove_file(char*):
guxine.cpp:1080: warning: suggest parentheses around assignment used as truth value
guxine.cpp:1095: warning: suggest parentheses around assignment used as truth value
guxine.cpp:1077: warning: unused variable command2
guxine.cpp: In function gboolean presence_of_ctrlfile(char*):
guxine.cpp:1118: warning: suggest parentheses around assignment used as truth value
guxine.cpp: In function TestGtkBrowser* new_gtk_browser(guint32):
guxine.cpp:1151: error: GTK_MOZ_EMBED_FLAG_DEFAULTCHROME was not declared in this scope
guxine.cpp:1152: error: GTK_MOZ_EMBED_FLAG_ALLCHROME was not declared in this scope
guxine.cpp:1166: error: gtk_moz_embed_new was not declared in this scope
guxine.cpp:1232: error: GTK_MOZ_EMBED was not declared in this scope
guxine.cpp:1233: error: gtk_moz_embed_set_chrome_mask was not declared in this scope
guxine.cpp: In function void url_activate_cb(GtkEditable*, TestGtkBrowser*):
guxine.cpp:1280: error: GTK_MOZ_EMBED was not declared in this scope
guxine.cpp:1280: error: gtk_moz_embed_load_url was not declared in this scope
guxine.cpp: At global scope:
guxine.cpp:1310: error: variable or field load_started_cb declared void
guxine.cpp:1310: error: redefinition of int load_started_cb
guxine.cpp:133: error: int load_started_cb previously defined here
guxine.cpp:1310: error: GtkMozEmbed was not declared in this scope
guxine.cpp:1310: error: embed was not declared in this scope
guxine.cpp:1310: error: expected primary-expression before * token
guxine.cpp:1310: error: browser was not declared in this scope
guxine.cpp:1317: error: variable or field load_finished_cb declared void
guxine.cpp:1317: error: redefinition of int load_finished_cb
guxine.cpp:134: error: int load_finished_cb previously defined here
guxine.cpp:1317: error: GtkMozEmbed was not declared in this scope
guxine.cpp:1317: error: embed was not declared in this scope
guxine.cpp:1317: error: expected primary-expression before * token
guxine.cpp:1317: error: browser was not declared in this scope
guxine.cpp:1325: error: variable or field new_window_cb declared void
guxine.cpp:1325: error: redefinition of int new_window_cb
guxine.cpp:136: error: int new_window_cb previously defined here
guxine.cpp:1325: error: GtkMozEmbed was not declared in this scope
guxine.cpp:1325: error: embed was not declared in this scope
guxine.cpp:1325: error: GtkMozEmbed was not declared in this scope
guxine.cpp:1325: error: newEmbed was not declared in this scope
guxine.cpp:1325: error: expected primary-expression before chromemask
guxine.cpp:1325: error: expected primary-expression before * token
guxine.cpp:1325: error: browser was not declared in this scope
guxine.cpp:1336: error: variable or field visibility_cb declared void
guxine.cpp:1336: error: redefinition of int visibility_cb
guxine.cpp:139: error: int visibility_cb previously defined here
guxine.cpp:1336: error: GtkMozEmbed was not declared in this scope
guxine.cpp:1336: error: embed was not declared in this scope
guxine.cpp:1336: error: expected primary-expression before visibility
guxine.cpp:1336: error: expected primary-expression before * token
guxine.cpp:1336: error: browser was not declared in this scope
guxine.cpp:1343: error: variable or field destroy_brsr_cb declared void
guxine.cpp:1343: error: redefinition of int destroy_brsr_cb
guxine.cpp:142: error: int destroy_brsr_cb previously defined here
guxine.cpp:1343: error: GtkMozEmbed was not declared in this scope
guxine.cpp:1343: error: embed was not declared in this scope
guxine.cpp:1343: error: expected primary-expression before * token
guxine.cpp:1343: error: browser was not declared in this scope
guxine.cpp:1350: error: redefinition of gint open_uri_cb
guxine.cpp:143: error: gint open_uri_cb previously defined here
guxine.cpp:1350: error: GtkMozEmbed was not declared in this scope
guxine.cpp:1350: error: embed was not declared in this scope
guxine.cpp:1350: error: expected primary-expression before const
guxine.cpp:1350: error: expected primary-expression before * token
guxine.cpp:1350: error: browser was not declared in this scope
guxine.cpp:1380: error: variable or field size_to_cb declared void
guxine.cpp:1380: error: redefinition of int size_to_cb
guxine.cpp:145: error: int size_to_cb previously defined here
guxine.cpp:1380: error: GtkMozEmbed was not declared in this scope
guxine.cpp:1380: error: embed was not declared in this scope
guxine.cpp:1380: error: expected primary-expression before width
guxine.cpp:1380: error: expected primary-expression before height
guxine.cpp:1381: error: expected primary-expression before * token
guxine.cpp:1381: error: browser was not declared in this scope
guxine.cpp:1387: error: redefinition of gint dom_key_down_cb
guxine.cpp:147: error: gint dom_key_down_cb previously defined here
guxine.cpp:1387: error: GtkMozEmbed was not declared in this scope
guxine.cpp:1387: error: embed was not declared in this scope
guxine.cpp:1387: error: nsIDOMKeyEvent was not declared in this scope
guxine.cpp:1387: error: event was not declared in this scope
guxine.cpp:1388: error: expected primary-expression before * token
guxine.cpp:1388: error: browser was not declared in this scope
guxine.cpp:1397: error: redefinition of gint dom_key_press_cb
guxine.cpp:149: error: gint dom_key_press_cb previously defined here
guxine.cpp:1397: error: GtkMozEmbed was not declared in this scope
guxine.cpp:1397: error: embed was not declared in this scope
guxine.cpp:1397: error: nsIDOMKeyEvent was not declared in this scope
guxine.cpp:1397: error: event was not declared in this scope
guxine.cpp:1398: error: expected primary-expression before * token
guxine.cpp:1398: error: browser was not declared in this scope
guxine.cpp:1407: error: redefinition of gint dom_key_up_cb
guxine.cpp:151: error: gint dom_key_up_cb previously defined here
guxine.cpp:1407: error: GtkMozEmbed was not declared in this scope
guxine.cpp:1407: error: embed was not declared in this scope
guxine.cpp:1407: error: nsIDOMKeyEvent was not declared in this scope
guxine.cpp:1407: error: event was not declared in this scope
guxine.cpp:1408: error: expected primary-expression before * token
guxine.cpp:1408: error: browser was not declared in this scope
guxine.cpp:1417: error: redefinition of gint dom_mouse_down_cb
guxine.cpp:153: error: gint dom_mouse_down_cb previously defined here
guxine.cpp:1417: error: GtkMozEmbed was not declared in this scope
guxine.cpp:1417: error: embed was not declared in this scope
guxine.cpp:1417: error: nsIDOMMouseEvent was not declared in this scope
guxine.cpp:1417: error: event was not declared in this scope
guxine.cpp:1418: error: expected primary-expression before * token
guxine.cpp:1418: error: browser was not declared in this scope
guxine.cpp:1424: error: redefinition of gint dom_mouse_up_cb
guxine.cpp:155: error: gint dom_mouse_up_cb previously defined here
guxine.cpp:1424: error: GtkMozEmbed was not declared in this scope
guxine.cpp:1424: error: embed was not declared in this scope
guxine.cpp:1424: error: nsIDOMMouseEvent was not declared in this scope
guxine.cpp:1424: error: event was not declared in this scope
guxine.cpp:1425: error: expected primary-expression before * token
guxine.cpp:1425: error: browser was not declared in this scope
guxine.cpp:1431: error: redefinition of gint dom_mouse_click_cb
guxine.cpp:157: error: gint dom_mouse_click_cb previously defined here
guxine.cpp:1431: error: GtkMozEmbed was not declared in this scope
guxine.cpp:1431: error: embed was not declared in this scope
guxine.cpp:1431: error: nsIDOMMouseEvent was not declared in this scope
guxine.cpp:1431: error: event was not declared in this scope
guxine.cpp:1432: error: expected primary-expression before * token
guxine.cpp:1432: error: browser was not declared in this scope
guxine.cpp:1441: error: redefinition of gint dom_mouse_dbl_click_cb
guxine.cpp:159: error: gint dom_mouse_dbl_click_cb previously defined here
guxine.cpp:1441: error: GtkMozEmbed was not declared in this scope
guxine.cpp:1441: error: embed was not declared in this scope
guxine.cpp:1441: error: nsIDOMMouseEvent was not declared in this scope
guxine.cpp:1441: error: event was not declared in this scope
guxine.cpp:1442: error: expected primary-expression before * token
guxine.cpp:1442: error: browser was not declared in this scope
guxine.cpp:1448: error: redefinition of gint dom_mouse_over_cb
guxine.cpp:162: error: gint dom_mouse_over_cb previously defined here
guxine.cpp:1448: error: GtkMozEmbed was not declared in this scope
guxine.cpp:1448: error: embed was not declared in this scope
guxine.cpp:1448: error: nsIDOMMouseEvent was not declared in this scope
guxine.cpp:1448: error: event was not declared in this scope
guxine.cpp:1449: error: expected primary-expression before * token
guxine.cpp:1449: error: browser was not declared in this scope
guxine.cpp:1455: error: redefinition of gint dom_mouse_out_cb
guxine.cpp:164: error: gint dom_mouse_out_cb previously defined here
guxine.cpp:1455: error: GtkMozEmbed was not declared in this scope
guxine.cpp:1455: error: embed was not declared in this scope
guxine.cpp:1455: error: nsIDOMMouseEvent was not declared in this scope
guxine.cpp:1455: error: event was not declared in this scope
guxine.cpp:1456: error: expected primary-expression before * token
guxine.cpp:1456: error: browser was not declared in this scope
guxine.cpp:1462: error: variable or field new_window_orphan_cb declared void
guxine.cpp:1462: error: redefinition of int new_window_orphan_cb
guxine.cpp:168: error: int new_window_orphan_cb previously defined here
guxine.cpp:1462: error: GtkMozEmbedSingle was not declared in this scope
guxine.cpp:1462: error: embed was not declared in this scope
guxine.cpp:1463: error: GtkMozEmbed was not declared in this scope
guxine.cpp:1463: error: retval was not declared in this scope
guxine.cpp:1463: error: expected primary-expression before chromemask
guxine.cpp:1464: error: expected primary-expression before data
guxine.cpp: In function void case3(playlist_info*):
guxine.cpp:1559: warning: unused variable height3
guxine.cpp: In function void case4(playlist_info*):
guxine.cpp:1601: warning: unused variable width4
guxine.cpp: In function void flash_case3(playlist_info*):
guxine.cpp:1758: warning: unused variable width1
guxine.cpp: In function void update_stats(playlist_info*):
guxine.cpp:1874: warning: unused variable time_now
guxine.cpp:1877: warning: unused variable len
guxine.cpp: In function void get_playlist():
guxine.cpp:1902: warning: unused variable nod_ip
guxine.cpp:1902: warning: unused variable buffer
guxine.cpp: At global scope:
guxine.cpp:74: warning: defaultfile defined but not used
guxine.cpp:168: warning: new_window_orphan_cb defined but not used
make[2]: *** [guxine.o] Error 1
make[2]: Leaving directory `/root/EKIGA-CVS/GTK/mygtkxine/src'
make[1]: *** [all-recursive] Error 1
make[1]: Leaving directory `/root/EKIGA-CVS/GTK/mygtkxine'
make: *** [all] Error 2